0.000320955849019811 0.00681718438863754 
0.00027543306350708 0.00431129662320018 
0.000259154010564089 0.00192314386367798 
0.000308578135445714 0.000713322311639786 
0.000360721140168607 -0.00198888638988137 
0.000479335954878479 -0.0052795996889472 
0.000647435255814344 -0.00991216488182545 
0.000962548772804439 -0.0163198318332434 
0.00140180601738393 -0.0224744081497192 
0.00199994654394686 -0.0285181608051062 
0.00271531753242016 -0.0346026346087456 
0.00348834856413305 -0.0405513718724251 
0.00428721960633993 -0.0465585738420486 
0.00503349117934704 -0.0505339540541172 
0.00581216067075729 -0.0496110394597054 
0.00679291412234306 -0.0464966520667076 
0.00770269706845284 -0.0389200262725353 
0.008408447727561 -0.0331208258867264 
0.00861575920134783 -0.0261784754693508 
0.00857372488826513 -0.0201220437884331 
0.00839407742023468 -0.0161781795322895 
0.00811562314629555 -0.0127986315637827 
0.00780519703403115 -0.0110114337876439 
0.00743583310395479 -0.00895922444760799 
0.00709764426574111 -0.00772475125268102 
0.00677340570837259 -0.0078854002058506 
0.00648345565423369 -0.00739346304908395 
0.0062138601206243 -0.00645295111462474 
0.00597961898893118 -0.00593178905546665 
0.00573196820914745 -0.00589640531688929 
0.00546040153130889 -0.00602265307679772 
0.00518838549032807 -0.00523242680355906 
0.00495614018291235 -0.00517597934231162 
0.00474217627197504 -0.00480714021250606 
0.00453703245148063 -0.00519318832084537 
0.00430020177736878 -0.00428293272852898 
0.00405890867114067 -0.00406688777729869 
0.00384981208480895 -0.00329324253834784 
0.00377319334074855 -0.00328493816778064 
0.00378046464174986 -0.00365375634282827 
0.00384000712074339 -0.00377802923321724 
0.00392298679798841 -0.00408600270748138 
0.00407307222485542 -0.0036361082457006 
0.00430981302633882 -0.00466896640136838 
0.00458579324185848 -0.00454592239111662 
0.00493702851235867 -0.00568335177376866 
0.0053282119333744 -0.00539337564259768 
0.00577430007979274 -0.00566993746906519 
0.00624824920669198 -0.00546828005462885 
0.00670916587114334 -0.00402926281094551 
0.00715335598215461 -0.00284622679464519 
0.00756748905405402 -0.00257098022848368 
0.00796692539006472 -0.00219832803122699 
0.00834949593991041 -0.00183231465052813 
0.00876488350331783 -0.000709609128534794 
0.00920213386416435 -0.000176158166141249 
0.00965757574886084 -7.84449148341082e-05 
0.0101292477920651 0.000473032705485821 
0.0106127709150314 0.000380462006432936 
0.0111067527905107 -7.0654961746186e-05 
0.0115498146042228 -0.000811804900877178 
0.0120245739817619 -0.00209545227698982 
0.0125377662479877 -0.00172260857652873 
0.0131259597837925 -0.00364714465104043 
0.0137751623988152 -0.0044465227983892 
0.0145676834508777 -0.00539811188355088 
0.0154797350987792 -0.00425698375329375 
0.0165523644536734 -0.00459332298487425 
0.0176767688244581 -0.00684570195153356 
0.0189068112522364 -0.00818071514368057 
0.0200527217239141 -0.00920123048126698 
0.0211544744670391 -0.00871082302182913 
0.0220458619296551 -0.00906581897288561 
0.0226843655109406 -0.00842574425041676 
0.0229157935827971 -0.00817696563899517 
0.0226737856864929 -0.0076567605137825 
0.0220981575548649 -0.00672777416184545 
0.0211956184357405 -0.00783165544271469 
0.0202013347297907 -0.00685070222243667 
0.0191919710487127 -0.00682423450052738 
0.0183212477713823 -0.00561482645571232 
0.0175703074783087 -0.00570967933163047 
0.0169891119003296 -0.00485390471294522 
0.0165896043181419 -0.00341604766435921 
0.0163673423230648 -0.00284126470796764 
0.0162509139627218 -0.00472370302304626 
0.0161842536181211 -0.0058784275315702 
0.0162327475845814 -0.00772277312353253 
0.0163391623646021 -0.00766049325466156 
0.01655163615942 -0.00805716402828693 
0.0167875196784735 -0.00892685819417238 
0.0171603262424469 -0.0104736220091581 
0.0177313797175884 -0.0105638857930899 
0.0187067221850157 -0.012325394898653 
0.0205124225467443 -0.0147422235459089 
0.0240907501429319 -0.0209118947386742 
0.0307767782360315 -0.0301104746758938 
0.0421273969113827 -0.0461135730147362 
0.0590739585459232 -0.0645748227834702 
0.0814704746007919 -0.0607938878238201 
0.107481017708778 -0.0482807233929634 
0.134075492620468 -0.0330634973943233 
0.157466128468513 -0.0283632501959801 
0.175673812627792 -0.0362369753420353 
0.187920525670052 -0.0307523813098669 
0.195418402552605 -0.0472860895097256 
0.198972329497337 -0.0374254547059536 
0.200688377022743 -0.0343844033777714 
0.200502455234528 -0.0328665673732758 
0.198630407452583 -0.035744734108448 
0.195487380027771 -0.0467935502529144 
0.191839426755905 -0.0250972341746092 
0.188201203942299 -0.0325468778610229 
0.184624373912811 -0.0341033414006233 
0.181012287735939 -0.0559625811874866 
0.178108602762222 -0.0675639510154724 
0.174974158406258 -0.0666158869862556 
0.171633809804916 -0.0560815557837486 
0.168528184294701 -0.0459537468850613 
0.165062472224236 -0.0400361716747284 
0.16179496049881 -0.0343165099620819 
0.158061861991882 -0.0228947028517723 
0.15409043431282 -0.0290761273354292 
0.150269627571106 -0.0430275686085224 
0.146501779556274 -0.0394853614270687 
0.142697855830193 -0.0340737663209438 
0.138497158885002 -0.0210964400321245 
0.133923187851906 -0.0144640170037746 
0.129507318139076 0.00853594299405813 
0.125140264630318 0.0193529613316059 
0.120234414935112 0.0312080141156912 
0.115297265350819 0.0433316119015217 
0.110212907195091 0.0594562999904156 
0.105451032519341 0.0749501138925552 
0.100343428552151 0.079102098941803 
0.095449261367321 0.100923269987106 
0.0904373005032539 0.116345018148422 
0.0855754688382149 0.138560637831688 
0.0802493989467621 0.156836569309235 
0.0749718546867371 0.181849792599678 
0.0697227269411087 0.196075707674026 
0.0643981099128723 0.212930545210838 
0.0585847832262516 0.219975024461746 
0.0525552667677402 0.230517789721489 
0.0467824265360832 0.23225499689579 
0.0413036979734898 0.237209931015968 
0.0360952392220497 0.241928294301033 
0.0311469789594412 0.239810928702354 
0.0266067069023848 0.232411727309227 
0.0223662238568068 0.217581957578659 
0.0185075700283051 0.200661569833755 
0.0150692341849208 0.18115396797657 
0.0121004423126578 0.162608981132507 
0.00948989391326904 0.142828941345215 
0.00730042438954115 0.120779775083065 
0.0054512438364327 0.0986436083912849 
0.00404694862663746 0.076152577996254 
0.00294393231160939 0.057162169367075 
0.00218579219654202 0.0411812104284763 
0.00155840022489429 0.0288427677005529 
0.0011049018939957 0.0182988345623016 
0.000757710891775787 0.0118372086435556 
0.000568350544199347 0.00728691415861249 
0.000475359673146158 0.00437263259664178 
0.000436353002442047 0.00171476404648274 
0.000415388436522335 0.00036386153078638 
0.000339646852808073 0.000256024155532941 
0.000282656692434102 0.000207410688744858 
0.000223815222852863 0.00031029456295073 
0.000227600234211423 -0.000136743430630304 
0.000203163581318222 -0.000502190552651882 
0.000162462340085767 -0.000661249971017241 
0.000105547442217357 -0.000466207973659039 
9.10985836526379e-05 -0.000134350848384202 
8.55371545185335e-05 -0.000117573821626138 
7.88283359725028e-05 0.000546289200428873 
7.3597788286861e-05 0.000947316468227655 
6.9401939981617e-05 0.000862474727910012 
7.15386122465134e-05 0.000633722345810384 
5.4333566367859e-05 0.000274126301519573 
5.23565868206788e-05 0.000809870194643736 
3.54969015461393e-05 0.000969742308370769 
4.66659039375372e-05 0.000561028951779008 
1.35432346723974e-05 0.00116314028855413 
2.65285325440345e-05 0.00124787457752973 
