0.00117773690726608 -0.000725727237295359 
0.001304030418396 -0.00606129225343466 
0.00161665654741228 -0.0134500116109848 
0.00220181723125279 -0.0206114053726196 
0.00344133959151804 -0.03216153383255 
0.00540191447362304 -0.0476535893976688 
0.00823024846613407 -0.067080982029438 
0.0119321132078767 -0.0922462493181229 
0.0167541038244963 -0.117133125662804 
0.0226313099265099 -0.150897011160851 
0.0296940505504608 -0.18985490500927 
0.037511371076107 -0.226997748017311 
0.0457897447049618 -0.249569088220596 
0.0538501776754856 -0.256268858909607 
0.06259486079216 -0.236123949289322 
0.07314682751894 -0.198333084583282 
0.0841424465179443 -0.150390714406967 
0.0934932678937912 -0.112477712333202 
0.100187405943871 -0.0906671807169914 
0.105855688452721 -0.0641832798719406 
0.111576490104198 -0.0415933318436146 
0.117112122476101 -0.0176471471786499 
0.12193600833416 0.00370248430408537 
0.126046702265739 0.0164558570832014 
0.129752159118652 0.0234270300716162 
0.13336543738842 0.0166745129972696 
0.136845275759697 0.0127198053523898 
0.140471011400223 0.0286722723394632 
0.143949151039124 0.0312951654195786 
0.147656723856926 0.0320847742259502 
0.151013731956482 0.0251679662615061 
0.154225721955299 0.0278705805540085 
0.15670882165432 0.0267170965671539 
0.158767729997635 0.0231541637331247 
0.160372033715248 0.0267388410866261 
0.161922127008438 0.0402759201824665 
0.163422048091888 0.0493315197527409 
0.164972171187401 0.0544224046170712 
0.166521489620209 0.0558318495750427 
0.167600318789482 0.0515594333410263 
0.168348863720894 0.0437551997601986 
0.168451964855194 0.0369304716587067 
0.167871609330177 0.0371855944395065 
0.166856557130814 0.0339537672698498 
0.165340632200241 0.0279006324708462 
0.163732931017876 0.0100226532667875 
0.161818191409111 0.00680047506466508 
0.159353092312813 -0.00752441771328449 
0.156381234526634 -0.00815367978066206 
0.153234362602234 -0.0101629011332989 
0.149672046303749 0.00336314016021788 
0.146109253168106 0.00186409684829414 
0.14193457365036 0.00504680024459958 
0.137724280357361 0.00235477066598833 
0.132361814379692 0.00847816932946444 
0.126570284366608 0.0113954124972224 
0.120456501841545 0.0127905989065766 
0.114838965237141 0.0121590672060847 
0.109217800199986 0.0119751319289207 
0.103364951908588 0.00650809844955802 
0.0973909273743629 0.0090361749753356 
0.0913433209061623 0.00142930168658495 
0.0857395604252815 0.0104480590671301 
0.0800899043679237 0.00725822011008859 
0.0742500051856041 0.00935283582657576 
0.0682050138711929 0.00147027708590031 
0.0622643679380417 0.00523086404427886 
0.0568132288753986 0.00397208007052541 
0.0519125610589981 0.00130516802892089 
0.047775037586689 -0.00227279239334166 
0.044235460460186 -0.0031849613878876 
0.0412160493433475 -0.00293842307291925 
0.0385546050965786 -0.00440936908125877 
0.0362410806119442 -0.00477427709847689 
0.034245777875185 -0.00582065153867006 
0.032502893358469 -0.00782024953514338 
0.0310401916503906 -0.00947637110948563 
0.0296928882598877 -0.0121610285714269 
0.0284388177096844 -0.0121786743402481 
0.0272653419524431 -0.012455171905458 
0.0261338409036398 -0.00877074059098959 
0.0250288173556328 -0.00893502775579691 
0.0238939076662064 -0.00869290251284838 
0.0228310972452164 -0.00906103197485209 
0.0218184348195791 -0.00798889901489019 
0.0207654796540737 -0.0079208891838789 
0.0196832958608866 -0.00685710087418556 
0.0187180414795876 -0.00546265672892332 
0.0178573988378048 -0.00415648613125086 
0.0172044187784195 -0.00405878713354468 
0.016605656594038 -0.00580956833437085 
0.0161756295710802 -0.00844871066510677 
0.0157911218702793 -0.00725540425628424 
0.0154922213405371 -0.00716126337647438 
0.0152752827852964 -0.00497915549203753 
0.0151564935222268 -0.00627624941989779 
0.0151735134422779 -0.00635010004043579 
0.0152123002335429 -0.00736374454572797 
0.0153005300089717 -0.00692943716421723 
0.0154269766062498 -0.00524111092090607 
0.0156718343496323 -0.00457652006298304 
0.0160006806254387 -0.00456232205033302 
0.0162470117211342 -0.00454968307167292 
0.0164796970784664 -0.00492677139118314 
0.0166062135249376 -0.00366808380931616 
0.0167140960693359 -0.00420801248401403 
0.016701428219676 -0.0026328160893172 
0.0166694298386574 -0.00266108359210193 
0.0166222080588341 -0.00216103415004909 
0.0164919644594193 -0.00266538304276764 
0.0163372326642275 -0.00187408342026174 
0.0162162408232689 1.46616293932311e-05 
0.0161354336887598 0.000869647890795022 
0.0160780195146799 0.000557351566385478 
0.0159928221255541 -0.000149554791278206 
0.0160256717354059 5.37243540748022e-05 
0.016014289110899 0.00167052773758769 
0.0159999970346689 0.00331105734221637 
0.0159448049962521 0.00517800031229854 
0.0158676430583 0.00511937029659748 
0.0157415196299553 0.00608312804251909 
0.0155877228826284 0.00594183104112744 
0.0153662264347076 0.00626491289585829 
0.0151883875951171 0.00557128852233291 
0.0149454930797219 0.00700208963826299 
0.0147004844620824 0.00878792908042669 
0.0143326967954636 0.0100506460294127 
0.0139793073758483 0.0119881285354495 
0.0136018833145499 0.0143689084798098 
0.0132334493100643 0.0177513398230076 
0.0126821864396334 0.0192729327827692 
0.0121723506599665 0.0237184762954712 
0.0115268509835005 0.0273043215274811 
0.0109990518540144 0.0322803147137165 
0.0103724421933293 0.0341969691216946 
0.00975248496979475 0.0389660447835922 
0.00904752407222986 0.0405617766082287 
0.0083409296348691 0.0432836040854454 
0.00768503174185753 0.0437588356435299 
0.00700792577117682 0.0476666390895844 
0.00628475658595562 0.0474381744861603 
0.00546264881268144 0.0475768074393272 
0.00465914700180292 0.0440835990011692 
0.00390545651316643 0.0415259972214699 
0.00319976080209017 0.0380287952721119 
0.00260747061111033 0.0346490778028965 
0.00211113877594471 0.0316735953092575 
0.00169331429060549 0.025512833148241 
0.00131442840211093 0.0201827473938465 
0.000898520986083895 0.0135746346786618 
0.000677001662552357 0.00931458827108145 
0.000527900061570108 0.00496129831299186 
0.000463839445728809 0.00273601477965713 
0.000423970108386129 -0.000791096943430603 
0.000287677656160668 -0.00215831771492958 
0.000168369660968892 -0.00362858292646706 
8.79809449543245e-05 -0.0027599991299212 
3.15322904498316e-05 -0.00297396536916494 
-8.47667706693755e-06 -0.00321721960790455 
-5.57604616915341e-05 -0.00343062705360353 
1.38640752993524e-05 -0.00380754144862294 
0.000103428283182438 -0.00337176909670234 
0.000122102399473079 -0.00275789084844291 
5.70122210774571e-05 -0.00202818354591727 
-1.21512111945776e-05 -0.00149024091660976 
-8.67330891196616e-05 -0.000748066522646695 
-7.43840719223954e-05 -0.000391177221899852 
-2.04726038646186e-05 -0.000822531234007329 
1.77559286385076e-05 -0.00155993190128356 
-2.1018222469138e-05 -0.002235799562186 
-3.9871214539744e-05 -0.00225792615674436 
6.99882684784825e-06 -0.00279278191737831 
6.61595913697965e-05 -0.00265944027341902 
6.26937617198564e-05 -0.00269318628124893 
5.02380244142842e-05 -0.0026983730494976 
2.5004796043504e-05 -0.00164903001859784 
2.92993263428798e-06 -0.000972422305494547 
-3.07069203699939e-05 -0.00019967406115029 
-3.99028831452597e-05 -0.00105635065119714 
-8.15517887531314e-06 -0.00149490346666425 
2.62100584222935e-05 -0.00168952334206551 
3.9667898818152e-05 -0.00156162690836936 
2.23904935410246e-05 -0.00205630762502551 
1.58118637045845e-05 -0.0022161160595715 
2.96375565085327e-05 -0.00275339349173009 
