[
  {
    "color": [
      1,
      1,
      1
    ],
    "ignore_ext_mv": false,
    "intensity_diff": 30,
    "intensity_spec": 0,
    "ltc_two_sided": true,
    "name": "key",
    "onnoff": true,
    "rel_rot": [
      0.086926937103271484,
      -0.18043102324008942,
      0
    ],
    "rel_scale": [
      1,
      1
    ],
    "rel_trans": [
      -1.2514324188232422,
      -0.6077226996421814,
      6.8603620529174805
    ],
    "shadow_cast": true,
    "type": "AREA"
  },
  {
    "color": [
      0.65344494581222534,
      0.65344196557998657,
      0.65344196557998657
    ],
    "ignore_ext_mv": true,
    "intensity_diff": 10,
    "intensity_spec": 50,
    "ltc_two_sided": true,
    "name": "fill",
    "onnoff": false,
    "rel_rot": [
      -0.66703957319259644,
      -1.8112802505493164,
      5
    ],
    "rel_scale": [
      2,
      2
    ],
    "rel_trans": [
      -4.5782361030578613,
      3.7119362354278564,
      -1.122719407081604
    ],
    "shadow_cast": false,
    "type": "AREA"
  },
  {
    "color": [
      0.73620951175689697,
      0.73620617389678955,
      0.73620617389678955
    ],
    "ignore_ext_mv": false,
    "intensity_diff": 10,
    "intensity_spec": 0,
    "ltc_two_sided": true,
    "name": "back",
    "onnoff": false,
    "rel_rot": [
      -0.33537542819976807,
      -1.0651962757110596,
      0
    ],
    "rel_scale": [
      1,
      1
    ],
    "rel_trans": [
      -2.4784219264984131,
      0.98737025260925293,
      1.3720451593399048
    ],
    "shadow_cast": false,
    "type": "POINT"
  }
]
