0 0 0 0 
0 0 0 0 
0 0 0 0 
0 0 0 0 
0 0 0 0 
0 0 0 0 
0 0 0 0 
0 0 0 0 
0 0 0 0 
0 0 0 0 
-0.000727858277969062 -1.25475833101518e-06 -2.42400619754335e-06 -1.49834829699103e-06 
-0.000646719126962125 -1.26059728700056e-06 -2.31709395848156e-06 -1.60782906277745e-06 
-0.00053054717136547 -2.09424410968495e-06 -2.39087194131571e-06 -1.84319060281268e-06 
-0.00014598056441173 -3.48319622389681e-06 -2.6919049105345e-06 -2.2496142264572e-06 
0.000875549449119717 -5.36258903593989e-06 -3.20466870107339e-06 -2.61856325778353e-06 
0.00242188363336027 -6.72153237246675e-06 -3.58228317054454e-06 -2.79752612186712e-06 
0.00414468348026276 -7.20928983355407e-06 -3.81312611352769e-06 -2.81942561741744e-06 
0.00585555797442794 -6.79365530231735e-06 -3.71627788808837e-06 -2.68474332187907e-06 
0.00724701210856438 -5.32567673872109e-06 -3.33882712766354e-06 -2.31043054554902e-06 
0.00790448114275932 -3.3552114473423e-06 -2.7156952455698e-06 -1.98170823750843e-06 
0.00794209912419319 -1.81797474851919e-06 -2.27911482397758e-06 -1.78451000465429e-06 
0.00770377879962325 -8.8838476131059e-07 -1.99193459593516e-06 -1.66077484209382e-06 
0.00734760705381632 -4.50227560122585e-07 -1.85260864782322e-06 -1.57486306306964e-06 
0.00695853913202882 -3.49112553976738e-07 -1.70433713719831e-06 -1.51675988036004e-06 
0.00659202365204692 -3.43700577332129e-07 -1.67437644904567e-06 -1.45510762195045e-06 
0.00626008864492178 -3.81743149091562e-07 -1.64965183557797e-06 -1.40403176374093e-06 
0.00596625963225961 -4.89602484776697e-07 -1.64035350280756e-06 -1.37119695864385e-06 
0.00571106234565377 -5.96249492446077e-07 -1.67220503044518e-06 -1.35344623686251e-06 
0.00547978281974792 -5.6739133924566e-07 -1.76717878730415e-06 -1.30451689983602e-06 
0.00525665050372481 -4.14994872244279e-07 -1.76931621354015e-06 -1.26466500205424e-06 
0.00503671867772937 -2.77818998029034e-07 -1.79699770797015e-06 -1.2603089771801e-06 
0.00480587501078844 -1.7361340098887e-07 -1.86628562914848e-06 -1.27916314340837e-06 
0.00455944566056132 -6.68630093514366e-08 -1.93756227417907e-06 -1.30885314320039e-06 
0.00427588261663914 -7.83176119512063e-08 -2.124970933437e-06 -1.44165096571669e-06 
0.00394643424078822 -3.0574046405718e-08 -2.47054981628025e-06 -1.61634341111494e-06 
0.00363887497223914 -1.08113304975177e-07 -2.68110488832463e-06 -1.71648116520373e-06 
0.00341425789520144 -4.92183502842636e-08 -2.73952718998771e-06 -1.7308724409304e-06 
0.00328311580233276 4.22243262576671e-09 -2.69114502771117e-06 -1.66962399816839e-06 
0.00325555447489023 1.21439569511494e-07 -2.50392645284592e-06 -1.54996041601407e-06 
0.00334339775145054 1.96141087371871e-07 -2.20013771468075e-06 -1.33510991418007e-06 
0.00349649204872549 3.12795123136311e-07 -1.94051312973897e-06 -1.14457020572445e-06 
0.00365245947614312 3.16980049319682e-07 -1.75523189227533e-06 -1.0335068054701e-06 
0.00382813159376383 2.87657286435206e-07 -1.58180807829922e-06 -1.01151169928926e-06 
0.00405215146020055 2.48721477191793e-07 -1.4109430139797e-06 -1.00927150015195e-06 
0.00432292278856039 6.93685322517013e-08 -1.14673059670167e-06 -1.02603019058733e-06 
0.00464695412665606 -2.86937194005077e-08 -7.80237883191148e-07 -1.06249592590757e-06 
0.00503653846681118 -2.64687969320221e-07 -2.75307172614703e-07 -1.09883785626153e-06 
0.00546317687258124 -4.94685991725419e-07 4.34112564562383e-07 -1.09170593987074e-06 
0.00590041233226657 -7.35051685296639e-07 1.25043493426347e-06 -1.06601066818257e-06 
0.00634483527392149 -9.48619742757728e-07 2.17430579141364e-06 -1.06510094610712e-06 
0.00674190511927009 -1.27453120057908e-06 3.1280837902159e-06 -1.03930801742536e-06 
0.00708487490192056 -1.37326628646406e-06 4.01755596612929e-06 -9.82465849119762e-07 
0.0073975189588964 -1.72485408711509e-06 4.76400555271539e-06 -8.68123606778681e-07 
0.00769597804173827 -2.12033683055779e-06 5.43989926882205e-06 -7.58022622449062e-07 
0.00798556208610535 -2.69312727141369e-06 5.99816848989576e-06 -6.48252239443536e-07 
0.00829632207751274 -3.15890770252736e-06 6.3802913246036e-06 -6.08713946803618e-07 
0.00864467397332191 -3.6469111819315e-06 6.75591854815139e-06 -5.15277690738003e-07 
0.00902519561350346 -4.04203592552221e-06 7.05448564986e-06 -5.2879272516293e-07 
0.00942021701484919 -4.30310910815024e-06 7.27800397726241e-06 -5.84423162308667e-07 
0.00984748918563128 -4.31082480645273e-06 7.37852678867057e-06 -7.0849591793376e-07 
0.0103230914101005 -4.46277226728853e-06 7.55562268750509e-06 -7.76515605593886e-07 
0.0108476551249623 -4.56765747003374e-06 7.66159882914508e-06 -1.00823785942339e-06 
0.011422349140048 -4.53640404884936e-06 7.79867423261749e-06 -1.13653561584215e-06 
0.0121032111346722 -4.31632179243024e-06 7.8794755609124e-06 -1.25406529605243e-06 
0.0128869963809848 -4.1604544094298e-06 7.92234186519636e-06 -1.22540620850486e-06 
0.0137872034683824 -3.73832608602243e-06 7.9680703493068e-06 -1.2790535492968e-06 
0.0148009825497866 -3.34866081175278e-06 8.04404771770351e-06 -1.24292057535058e-06 
0.0159028954803944 -2.93089510705613e-06 8.04816045274492e-06 -1.33973446736491e-06 
0.0170660726726055 -2.90871548713767e-06 8.14613667898811e-06 -1.33826836190565e-06 
0.0182667206972837 -2.80219228443457e-06 8.17492127680453e-06 -1.41079851800896e-06 
0.0194274671375751 -2.63074866779789e-06 8.1041180237662e-06 -1.3179742381908e-06 
0.0205038171261549 -2.69675456365803e-06 7.92278660810553e-06 -1.32155344090279e-06 
0.0213958155363798 -2.65672656496463e-06 7.9861811173032e-06 -1.11116560219671e-06 
0.0219668764621019 -2.72125475930807e-06 7.57822772357031e-06 -1.0363678484282e-06 
0.0221838671714067 -2.71587782663119e-06 7.59261911298381e-06 -1.03511297311343e-06 
0.0220191217958927 -2.82831274489581e-06 7.67947949498193e-06 -1.0839054311873e-06 
0.0214844904839993 -2.57154579230701e-06 7.85221436672146e-06 -8.66026482526649e-07 
0.0206835251301527 -2.53109215009317e-06 7.83796895120759e-06 -9.23263428376231e-07 
0.0196968801319599 -2.27961345444783e-06 8.20068817120045e-06 -7.74006480241951e-07 
0.0186606347560883 -2.55389295489294e-06 8.22171386971604e-06 -5.94336427184317e-07 
0.0176245737820864 -2.43748968387081e-06 7.93537583376747e-06 -4.80892992982263e-07 
0.0167341381311417 -2.70289615400543e-06 7.73361534811556e-06 -5.89569424391811e-07 
0.0159766543656588 -3.03391175293655e-06 7.35129833628889e-06 -5.113388965583e-07 
0.0154655873775482 -3.41351596944151e-06 6.95548351359321e-06 -5.03768433190999e-07 
0.0151180615648627 -3.62003129339428e-06 6.90761544319685e-06 -5.48013986190199e-07 
0.0149757545441389 -3.97529856854817e-06 6.87232432028395e-06 -5.98079054725531e-07 
0.014897727407515 -4.00531098421197e-06 6.43735938865575e-06 -5.51882578747609e-07 
0.014957663603127 -3.85469684260897e-06 6.34977550362237e-06 -4.85973657760042e-07 
0.0150482254102826 -3.52391271007946e-06 6.23720825387863e-06 -4.90310981149378e-07 
0.0151923485100269 -3.0557914669771e-06 5.67493680136977e-06 -4.20121494926207e-07 
0.0154255451634526 -2.56531711784191e-06 5.43893065696466e-06 -3.50837154883266e-07 
0.0158036462962627 -2.17885849451704e-06 5.2232680900488e-06 -4.71180044314679e-07 
0.0164183638989925 -1.50751645833225e-06 4.69041015094263e-06 -5.06294668412011e-07 
0.0176221765577793 -8.34991681131214e-07 4.0808863559505e-06 -6.39979703009885e-07 
0.0199423041194677 5.53846859929763e-07 3.40806263920967e-06 -7.69415123613726e-07 
0.0243006590753794 1.80592610377062e-06 2.05551214094157e-06 -1.08208087112871e-06 
0.0318203419446945 3.10047539642255e-06 4.94593223265838e-07 -1.56941553086654e-06 
0.043619554489851 3.9902192838781e-06 -8.89274872406531e-07 -1.49645427427458e-06 
0.0600198097527027 3.22780260830768e-06 -2.18655827666225e-06 -2.00650333681551e-06 
0.0806354507803917 2.94339020001644e-06 -3.95521010432276e-06 -2.01426837520557e-06 
0.103669516742229 3.24747566082806e-06 -5.08564153278712e-06 -1.56339922341431e-06 
0.127152606844902 2.60935939877527e-06 -4.8415254241263e-06 9.65571871347493e-07 
0.148584812879562 -8.94661980055389e-07 -4.35720630775904e-06 4.85076839140675e-07 
0.166006967425346 -8.07582978268329e-08 -2.85753185380599e-06 1.26717861803627e-06 
0.178787067532539 -3.1619545097783e-06 -2.21161781155388e-06 2.05544574782834e-06 
0.187316954135895 -7.96213316789363e-06 -2.08247524824401e-06 2.27840882871533e-06 
0.191930219531059 -6.43835846858565e-06 -2.20414290197368e-06 1.35194693484664e-06 
0.193487241864204 -6.7535156631493e-06 -1.10121868601709e-06 2.40480471802584e-06 
0.193448752164841 -7.82501592766494e-06 -2.99237150613862e-08 2.6481557142688e-06 
0.191749677062035 -5.83967130296514e-06 -1.52220286508964e-06 2.62266917161469e-06 
0.189073443412781 -7.82630650064675e-06 1.85882697678608e-06 1.75077843778126e-06 
0.185864344239235 -1.35257059810101e-05 1.98702491616132e-06 2.33558830586844e-06 
0.182671800255775 -1.57980866788421e-05 2.11716246667493e-06 3.37085907631263e-06 
0.179335966706276 -1.96648052224191e-05 -8.12434777230919e-08 4.22506218455965e-06 
0.176294416189194 -2.19806424865965e-05 2.38361076299043e-06 5.37085816176841e-06 
0.173521116375923 -1.9998415154987e-05 2.14096729678204e-07 6.27412055109744e-06 
0.170865163207054 -1.72394011315191e-05 2.88754193888963e-07 5.68591167393606e-06 
0.168422400951385 -1.34650163090555e-05 -3.12668294100149e-06 2.42275632444944e-06 
0.16558600962162 -6.21440813119989e-06 -3.95703455069452e-06 9.24853168271511e-07 
0.162834212183952 -2.73426758212736e-06 -5.66850485483883e-06 -2.8951737931493e-06 
0.160053804516792 4.24567269874387e-06 -7.73483225202654e-06 -3.3015660392266e-06 
0.156778588891029 5.66200287721585e-06 -7.59491740609519e-06 -3.467786427791e-06 
0.152827322483063 7.39217057343922e-06 -6.10104825682356e-06 -2.52670793088328e-06 
0.149326309561729 6.77120260661468e-06 -6.90073557052528e-06 -3.53051268575655e-06 
0.145401105284691 9.81774610409047e-06 -5.70862812310224e-06 -2.86043723463081e-06 
0.141028493642807 1.00997367553646e-05 -4.41729616795783e-06 -2.29264514928218e-06 
0.136993616819382 1.27466764752171e-05 -2.85920987153077e-06 -2.76547802968707e-06 
0.133199915289879 1.47386417665984e-05 -1.38382279146754e-06 -2.29496481551905e-06 
0.129208788275719 1.59961236931849e-05 1.99247097043553e-06 -1.09833456463093e-06 
0.125235795974731 1.48577655636473e-05 3.85171097150305e-06 -1.21002221931121e-06 
0.121184565126896 1.49042916746112e-05 5.76731963519705e-06 -2.81031361737405e-06 
0.117296010255814 1.31293136291788e-05 7.25763766240561e-06 -3.32544027514814e-06 
0.113339155912399 1.06547586256056e-05 6.99987776897615e-06 -3.14174735649431e-06 
0.109626390039921 8.20612513052765e-06 8.36094477563165e-06 -2.39039809457608e-06 
0.106261968612671 7.10341964804684e-06 7.91540514910594e-06 -1.18334764920291e-06 
0.10318748652935 3.27998668581131e-06 7.55187238610233e-06 -9.91010210782406e-07 
0.0999540239572525 2.94551023216627e-06 5.38384756509913e-06 -1.35305924686691e-06 
0.0967999249696732 4.02060868509579e-06 5.14229031978175e-06 -2.22932294491329e-06 
0.0934151262044907 3.32065314978536e-06 2.92339314000856e-06 -3.18793445330812e-06 
0.0898278281092644 2.59560169979522e-06 1.93686992133735e-06 -2.73377509074635e-06 
0.086415596306324 1.31062392938475e-06 1.33241462663136e-06 -2.70458690465603e-06 
0.0829681530594826 -3.39119105774444e-06 3.06568637142846e-07 -3.23638664667669e-06 
0.0795143023133278 -6.89029229761218e-06 -1.32917307382741e-07 -2.48566561822372e-06 
0.0758742690086365 -8.41691326058935e-06 -4.34103498037075e-07 -3.44837872034987e-06 
0.0722680166363716 -8.85481313162018e-06 -1.3361133142098e-06 -4.13690622735885e-06 
0.0683664679527283 -6.34792104392545e-06 -1.86366048637865e-06 -3.24108964377956e-06 
0.0644622519612312 -5.90446461501415e-07 -1.99317719307146e-06 -1.41987050028547e-06 
0.0602303966879845 6.0992497310508e-06 -1.82986173058453e-06 -4.61182111166636e-07 
0.0558422207832336 1.47997652675258e-05 -1.99164219338854e-06 2.39899304688151e-06 
0.0510022789239883 2.39026376220863e-05 -5.72641397411644e-07 4.33925470133545e-06 
0.0456766970455647 3.60922203981318e-05 4.38765766830329e-07 5.41061172043555e-06 
0.0397877767682076 4.73429608973674e-05 1.78838467945752e-06 5.43467376701301e-06 
0.0337177030742168 5.66106646147091e-05 2.49957429332426e-06 4.87667966808658e-06 
0.0275651197880507 6.12686853855848e-05 3.03906472254312e-06 3.0761818834435e-06 
0.0217317901551723 6.21713770669885e-05 2.58507589023793e-06 1.13790542854986e-06 
0.0164618603885174 5.6185555877164e-05 2.13589214581589e-06 -4.15890696103816e-07 
0.0120244463905692 4.81604365631938e-05 1.1759932476707e-06 -1.59587546022522e-06 
0.00847309362143278 3.81721583835315e-05 3.52380396861918e-07 -2.26085853682889e-06 
0.00577572034671903 2.87012499029515e-05 -5.55879978492158e-07 -2.43279532696761e-06 
0.00381399528123438 2.02180581254652e-05 -1.15331090455584e-06 -2.24260384129593e-06 
0.00244943867437541 1.39231860885047e-05 -1.83926931640599e-06 -2.12164286494954e-06 
0.00152243056800216 9.62301237450447e-06 -2.1859013941139e-06 -1.96916926142876e-06 
0.000901790801435709 6.81946767144836e-06 -2.41065868067381e-06 -1.79019696133764e-06 
0.000481309514725581 4.86008730149479e-06 -2.56418434219086e-06 -1.6920406551435e-06 
0.000197206129087135 3.45413968716457e-06 -2.58487943938235e-06 -1.60416607286606e-06 
9.65745857683942e-06 2.51160918196547e-06 -2.50331891038513e-06 -1.50878872773319e-06 
-0.000130283675389364 1.78792811311723e-06 -2.46414879256918e-06 -1.4277728723755e-06 
-0.000230376157560386 1.17651495656901e-06 -2.37674112213426e-06 -1.43397437568638e-06 
-0.00030247843824327 8.21466869638243e-07 -2.34671801990771e-06 -1.39576445690182e-06 
-0.000357329001417384 4.58366855582426e-07 -2.28921362577239e-06 -1.3429372529572e-06 
-0.000405494851293042 2.48725740448208e-07 -2.28392354983953e-06 -1.31340527786961e-06 
0 0 0 0 
0 0 0 0 
0 0 0 0 
0 0 0 0 
0 0 0 0 
0 0 0 0 
0 0 0 0 
0 0 0 0 
0 0 0 0 
0 0 0 0 
0 0 0 0 
0 0 0 0 
0 0 0 0 
0 0 0 0 
99.9723892211914 0.0170769430696964 0.00585068250074983 0.00269329408183694 
