0 0 0 0 
0 0 0 0 
0 0 0 0 
0 0 0 0 
0 0 0 0 
0 0 0 0 
0 0 0 0 
0 0 0 0 
0 0 0 0 
0 0 0 0 
0.00340669648721814 -4.48690161647392e-06 -3.224495670473e-10 -2.47599246661068e-10 
0.00393994431942701 -2.84412067230733e-06 2.69815444653432e-07 1.64594652574124e-07 
0.00424554105848074 -2.58881800618838e-06 3.16002024547402e-09 1.25678694118392e-08 
0.00460685696452856 -1.29729164655146e-06 -2.45641103902017e-07 -4.65261500437464e-08 
0.00493583269417286 -9.07557193841058e-07 1.80415042905224e-07 -1.11769352884039e-07 
0.00522107072174549 -3.47508133380359e-10 -1.0413015161248e-07 2.56706755408231e-07 
0.00546189257875085 5.87558702136448e-07 4.92178990896264e-08 -1.85748930903173e-07 
0.00561579363420606 1.12083466774493e-06 -9.4679668549702e-09 5.10853332968964e-08 
0.00565786939114332 7.09390860720305e-07 1.83894421912356e-09 -1.235647761888e-08 
0.00555352959781885 7.42651309337816e-07 4.13681137956257e-11 -8.95137242107324e-10 
0.00536646042019129 1.95276811609801e-07 1.11820214546143e-11 7.45627240505975e-11 
0.00515252770856023 -6.62387300565115e-09 2.0145481116618e-10 2.222331346724e-10 
0.00494634639471769 -1.36391605565223e-07 -1.0360252933328e-10 7.35892458081366e-11 
0.00478908000513911 -3.4314862773499e-07 -6.22907628256009e-11 -1.11118399204191e-10 
0.00474453391507268 -5.84078861720627e-07 3.50875439814047e-11 -4.00815804157961e-11 
0.00481476122513413 -7.89751084084855e-07 -1.85115256456925e-10 -4.26891508253924e-11 
0.00500609865412116 -9.6841120011959e-07 2.55258758574683e-10 2.15615331145003e-10 
0.00529385358095169 -1.61989271418861e-06 -2.52846132919871e-10 -1.26354246510196e-10 
0.00566410226747394 -2.12147233469295e-06 -8.56756957046123e-11 -1.18303603025005e-10 
0.00602716207504272 -2.70303735305788e-06 -2.90570706384941e-10 -1.10523895591186e-10 
0.00636416533961892 -3.1084905458556e-06 -1.78695752639513e-10 -1.48245915543299e-10 
0.0066138687543571 -3.67181087312929e-06 2.8993588085946e-10 1.31322688834423e-10 
0.00678427377715707 -3.83625729227788e-06 -8.97042717884489e-10 -4.51623988206862e-10 
0.00685223145410419 -3.73916259377438e-06 2.88648188684348e-10 2.4448376656494e-10 
0.00684769591316581 -3.71930764231365e-06 1.89086194618548e-11 -1.31616009757529e-10 
0.00681996764615178 -4.03777994506527e-06 1.94853466695122e-10 2.58458792562477e-11 
0.00683644134551287 -4.14226815337315e-06 -2.91355523041048e-10 1.55602322693404e-10 
0.00699164113029838 -4.61908712168224e-06 1.59006474653722e-10 -1.59033133884101e-10 
0.00735037587583065 -5.75357535126386e-06 -7.48485093349238e-11 2.53242815606569e-10 
0.00811097957193851 -7.38107382858288e-06 1.34244282357088e-10 -1.64798286128587e-10 
0.00950003229081631 -9.74336853687419e-06 -4.65732008514408e-10 2.59829189414029e-11 
0.0117403389886022 -1.27711819004617e-05 1.485491452069e-10 -7.17060785748735e-11 
0.0149617791175842 -1.68406240845798e-05 -1.66344782392969e-09 -1.03797415107465e-09 
0.0194633603096008 -2.12232898775255e-05 -3.2021987839137e-10 -4.76708172936213e-10 
0.0254212971776724 -2.64836944552371e-05 -1.74369996219781e-09 -1.27865706911479e-09 
0.0329924263060093 -2.95473801088519e-05 -3.07487479922486e-09 -2.55278492788946e-10 
0.0420574061572552 -3.45550433848985e-05 -1.76092529446947e-10 -3.64397678698225e-10 
0.0525309890508652 -3.63217732228804e-05 -2.67030464407014e-09 -3.81292819540135e-09 
0.063894622027874 -3.75932759197894e-05 3.85022858040429e-09 3.00663072216878e-09 
0.0758387669920921 -3.68784567399416e-05 -1.30137778331374e-09 2.54284171496977e-09 
0.087648406624794 -3.7254980270518e-05 -1.40968292594579e-09 -8.17671597097558e-10 
0.0987692475318909 -3.18288402922917e-05 -1.0842756914542e-08 -2.57135823744647e-09 
0.108777463436127 -2.98349932563724e-05 -1.01679864528137e-08 -6.09215655700268e-09 
0.11780584603548 -2.82328201137716e-05 5.80608838784968e-10 -3.03959390990372e-09 
0.125321283936501 -2.54800506809261e-05 -5.21952348009336e-09 -1.42391598512148e-09 
0.131286576390266 -2.40446388488635e-05 -7.40875050198042e-09 -6.05582428647722e-09 
0.136306777596474 -2.67030518443789e-05 8.55978665725843e-09 1.97206850849341e-09 
0.140479072928429 -2.65109501924599e-05 9.79382130950057e-10 1.7127350648849e-09 
0.143368199467659 -3.08383496303577e-05 -2.28840013605236e-09 7.36529637279659e-09 
0.145637035369873 -3.73263246729039e-05 5.31903765477182e-09 4.74262451533036e-09 
0.147562205791473 -3.85140847356524e-05 3.24214921576527e-09 -2.62714228149719e-09 
0.148679167032242 -3.90099958167411e-05 4.64416105572241e-09 -7.05289548985633e-10 
0.149625286459923 -3.50713198713493e-05 -4.04352551441889e-09 -6.73872335710257e-09 
0.150508373975754 -2.40914323512698e-05 4.18839984916985e-09 -1.87928517192404e-09 
0.150830656290054 -1.9464716388029e-05 -1.12943281393996e-08 -1.50488066452681e-09 
0.151126131415367 -1.55938578245696e-05 -9.5176098113825e-09 -1.87809501284164e-09 
0.151451259851456 -1.25826663861517e-05 2.67141375687174e-09 1.78150905139063e-09 
0.151356548070908 -1.45022595461342e-05 3.20043158641425e-10 -6.40814556973623e-09 
0.151195302605629 -1.5354195056716e-05 4.2579499925921e-09 3.91095911211892e-09 
0.151326075196266 -9.83436075330246e-06 8.6219484884964e-09 2.11748663048184e-09 
0.151017665863037 -1.04577584352228e-05 -8.43752179235935e-10 -6.59903465205502e-09 
0.150436013936996 -8.58190196595388e-06 4.80713691075607e-09 -1.84690790439035e-10 
0.150303199887276 -8.33117337606382e-06 -7.30179694485855e-09 -1.09709885620646e-09 
0.15000855922699 -1.48088402056601e-05 5.52226886441076e-09 6.98701851931105e-09 
0.14969964325428 -1.23763793453691e-05 -9.64874069531163e-10 6.45262154819193e-09 
0.149499878287315 -6.10265760769835e-06 -3.83948783877486e-09 -4.12902734225895e-09 
0.149445250630379 -1.62264109349053e-06 -3.18600368309774e-09 -2.81304490812317e-09 
0.148545488715172 -9.94470156001626e-07 8.35898550377578e-09 -1.40372691248558e-09 
0.147811964154243 1.01168297987897e-05 8.27890707377765e-12 2.24536789161789e-09 
0.146563038229942 9.01992825674824e-06 3.11373060668529e-09 2.32984276316017e-09 
0.145435765385628 1.12610750875319e-05 -2.83432677328221e-09 -5.65299085319992e-10 
0.144117191433907 1.16866876851418e-05 -1.36959366070499e-09 6.9432521954127e-09 
0.14291225373745 1.35888867589529e-05 -3.87173360039128e-09 -5.16282683271641e-10 
0.141016259789467 1.61001116794068e-05 3.85157017390725e-09 -1.0871867850426e-09 
0.139405891299248 1.22774108604062e-05 1.08535722631586e-08 8.03123967330066e-09 
0.13742133975029 1.95877073565498e-05 -7.96082755272209e-09 -2.47998888092127e-09 
0.135242894291878 2.47030657192226e-05 1.10506839234858e-08 5.24759347086956e-09 
0.132321521639824 3.32256968249567e-05 -3.96465138496893e-10 4.69607819297835e-09 
0.129678711295128 3.42583007295616e-05 3.70380415226634e-09 1.94579552470486e-09 
0.12656968832016 4.68622274638619e-05 6.96485491502585e-09 -1.97039673466293e-09 
0.123446494340897 3.68287983292248e-05 2.28035612614974e-09 -3.91490395657001e-09 
0.120020069181919 3.44704785675276e-05 -4.77311390412183e-09 -9.47437128751005e-10 
0.116854213178158 3.02967473544413e-05 1.3520017327906e-09 -1.02219632758249e-09 
0.113492771983147 3.22127270919736e-05 -3.77525316563876e-10 8.21721413135634e-10 
0.109960682690144 3.05824542010669e-05 1.17167020530218e-09 -1.06298436719499e-09 
0.106137692928314 3.41951636073645e-05 1.55229660236955e-08 5.15034503933975e-09 
0.102899931371212 3.25354267260991e-05 -1.28421873135665e-09 -1.83546655652123e-09 
0.0993700101971626 3.35358054144308e-05 -8.54965520602491e-09 -3.67045682736489e-09 
0.0958850309252739 2.76549708360108e-05 -7.49859108140072e-09 -1.05096031877139e-09 
0.092687763273716 2.22686285269447e-05 -7.86563814081376e-10 -1.82348391941645e-09 
0.0893743112683296 2.02849823836004e-05 -2.15397855107824e-09 -1.54450430223108e-09 
0.0857311710715294 2.35784991673427e-05 -3.31365401784467e-09 -2.00014871332144e-09 
0.0822477787733078 2.07117718673544e-05 -1.61764923678476e-09 -1.49622217393564e-10 
0.0787094905972481 2.37982221733546e-05 2.40825492880958e-09 2.31443753051508e-09 
0.074784904718399 2.72134620900033e-05 1.26459309690574e-09 2.2053963100177e-09 
0.0709181725978851 2.81024022115162e-05 -6.59095045207891e-09 3.46852241372986e-10 
0.0665955170989037 2.5782563170651e-05 -3.38754269080255e-09 1.68333880168348e-09 
0.0624419115483761 2.56893108598888e-05 -3.59021190554643e-09 -2.52230147879118e-09 
0.0580457635223866 2.36870528169675e-05 -6.25290663691658e-09 -4.74859662702443e-09 
0.0538838915526867 2.1301177184796e-05 2.72631228703801e-09 3.29409888255583e-10 
0.0495495460927486 1.91021536011249e-05 -4.50062542789453e-10 -3.14988257699156e-10 
0.0455163642764091 1.71082447195658e-05 8.88822626610164e-11 -2.01207703276474e-10 
0.0416699647903442 1.80382157850545e-05 -1.56156876318647e-09 4.59337429203899e-12 
0.0381925441324711 1.60596646310296e-05 -2.67787192420599e-09 -2.31577024223384e-09 
0.0350719355046749 1.55995894601801e-05 -8.78323858088947e-10 9.25050258615556e-10 
0.0322732180356979 1.54834415297955e-05 -3.337473852838e-09 -2.19614593177653e-09 
0.0297954678535461 1.45660524140112e-05 1.4211823384791e-10 -5.12964115628733e-10 
0.0275654587894678 1.35760055854917e-05 -1.26631383157161e-09 1.98985661281625e-10 
0.0253800861537457 1.2138758393121e-05 -2.52247711607367e-09 2.39130215629046e-10 
0.023257052525878 1.10632363430341e-05 -8.2964307646094e-10 -3.41806916104304e-10 
0.0214172098785639 1.04013342934195e-05 -1.74165699223794e-11 -1.57168306147426e-10 
0.0197193939238787 1.02560816230834e-05 2.07436724047882e-11 1.08364033024611e-10 
0.0181139502674341 9.2536256488529e-06 -8.26332891001869e-10 -8.90898077532398e-10 
0.0167790204286575 8.22126548882807e-06 1.35448097182689e-10 2.80989981282787e-10 
0.0155294798314571 7.25453946870402e-06 -7.62895968620114e-10 -4.20496054642783e-10 
0.0144506199285388 6.16886018178775e-06 1.34074995550293e-09 -1.59775567776244e-10 
0.0134769352152944 4.51173627880053e-06 -1.21397569774473e-09 -7.64850571766118e-10 
0.0125526078045368 4.05904575018212e-06 -9.38434441266622e-10 -9.34149646525384e-10 
0.0116444574669003 3.50035702467721e-06 3.96169652638889e-10 -5.02533792356985e-10 
0.0108354371041059 2.46554805016785e-06 1.76893541481427e-10 -1.81865948082477e-12 
0.00997869856655598 1.89564798347419e-06 2.54177836547451e-13 2.54984117153967e-10 
0.00915175303816795 1.95006077774451e-06 -6.94736601580814e-10 -3.71043307190178e-10 
0.00836584810167551 1.3295606322572e-06 -2.95315910614491e-10 5.48940753963834e-11 
0.00757075380533934 8.00091811470338e-07 2.8749658209648e-10 2.6672661301852e-10 
0.00676972046494484 5.57232397113694e-07 -1.06078146266952e-09 -3.94223403921146e-10 
0.006021065171808 1.43260170393233e-09 -3.0439990805764e-11 2.79707590422618e-10 
0.00528667028993368 -5.03056583056605e-07 2.04196479169916e-10 2.43460616250468e-11 
0.00458054523915052 -1.08674828425137e-06 -1.66044511473729e-10 -9.26434970405232e-11 
0.00397139834240079 -9.80923005045042e-07 -1.44427358961252e-10 -7.78402897694264e-11 
0.00338019779883325 -9.42779365686874e-07 2.52505863440611e-11 -1.04346378759779e-10 
0.00286698620766401 -8.84824203239987e-07 -2.29959523645462e-11 1.3760422488962e-11 
0.00241749966517091 -7.5018670031568e-07 -1.94312163581678e-10 -9.17367848352058e-11 
0.00202216650359333 -5.35751958352648e-08 -5.35688680913804e-11 -7.05621810981327e-11 
0.00169198482763022 5.16965428687399e-07 -7.88243775806663e-11 9.52074443588691e-12 
0.00144366815220565 7.87869907981076e-07 -4.81889528280988e-11 -1.05413913709107e-10 
0.00124957715161145 1.34752315261721e-06 1.35905592335561e-10 1.02042735372621e-10 
0.0010931387078017 1.51699759953772e-06 -4.59156193968746e-12 2.94490369590061e-11 
0.000993783585727215 1.66417157743126e-06 -4.63920429849551e-11 -1.85146308007145e-11 
0.000917461642529815 1.64939581281942e-06 6.49609185887634e-11 4.35589897485045e-11 
0.000858762243296951 2.08754408959066e-06 1.06038016908783e-11 -8.66596377990803e-12 
0.000792689388617873 2.44857574216439e-06 -1.77726548755697e-11 4.82380151448081e-12 
0.000750377541407943 2.81159987025603e-06 -6.00857141819233e-11 -4.52184401034117e-11 
0.000707167549990118 2.96251073450549e-06 -2.85824246215594e-11 -2.46696899020016e-11 
0.000688497209921479 3.20218555316387e-06 -3.46958507931039e-12 -2.41866179861994e-11 
0.00066502281697467 3.06842412101105e-06 -2.25013306598409e-11 -1.63857555995905e-11 
0.00065305206226185 2.70128384727286e-06 -6.23108370456649e-11 -1.38966511908922e-11 
0.000687388062942773 2.15511499845888e-06 -1.09507347634263e-10 -5.22452220375058e-11 
0.000681507692206651 2.51343954005279e-06 -3.84338290360109e-11 -1.21377213835316e-12 
0.000661935948301107 2.38977349908964e-06 -6.65270755151326e-11 -3.66906713344939e-11 
0.000632915121968836 2.48139031100436e-06 -6.98828009348951e-11 -4.68149026489062e-11 
0.000605288776569068 2.62802609540813e-06 -2.44208906569066e-11 -2.77713390478551e-11 
0.000510683166794479 3.23916901834309e-06 -5.62736385267826e-11 -5.52471263182142e-11 
0.000462658412288874 2.84669840766583e-06 -1.06780842848431e-11 -2.09421091579287e-11 
0.000415319140302017 2.92603385787515e-06 -4.16039910855481e-11 -1.09334477235712e-11 
0.000392908608773723 2.67404084297596e-06 -5.19852980107594e-11 -2.86282490769008e-11 
0.000373155169654638 2.4699947971385e-06 -4.03770801515879e-11 -2.5524773267227e-11 
0.000376560055883601 2.00547356143943e-06 -1.09539747064624e-11 -1.78549987295273e-11 
0.000376979645807296 1.85836950095108e-06 1.38783221026451e-11 -5.02269927038501e-12 
0.000363189377821982 1.52815721321531e-06 -5.52564868860905e-11 -2.1772908129214e-11 
0.000357053068000823 1.46200522976869e-06 -5.13640761867773e-11 -2.27536930269556e-11 
0.000326135050272569 1.34077333768801e-06 -1.48448597164785e-11 -1.29687328584427e-11 
0 0 0 0 
0 0 0 0 
0 0 0 0 
0 0 0 0 
0 0 0 0 
0 0 0 0 
0 0 0 0 
0 0 0 0 
0 0 0 0 
0 0 0 0 
0 0 0 0 
0 0 0 0 
0 0 0 0 
0 0 0 0 
99.9765014648438 0.0222380086779594 4.25548532803077e-05 3.81947502319235e-05 
