0 0 0 0 
0 0 0 0 
0 0 0 0 
0 0 0 0 
0 0 0 0 
0 0 0 0 
0 0 0 0 
0 0 0 0 
0 0 0 0 
0 0 0 0 
0.000445735960965976 -6.093106321714e-07 0 0 
0.00071710953488946 -2.22084494794217e-07 2.34083241679173e-09 1.64881100772618e-07 
0.00120484957005829 4.66054814296513e-07 -2.27738823355139e-08 -1.62366156075677e-08 
0.00212276191450655 2.21959635382518e-06 4.57736515357965e-09 9.36194837208859e-08 
0.00398689974099398 5.68931545785745e-06 -1.88143083335035e-08 -3.43361339361081e-10 
0.00658427737653255 9.73351598076988e-06 3.51471229897982e-09 5.56309893984253e-11 
0.00945279560983181 1.35778782350826e-05 6.68687549776337e-09 -3.41865397102126e-10 
0.0123223252594471 1.65180917974794e-05 3.13193204704021e-09 -7.9951151255031e-10 
0.0147615754976869 1.79235084942775e-05 2.52951354307029e-10 -7.71873398530687e-10 
0.016139118000865 1.71050814969931e-05 -2.0432526781633e-08 -3.48197803923256e-10 
0.0166029948741198 1.52233833432547e-05 1.56963597675031e-08 -1.45933665152143e-09 
0.0165267437696457 1.29872951220023e-05 -8.85946427331419e-09 -1.35730648942456e-09 
0.0160898026078939 1.10206028693938e-05 -6.2322470739673e-08 4.51329279504975e-10 
0.0153898391872644 9.01109706319403e-06 1.60529808113097e-07 -4.34936309190448e-10 
0.0145745743066072 7.22498771210667e-06 -1.15941951150944e-07 -1.17124010490244e-09 
0.0137158511206508 5.61059550818754e-06 3.97215984548893e-08 5.01217733983594e-10 
0.0128865763545036 4.39881932834396e-06 -5.12791853424233e-09 -4.90220530835472e-10 
0.0120715480297804 3.32596027874388e-06 1.05702703534494e-10 -1.01188102341609e-09 
0.0112823890522122 2.63234755948361e-06 -1.58219870538545e-09 7.24155124753878e-10 
0.0105333290994167 1.8802458043865e-06 -1.33580757566421e-09 4.42350434060046e-10 
0.00982735026627779 1.32727666368737e-06 3.63772650890937e-10 -8.77831363155224e-10 
0.00916847866028547 7.96127096691635e-07 1.91485039630068e-11 -3.08811837212986e-10 
0.00858948286622763 5.26678377354983e-07 -7.84699943912059e-11 -1.54997126244893e-10 
0.00805492233484983 6.12700361557472e-08 -1.62911004131239e-10 -2.83951140378491e-10 
0.00750405061990023 -1.39885898420289e-07 -7.83314968444415e-10 2.92565555115587e-11 
0.00691851880401373 -3.37239100645093e-07 7.46366912718344e-10 1.23553431374823e-10 
0.00636435905471444 -3.96732929175414e-07 2.35771013823438e-10 3.85929288526654e-10 
0.00584434345364571 -5.84524002533726e-07 -2.5917094859107e-11 -1.21557694465757e-10 
0.00537826493382454 -5.12181600242911e-07 2.29404245599696e-10 -1.8852221173038e-10 
0.00503499340265989 -4.06787364681804e-07 5.05033459496929e-10 -5.85022363885912e-10 
0.00479515362530947 -3.02593150536268e-07 -1.21764737182062e-10 3.12836062610344e-10 
0.00460285786539316 -3.64904536809263e-07 1.09615115595485e-10 6.17637885280686e-11 
0.00444708252325654 -3.58992679139192e-07 2.69975070077422e-10 -2.94924862309642e-10 
0.00432939268648624 -4.05972855332948e-07 -2.87266391230112e-11 1.93499716250045e-10 
0.00425875978544354 -4.81039876376599e-07 2.22780627279207e-10 -1.15380760501438e-10 
0.0042506530880928 -4.94560708830249e-07 4.86213196440599e-12 -2.47652488793992e-11 
0.00430303532630205 -4.75081122885967e-07 -3.68051783494749e-10 -5.35402234699833e-12 
0.00438546994701028 -5.86218675380223e-07 7.24405466168143e-11 -1.9160931175044e-10 
0.00448660785332322 -5.98477583935164e-07 -2.11518007969813e-11 1.6810156044933e-10 
0.00461109355092049 -6.68754296384577e-07 -2.8876459556848e-10 -8.66962404644234e-11 
0.00472481781616807 -6.66556104533811e-07 -4.00437981384894e-11 2.34897795658995e-10 
0.00480300607159734 -6.76653769460245e-07 -2.00820263196455e-10 -3.79013959106445e-10 
0.00486528500914574 -6.72288763325923e-07 -1.90288326762378e-10 3.20519361052263e-10 
0.00490626273676753 -6.63266234823823e-07 1.4034820527975e-10 -5.4386387754457e-11 
0.00492347776889801 -6.22094432856102e-07 9.40045524061572e-12 -2.29545462498981e-11 
0.00491319177672267 -6.85303632508294e-07 -2.35258673653149e-10 1.65668145868381e-10 
0.00490568997338414 -6.54665029742318e-07 2.36598907132901e-10 -1.62332855491165e-10 
0.0048931441269815 -5.99734278239339e-07 -2.90817120385256e-10 3.38423622459061e-10 
0.00488450052216649 -6.03807279730972e-07 3.63826913041265e-10 -9.59564996905193e-11 
0.00487829046323895 -5.84775705192442e-07 1.04737840622704e-09 -2.79724465812592e-10 
0.00490586506202817 -5.95045776208281e-07 7.8411271919876e-10 -5.27582644238578e-10 
0.0049531739205122 -6.31054149380361e-07 2.34307045987592e-10 -1.82774177737155e-11 
0.00503193959593773 -6.90900833433261e-07 6.62930751960111e-11 6.76837058621871e-11 
0.00516289006918669 -7.6220214850764e-07 -5.0680987184748e-10 3.91333077054412e-11 
0.00535547686740756 -7.04553258401575e-07 7.78657749389566e-10 1.5455806079423e-10 
0.00561682041734457 -5.7151538612743e-07 4.24384860586713e-10 -4.75932349086605e-10 
0.00595278386026621 -5.67664301343029e-07 5.15434916970037e-10 -5.20603282705423e-10 
0.00635872315615416 -3.34947827695942e-07 -1.32090824389586e-10 -1.17433729407423e-10 
0.00680920016020536 -9.15481166430254e-08 -8.39497971139025e-10 3.5855117486161e-11 
0.0072842501103878 1.72595253644658e-08 1.33472788377276e-10 6.60751453551711e-10 
0.00775351095944643 9.09917901026347e-08 8.73340497142827e-11 -3.76109754451903e-10 
0.00818684417754412 2.11227927593427e-07 -1.20113766155505e-10 -1.1614427475326e-10 
0.00854117330163717 5.17905291985699e-08 5.78329717448867e-10 -1.20274956660893e-10 
0.00879116170108318 -3.31138039655343e-07 -6.79703404671272e-10 1.40973496765007e-10 
0.00882963091135025 -6.01396550337086e-07 2.968131573855e-10 -2.40996611555744e-10 
0.00870138593018055 -7.78808953327825e-07 -5.7907600936602e-10 1.20046070306579e-10 
0.00841708853840828 -8.32396381156286e-07 7.58930307487304e-10 -4.53456494575732e-10 
0.0079865250736475 -7.55281746478431e-07 4.86362339291446e-10 -2.93903790193895e-11 
0.00749377999454737 -3.82421433187119e-07 3.79746151191185e-10 -6.08418981862258e-10 
0.0070326179265976 -2.04131097802929e-07 -4.77109914076568e-11 2.62210142487618e-10 
0.00663612969219685 -2.34156459555379e-07 -2.93074620127953e-10 4.2757852813935e-11 
0.0062969489954412 -3.84742946835104e-07 -1.40603084730628e-10 3.69721031567849e-10 
0.00607002526521683 -4.26208771386882e-07 4.1243428117177e-10 1.62731370045854e-10 
0.00591198401525617 -5.2545402695614e-07 7.51184614511402e-10 -6.37347175036496e-10 
0.00586869614198804 -7.10552058080793e-07 4.50087772607688e-10 -2.33193103715834e-10 
0.00586244696751237 -5.9426741927382e-07 1.1361936946841e-09 -6.53204046408007e-10 
0.00589950615540147 -5.25751602253877e-07 -2.08673633927958e-11 -3.7125916230174e-10 
0.00599035480991006 -6.9107801436985e-07 -1.25574028952968e-09 6.37350561216721e-10 
0.0060995863750577 -6.887083827678e-07 7.58085483276716e-10 -2.21973453506941e-10 
0.00623274687677622 -6.56520398933935e-07 6.15020812055889e-10 -3.2253477666444e-10 
0.00638040294870734 -6.16246325080283e-07 2.52476706208427e-10 5.09223670175363e-11 
0.00659480318427086 -4.34387203540609e-07 -2.15107986978325e-10 1.6448610529185e-10 
0.0068975705653429 -1.28810214050645e-07 -5.36668987027866e-10 -1.80269150301671e-11 
0.00744342198595405 1.44105399613181e-07 5.80955783480164e-10 6.02925764869866e-11 
0.0085047259926796 3.44404611496429e-07 5.83687986832615e-10 -2.18459209055943e-10 
0.010737388394773 6.04215017574461e-09 8.98796870263396e-10 8.49890990917146e-11 
0.0150377089157701 1.35672189571778e-08 1.07006563332401e-10 -6.94824586755516e-10 
0.0225582998245955 2.11286032936187e-08 -1.67078062496273e-09 8.19212864211494e-10 
0.0346103794872761 3.2106509024743e-08 2.48895504206814e-09 -3.54397539092943e-10 
0.0520112924277782 2.06448180506413e-08 2.34127228715408e-09 1.84344817188986e-09 
0.0738354846835136 -3.44916884387203e-08 -1.14576419463219e-08 6.35111030433677e-09 
0.0977949872612953 -5.61675597055e-08 3.98849148153246e-10 -2.97064839394068e-09 
0.122050262987614 -6.22749621470575e-08 3.53896179028368e-09 -2.95198598898594e-09 
0.144701644778252 -8.54134395922301e-08 4.5842791784878e-09 -2.47846854151135e-09 
0.162636548280716 -4.31948001278215e-08 9.30325416703681e-09 -1.01778780958739e-08 
0.175293043255806 7.03358864484471e-09 -2.29973320386989e-08 8.20477374929851e-09 
0.184210941195488 3.18238176078012e-08 -8.06371913686377e-10 1.06476196748417e-08 
0.189576730132103 5.19316108693602e-08 8.02227706486747e-09 2.03955874411577e-09 
0.192213982343674 6.30124395684106e-08 -7.62575869117654e-09 6.661746709824e-09 
0.193135127425194 5.83049359192955e-08 1.00492307808508e-08 1.65739855173541e-09 
0.193066269159317 8.57194390846416e-08 -2.73946354489851e-09 1.13922473884975e-11 
0.191675454378128 1.27135026559699e-07 -2.16629358895659e-09 2.1722450505024e-09 
0.189281016588211 1.06856186903315e-07 -2.06035011274253e-08 3.74574238293235e-09 
0.186565741896629 9.80746335699223e-08 1.25440791087783e-09 -8.37349478644001e-09 
0.183166235685349 9.75225611909991e-08 1.06575122060804e-08 -1.13103908461198e-08 
0.179857701063156 6.43159091850975e-08 2.29485230818227e-08 -9.74647562657083e-09 
0.176931634545326 -2.23435904445068e-08 3.68719565990716e-09 1.36832793984354e-08 
0.1740403175354 -2.3628697363165e-08 -1.12947728947432e-09 1.56718904520403e-08 
0.170890361070633 -4.11653354603914e-08 -2.43610394079496e-08 2.45504105933492e-09 
0.16768416762352 -3.94578410123359e-08 -2.49194020973675e-09 -1.71772018831007e-08 
0.164633095264435 3.97003070418123e-10 -1.61946900334442e-08 1.29626451794707e-08 
0.161234185099602 5.4904071475903e-08 -3.79236392289428e-10 1.6165332406004e-09 
0.158120378851891 3.60214221473143e-08 6.00215521728842e-09 -5.14136777596264e-09 
0.154037997126579 6.29213445790811e-08 3.10374526080182e-09 -1.37609763584123e-08 
0.150627747178078 -4.61243075733364e-09 -2.06396211233084e-09 4.38567004934498e-09 
0.146841704845428 -7.65779896028107e-08 3.50561513151604e-09 1.45320178113195e-09 
0.143377125263214 -1.15393258965923e-07 1.67100591141889e-08 -1.79021658608391e-10 
0.139279887080193 -7.54096527089132e-08 -3.31843219569805e-10 1.10616116266726e-09 
0.135313749313354 -9.79334618023131e-08 -5.97104099497869e-09 -2.95762681012945e-09 
0.131512522697449 -1.17902945930837e-07 2.25317076107956e-09 -1.03264152784277e-08 
0.127450436353683 -9.5464902187814e-08 9.65378177397724e-09 -1.19291432287838e-09 
0.122844710946083 -1.05024091681116e-07 -1.14800631223488e-08 -1.31017996451988e-09 
0.11895515024662 -1.62698597705457e-07 -8.77693306922112e-10 2.76068862214984e-10 
0.115467064082623 -1.7014741388266e-07 1.20688203875119e-09 2.29846430777059e-09 
0.111531764268875 -1.09676684587612e-07 -4.38705205496603e-09 4.77277595223313e-09 
0.107943996787071 -1.09566653918591e-07 4.13112921648917e-09 -5.32016697363247e-09 
0.104773886501789 -1.00419119917206e-07 4.67394212222416e-09 1.27026478224934e-09 
0.101206205785275 -5.48137313671759e-08 9.23232068572588e-09 -1.54706525368198e-09 
0.0978521853685379 -4.00078079110244e-08 -1.30154544919492e-08 1.06629843843464e-10 
0.0947051271796227 -5.70072370464914e-08 3.2645310898971e-09 3.21703552685904e-09 
0.0917681977152824 -6.00077464696369e-08 -7.25392235167988e-09 -3.87986709426968e-09 
0.088129885494709 -2.28924068323977e-08 3.27121463250535e-09 1.69138081318465e-09 
0.0844723880290985 -1.15701311642624e-08 1.71124749925866e-08 -3.91674959132615e-09 
0.0804650709033012 2.05060564439918e-08 -1.68788150123333e-09 4.18020906778338e-09 
0.0762738287448883 4.84781276099966e-08 -3.61113339231167e-09 1.95894567928123e-11 
0.0716437846422195 9.22828894545091e-08 1.43814060660219e-09 -2.81592926754115e-09 
0.0676327273249626 8.2701189967338e-08 6.41957642599778e-09 -2.90110002687527e-09 
0.0632957518100739 9.64227365329862e-08 4.72266981077496e-09 2.79106449063704e-09 
0.0587353408336639 1.0477056093805e-07 1.71291003603358e-09 -4.78342165877166e-09 
0.053812999278307 1.18545294753858e-07 5.35685984459633e-09 -2.62523824900995e-09 
0.0485670231282711 1.11551089503337e-07 -1.128290461061e-09 -4.49526249557408e-10 
0.0426003932952881 1.15902730613016e-07 -1.30919930452222e-09 1.62707447515231e-09 
0.0367402285337448 8.31852685223566e-08 -1.28876331828565e-09 5.25450127852878e-10 
0.0308134611696005 4.93974675919162e-08 1.0887556411987e-09 -2.10667261413278e-09 
0.0251813884824514 1.67528662586847e-08 -1.0303795594524e-09 2.88869705933337e-10 
0.0200744457542896 -5.0368504389553e-09 -7.21459836316996e-10 1.13031128901042e-09 
0.0157508309930563 -2.23749611905077e-08 8.52218517977121e-10 -1.27333921184913e-10 
0.012114055454731 -2.33117179959663e-08 1.44798140144786e-09 2.56516752283886e-10 
0.00911776069551706 -1.52010147758119e-08 2.93151419805682e-10 -5.24509269350659e-10 
0.0067786774598062 -4.05474537501505e-09 -5.10480602233798e-10 -3.03999353468143e-10 
0.00498375436291099 3.15266703410089e-09 1.95866156627034e-10 -2.67653066376994e-10 
0.00363631779327989 8.2681907542792e-09 1.60591678843858e-10 -6.66183150310751e-11 
0.0026588689070195 6.70767121846438e-09 4.04043909441043e-10 -4.10857403654319e-10 
0.00196044286713004 3.60411490873958e-09 -5.19294746093024e-11 -6.31830907038555e-11 
0.00146341766230762 -2.86466075749559e-09 2.66670140830483e-11 -1.68819874746262e-10 
0.00110192422289401 -8.51326433348731e-09 -3.72451514074612e-11 -2.70090113468902e-11 
0.000842969515360892 -1.35456650696142e-08 3.86587220568835e-11 9.37829328084838e-11 
0.000646548229269683 -1.74922718088055e-08 6.62130419937235e-11 9.09512118396627e-11 
0.000501760398037732 -1.9891297142749e-08 1.03475672474929e-10 4.93090221431736e-11 
0.000377771211788058 -2.15267027670052e-08 1.06406793098923e-10 7.24693569043033e-11 
0.000294465484330431 -2.08197980100522e-08 1.3580614410813e-10 3.21858789620322e-11 
0 0 0 0 
0 0 0 0 
0 0 0 0 
0 0 0 0 
0 0 0 0 
0 0 0 0 
0 0 0 0 
0 0 0 0 
0 0 0 0 
0 0 0 0 
0 0 0 0 
0 0 0 0 
0 0 0 0 
0 0 0 0 
99.9914779663086 0.0074698063544929 2.25421699724393e-05 1.95938318938715e-05 
