0.000607202120590955 0.0187743417918682 
0.000741124153137207 0.0116608683019876 
0.000864129804540426 0.00409132242202759 
0.00101103691849858 -0.0040212869644165 
0.00129621720407158 -0.0097219729796052 
0.00169488205574453 -0.0129748191684484 
0.00218813284300268 -0.0159695688635111 
0.00271743023768067 -0.0195122994482517 
0.0032229432836175 -0.0222182366997004 
0.00360704306513071 -0.0226137302815914 
0.00385654019191861 -0.0183740891516209 
0.00397759396582842 -0.0134049523621798 
0.00406351871788502 -0.00681671407073736 
0.00416173739358783 -0.00215568696148694 
0.00417978269979358 -0.00083784875459969 
0.00415180390700698 0.00136828212998807 
0.00404785620048642 0.00135463837068528 
0.00391787197440863 0.00173652090597898 
0.00374858593568206 0.000179191993083805 
0.00352371321059763 0.000493218773044646 
0.00330935115925968 0.00286354916170239 
0.00305720930919051 0.00432681571692228 
0.00283776433207095 0.0051585491746664 
0.00264998758211732 0.00640192348510027 
0.00253002671524882 0.00614143582060933 
0.00253462069667876 0.00593951903283596 
0.00262243347242475 0.00446401815861464 
0.0027994301635772 0.00533367833122611 
0.00297985319048166 0.00665611913427711 
0.00317947217263281 0.00725071923807263 
0.00331137445755303 0.00591675890609622 
0.00345235434360802 0.00536492746323347 
0.00345688429661095 0.00465960800647736 
0.00346894026733935 0.00606858870014548 
0.00339806987904012 0.00677417917177081 
0.00334339961409569 0.00755498185753822 
0.00325854937545955 0.00663917372003198 
0.00326367258094251 0.00710931839421391 
0.00344069371931255 0.0066115758381784 
0.00384218781255186 0.00575236417353153 
0.00458474736660719 0.00429294118657708 
0.00581520749256015 0.0037233701441437 
0.00776027282699943 0.0042513245716691 
0.0107120098546147 0.0061993645504117 
0.0149288671091199 0.0100322905927896 
0.0206676106899977 0.017474677413702 
0.028030838817358 0.026017339900136 
0.0367213115096092 0.0363038256764412 
0.0462473444640636 0.0490686073899269 
0.056134320795536 0.0632546246051788 
0.0656824037432671 0.0818990617990494 
0.0749081000685692 0.0767118781805038 
0.0831519812345505 0.0779764950275421 
0.09052374958992 0.0707835853099823 
0.0970787703990936 0.0765319019556046 
0.102752663195133 0.0739582255482674 
0.107423208653927 0.0746702626347542 
0.111025258898735 0.0739494860172272 
0.114024102687836 0.0777963697910309 
0.116550996899605 0.0664829090237617 
0.118489488959312 0.0622008517384529 
0.119905278086662 0.0483326502144337 
0.121262110769749 0.0572841949760914 
0.122462846338749 0.0506333708763123 
0.123406477272511 0.0522717088460922 
0.124039269983768 0.0483475513756275 
0.124402604997158 0.0719872117042542 
0.12472827732563 0.0777781382203102 
0.124910980463028 0.0675081387162209 
0.125228762626648 0.0608063936233521 
0.12552784383297 0.0571710728108883 
0.126103088259697 0.0615224130451679 
0.126738801598549 0.0467393398284912 
0.12751829624176 0.0381107591092587 
0.128210946917534 0.0288733076304197 
0.128733977675438 0.0188400037586689 
0.129219144582748 0.0164189171046019 
0.129407182335854 -0.0137994019314647 
0.129503816366196 -0.0315350219607353 
0.129570960998535 -0.0531250573694706 
0.1298488676548 -0.0457959957420826 
0.12995308637619 -0.0521395429968834 
0.129949256777763 -0.0421971455216408 
0.129930406808853 -0.0425150729715824 
0.12982602417469 -0.0254441704601049 
0.12965327501297 -0.0390551760792732 
0.129049047827721 -0.0374393537640572 
0.128501728177071 -0.0515005700290203 
0.127740919589996 -0.0348700284957886 
0.127195492386818 -0.0322516709566116 
0.126612976193428 -0.0350255221128464 
0.125948220491409 -0.0493343248963356 
0.12504580616951 -0.0380335003137589 
0.123862788081169 -0.0349120050668716 
0.122653909027576 -0.0312553569674492 
0.121215373277664 -0.0398154631257057 
0.120132446289063 -0.0379603914916515 
0.118780300021172 -0.0571029558777809 
0.117785185575485 -0.0760636627674103 
0.116949424147606 -0.072022870182991 
0.116401515901089 -0.049237135797739 
0.116002485156059 -0.0356485806405544 
0.115270629525185 -0.0441073700785637 
0.114674054086208 -0.0600671619176865 
0.113680876791477 -0.0647253170609474 
0.112425781786442 -0.0795660391449928 
0.110541276633739 -0.0765815377235413 
0.108685918152332 -0.076110266149044 
0.106673523783684 -0.0782021507620811 
0.104338690638542 -0.0774900987744331 
0.101815737783909 -0.0849733799695969 
0.0993196293711662 -0.0671151801943779 
0.0970042496919632 -0.0777818113565445 
0.0948631167411804 -0.080259770154953 
0.0926524549722672 -0.0937485173344612 
0.0908704251050949 -0.0968598499894142 
0.0888696014881134 -0.0876921936869621 
0.0867513194680214 -0.0699229165911674 
0.0847002193331718 -0.0548558160662651 
0.0823483541607857 -0.0428618974983692 
0.0798358246684074 -0.0324927531182766 
0.076933391392231 -0.0165645815432072 
0.0738321617245674 -0.0112281860783696 
0.0707933679223061 -0.00860607158392668 
0.0676654875278473 0.00654852483421564 
0.0644834041595459 0.0211014188826084 
0.0610891133546829 0.0375057198107243 
0.0575785674154758 0.04550501704216 
0.0540343187749386 0.0764241963624954 
0.0504874140024185 0.101982295513153 
0.0467156805098057 0.12960958480835 
0.0430783815681934 0.150706052780151 
0.0394241139292717 0.170046612620354 
0.0359486006200314 0.192685067653656 
0.0323042012751102 0.200343236327171 
0.0288210343569517 0.218782275915146 
0.0254043079912663 0.224389225244522 
0.0221789330244064 0.2243692278862 
0.0190267488360405 0.217513859272003 
0.016115328297019 0.209670394659042 
0.0135862594470382 0.200476378202438 
0.0113125843927264 0.185058191418648 
0.00920729618519545 0.16398087143898 
0.0073175304569304 0.142725333571434 
0.00570861482992768 0.118151597678661 
0.00443442538380623 0.0982131138443947 
0.00338408793322742 0.078402504324913 
0.00255672307685018 0.061278123408556 
0.00187730859033763 0.0456253886222839 
0.0014577159890905 0.0358265489339828 
0.00117529719136655 0.029754888266325 
0.000911484356038272 0.02275450527668 
0.000621578830759972 0.0154564147815108 
0.00047730075311847 0.0112461177632213 
0.000367767177522182 0.00846344698220491 
0.000308923597913235 0.00494357757270336 
0.000205236472538672 0.00361788808368146 
0.000231207814067602 0.00687782140448689 
0.000197251545614563 0.0072927251458168 
0.00021474962704815 0.00580515759065747 
0.000130391999846324 0.00120452023111284 
0.000152444903505966 0.00272514205425978 
8.90232186065987e-05 0.00421077059581876 
0.000104724771517795 0.00424462044611573 
2.56490129686426e-05 0.00235392269678414 
4.26658043579664e-05 0.000667969172354788 
2.05020642169984e-05 0.000763268151786178 
6.98233998264186e-05 0.00100637366995215 
4.19787465943955e-05 0.00167199957650155 
5.60976222914178e-05 0.00169503525830805 
2.96337093459442e-05 0.00240181875415146 
4.9194015446119e-05 0.00190341449342668 
1.94345720956335e-05 0.00145884416997433 
-7.3212422648794e-06 -0.000209282618016005 
-2.68496169155696e-05 0.000189242113265209 
8.41443397803232e-06 0.00168222165666521 
2.31056856137002e-05 0.00250862492248416 
3.11211624648422e-05 0.00213145581074059 
6.76217268846813e-06 0.00110900751315057 
4.47163984063081e-05 0.00219830055721104 
2.09414884011494e-05 0.00240453029982746 
-1.65986439242261e-05 0.00198468985036016 
-5.65609334444162e-05 0.00029776114388369 
-3.83784281439148e-05 0.000389351975172758 
4.86994667880936e-06 0.00145951798185706 
