0.000426460348535329 0.00303425081074238 
0.000463664531707764 -0.000928393157664686 
0.000448360457085073 -0.00280594825744629 
0.000386633560992777 -0.00291593372821808 
0.000365376326953992 -0.00328130414709449 
0.00049434753600508 -0.00625566346570849 
0.000725143880117685 -0.0120985358953476 
0.00104352936614305 -0.0183288156986237 
0.00144421344157308 -0.0246764998883009 
0.00201769475825131 -0.0304189138114452 
0.00272589665837586 -0.0373031869530678 
0.00351819512434304 -0.0437119379639626 
0.00431293342262506 -0.04921855032444 
0.00510088168084621 -0.053172904998064 
0.00591304153203964 -0.0536420680582523 
0.00682965898886323 -0.0501372553408146 
0.00772062409669161 -0.0403586700558662 
0.00837227795273066 -0.0310685522854328 
0.00864752288907766 -0.0216698683798313 
0.0086091673001647 -0.0163802187889814 
0.00842285063117743 -0.0121802650392056 
0.00812033005058765 -0.00925425253808498 
0.00779775762930512 -0.00706976698711514 
0.00744179915636778 -0.00491743162274361 
0.00712119834497571 -0.00424927612766623 
0.00678183790296316 -0.00367277045734227 
0.00646820338442922 -0.00308109563775361 
0.00620129937306046 -0.00238511967472732 
0.00595382368192077 -0.00206948234699667 
0.00572163006290793 -0.00230422872118652 
0.00548555236309767 -0.00230508949607611 
0.00524301780387759 -0.00242060795426369 
0.00499987555667758 -0.00280964886769652 
0.00475299125537276 -0.00333737907931209 
0.00455190148204565 -0.00362257403321564 
0.00430818786844611 -0.00268646352924407 
0.0040611675940454 -0.00227818661369383 
0.00385139090940356 -0.00218851515091956 
0.00374135794118047 -0.00216848682612181 
0.00373506336472929 -0.00204251846298575 
0.00378909870050848 -0.00158700998872519 
0.0039089024066925 -0.00183683494105935 
0.00407413626089692 -0.00175111158750951 
0.00429990142583847 -0.00234557711519301 
0.00458676647394896 -0.00244826381094754 
0.00493011204525828 -0.00279099121689796 
0.00533213885501027 -0.00282811187207699 
0.00578410597518086 -0.00347835640423 
0.00625122664496303 -0.00400800863280892 
0.00672507286071777 -0.00359164434485137 
0.0071685086004436 -0.00253164418973029 
0.00760598294436932 -0.00234630680643022 
0.00798844452947378 -0.00186675484292209 
0.00835918169468641 -0.00158841686788946 
0.00875623617321253 -0.000691909517627209 
0.00920645240694284 -0.00119122082833201 
0.0096799498423934 -0.00157790922094136 
0.0101657416671515 -0.00291800894774497 
0.0106488522142172 -0.00232222094200552 
0.0111323492601514 -0.00322261452674866 
0.0116037894040346 -0.00306820566765964 
0.0120818801224232 -0.00400978839024901 
0.0126134203746915 -0.00288107106462121 
0.013180366717279 -0.00343690323643386 
0.0138380443677306 -0.00411709770560265 
0.0146059254184365 -0.00524334330111742 
0.0155237913131714 -0.00345801142975688 
0.0165883153676987 -0.00388898025266826 
0.017734345048666 -0.00505981035530567 
0.0189237259328365 -0.00766691472381353 
0.0200532507151365 -0.00786152947694063 
0.0211438313126564 -0.00878135953098536 
0.0220601372420788 -0.00922814756631851 
0.0226931925863028 -0.00923618488013744 
0.0228976961225271 -0.00975016597658396 
0.0226598754525185 -0.0100991697981954 
0.0220588035881519 -0.0103984363377094 
0.0211562421172857 -0.0111537538468838 
0.0201499834656715 -0.0108961751684546 
0.0191502366214991 -0.0113878566771746 
0.0182771235704422 -0.00921805948019028 
0.0175233334302902 -0.00863340497016907 
0.0169503595679998 -0.00740337930619717 
0.0165392365306616 -0.00788656622171402 
0.0162901021540165 -0.00747980736196041 
0.0161700546741486 -0.00904929079115391 
0.0161345954984426 -0.00919285230338573 
0.0162026882171631 -0.00994641054421663 
0.0163173470646143 -0.00980968959629536 
0.016505878418684 -0.00999114383012056 
0.0167422369122505 -0.0111791891977191 
0.0170825067907572 -0.0118013452738523 
0.0176536329090595 -0.0121055105701089 
0.0186106022447348 -0.0130972433835268 
0.0204648729413748 -0.0130576770752668 
0.0240583289414644 -0.0163276195526123 
0.0307795125991106 -0.0250787734985352 
0.0421205461025238 -0.0402713567018509 
0.0590322874486446 -0.0576216802000999 
0.0813538208603859 -0.0568632110953331 
0.107331484556198 -0.0575085952877998 
0.133964478969574 -0.0518036112189293 
0.157430872321129 -0.0536160133779049 
0.175608366727829 -0.0596017725765705 
0.187857285141945 -0.0506635718047619 
0.195345222949982 -0.056289367377758 
0.198983088135719 -0.0430706478655338 
0.200645953416824 -0.0353225842118263 
0.200485110282898 -0.0374334044754505 
0.198575481772423 -0.0406642854213715 
0.195435032248497 -0.057565949857235 
0.191766321659088 -0.0384394265711308 
0.188210442662239 -0.0405382737517357 
0.184679180383682 -0.040557686239481 
0.181115493178368 -0.0567163787782192 
0.178124293684959 -0.0623916164040565 
0.174989476799965 -0.0560811795294285 
0.17161101102829 -0.0507694482803345 
0.168462261557579 -0.0408489778637886 
0.164975345134735 -0.0397540405392647 
0.1616530418396 -0.0238361731171608 
0.157921835780144 -0.0192790552973747 
0.153977677226067 -0.0172736626118422 
0.150123372673988 -0.031820971518755 
0.146424368023872 -0.0262283608317375 
0.142635241150856 -0.0247341953217983 
0.138582244515419 -0.0124896876513958 
0.134173095226288 -0.00109032692853361 
0.12979681789875 0.0167776588350534 
0.125456154346466 0.0301392171531916 
0.120417505502701 0.0358148813247681 
0.11555040627718 0.0539053715765476 
0.11037627607584 0.0641487836837769 
0.105559542775154 0.0818872153759003 
0.100378058850765 0.0861352756619453 
0.0954635813832283 0.107429474592209 
0.090396523475647 0.119379661977291 
0.0855015218257904 0.143048986792564 
0.0802011787891388 0.160193100571632 
0.0750380307435989 0.188995122909546 
0.0698482915759087 0.202348306775093 
0.0645820870995522 0.220512479543686 
0.0587247647345066 0.227564454078674 
0.0525930635631084 0.237324059009552 
0.046697948127985 0.237607076764107 
0.0412534177303314 0.240998640656471 
0.0361684076488018 0.243098765611649 
0.0312711633741856 0.239985659718513 
0.0266716964542866 0.229856133460999 
0.02231789752841 0.214108645915985 
0.0184625387191772 0.198155969381332 
0.0150762880221009 0.179954171180725 
0.0121979778632522 0.161626026034355 
0.00967779755592346 0.140316441655159 
0.00753586459904909 0.11847235262394 
0.00567729212343693 0.0952945724129677 
0.00419455068185925 0.0737980678677559 
0.00302645144984126 0.053258266299963 
0.00219825934618711 0.0377902463078499 
0.00159359665121883 0.0242239385843277 
0.00113576231524348 0.0157041810452938 
0.000832224788609892 0.00815838109701872 
0.000662605627439916 0.00384093448519707 
0.000533356971573085 0.00106458237860352 
0.000422495970269665 0.00039832602487877 
0.00031414715340361 0.00070442573633045 
0.000306058442220092 0.000521160312928259 
0.000290671363472939 -0.000136954593472183 
0.000259796186583117 -0.000688510481268167 
0.00020370825950522 -0.000783990137279034 
0.000177173409610987 -0.000419770542066544 
0.000146400561789051 0.000414032198023051 
0.000149382132804021 -0.000262755900621414 
0.000140085467137396 -0.000317195372190326 
0.000140347750857472 -0.000951484777033329 
0.000128348910948262 -0.000254956277785823 
8.65694819367491e-05 0.000324295717291534 
7.90497360867448e-05 0.00048118139966391 
6.75000483170152e-05 0.000172676882357337 
7.92703940533102e-05 -0.000380233745090663 
9.32326511247084e-05 -0.000791064696386456 
5.55632650502957e-05 -0.000271201424766332 
5.04923082189634e-05 -0.000120496821182314 
-1.55600937432609e-05 0.000809159886557609 
-3.62614014193241e-06 0.000270596443442628 
