0 0 0 0 
0 0 0 0 
0 0 0 0 
0 0 0 0 
0 0 0 0 
0 0 0 0 
0 0 0 0 
0 0 0 0 
0 0 0 0 
0 0 0 0 
0.0185067635029554 0.000380363606382161 3.42739367624745e-05 9.53726043917413e-07 
0.0230952706187963 0.000467309524537995 3.04255536320852e-05 1.01945090591471e-06 
0.0272495876997709 0.000547178788110614 2.44133443629835e-05 7.34542084046552e-07 
0.0318410061299801 0.00063493283232674 1.94315980479587e-05 6.16950956100482e-07 
0.0372572019696236 0.000741591677069664 1.20677759696264e-05 3.21155710025778e-07 
0.0432412810623646 0.000859268417116255 4.65403945781873e-06 8.23356529622288e-08 
0.0496375188231468 0.000967067258898169 -1.77767890363612e-06 2.97181969699523e-07 
0.0565009824931622 0.00105856289155781 -8.46102375362534e-06 7.61554133532627e-07 
0.063692644238472 0.00112169818021357 -1.5647350664949e-05 1.07496714463196e-06 
0.0706809833645821 0.00112814118620008 -1.90273840416921e-05 1.53792939272535e-06 
0.0777863264083862 0.00109158596023917 -2.06111053557834e-05 1.84114651347045e-06 
0.0852982625365257 0.00102213060017675 -2.18429686356103e-05 1.6139174476848e-06 
0.0931819304823875 0.000929842994082719 -1.9847999283229e-05 6.14270447840681e-07 
0.100961081683636 0.000824443879537284 -1.70069451996824e-05 -4.07810318847623e-07 
0.10859502851963 0.000715876347385347 -1.49114248415572e-05 -1.43325178214582e-06 
0.115989483892918 0.000610590155702084 -1.12482211989118e-05 -1.88743445050932e-06 
0.123060636222363 0.000517595850396901 -6.41924361843849e-06 -1.91645972336119e-06 
0.129886567592621 0.000426213024184108 -5.40764267498162e-06 -1.70110911312804e-06 
0.136411011219025 0.000352121511241421 -1.52017923937819e-06 -1.01771411209484e-06 
0.142356976866722 0.000279574742307886 2.00121053239855e-06 -2.8230303428245e-07 
0.147754028439522 0.00021502202434931 2.74207809525251e-06 -1.90189226145776e-07 
0.152563899755478 0.000159105533384718 3.02514081340632e-06 -5.88128614253947e-07 
0.156546264886856 0.00011421743693063 5.42146426596446e-06 -6.13760334999824e-07 
0.159722253680229 7.11485772626474e-05 3.44866680279665e-06 -1.72652653418481e-06 
0.162685677409172 3.66596432286315e-05 2.16752755477501e-06 -3.19677837978816e-06 
0.165606275200844 -7.54781922296388e-07 2.76074661087478e-06 -4.11533073929604e-06 
0.168550714850426 -3.8086851418484e-05 5.47337094758404e-06 -4.12006511396612e-06 
0.171497210860252 -7.58994137868285e-05 9.4761062428006e-06 -3.38662403009948e-06 
0.174515530467033 -0.000120946046081372 1.67991565831471e-05 -1.73046419149614e-06 
0.176999092102051 -0.00015270197764039 2.28470053116325e-05 6.51249990823999e-07 
0.17866350710392 -0.000184767675818875 2.77349408861483e-05 2.90817706627422e-06 
0.179426252841949 -0.000217380787944421 2.72804209089372e-05 3.90846935260925e-06 
0.179409086704254 -0.000235597064602189 2.65384496742627e-05 3.46754791280546e-06 
0.178554475307465 -0.000251747464062646 2.59756052400917e-05 2.90191792373662e-06 
0.177177667617798 -0.000276312784990296 2.32818892982323e-05 2.46270360548806e-06 
0.175412848591805 -0.000297596619930118 2.05308369913837e-05 1.18527486847597e-06 
0.173378810286522 -0.000301243388094008 2.08107139769709e-05 7.7428347822206e-07 
0.170749291777611 -0.000306266534607857 2.14507799682906e-05 9.3686765012535e-07 
0.167649105191231 -0.000309234397718683 1.80881306732772e-05 3.81396603188477e-07 
0.16456001996994 -0.000303321285173297 1.44896821439033e-05 1.74145725395647e-07 
0.160904005169868 -0.000289741234155372 1.19526466733078e-05 -4.38248605405533e-07 
0.156671941280365 -0.000293276767479256 9.67875894275494e-06 -8.91819862403054e-09 
0.152038604021072 -0.000287187227513641 3.30513898916251e-06 -4.50292930054275e-07 
0.146743968129158 -0.000279500964097679 -1.09367090317392e-06 2.62756174151946e-07 
0.140617147088051 -0.000268524803686887 -2.89869194602943e-06 2.74840175507052e-07 
0.134152799844742 -0.000271414814051241 -6.84488850311027e-06 1.15266641387279e-06 
0.127431124448776 -0.00026352409622632 -1.10634182419744e-05 6.34696505130705e-07 
0.120653092861176 -0.000263707683188841 -1.43903635034803e-05 7.46032753795589e-07 
0.114217780530453 -0.000265959824901074 -1.72487270901911e-05 5.16352031354472e-07 
0.107882402837276 -0.0002707043022383 -2.00258873519488e-05 5.84199639774852e-08 
0.101673424243927 -0.00026350055122748 -2.30506593652535e-05 -1.58541183736816e-07 
0.0955041646957397 -0.000257382751442492 -2.52281915891217e-05 -3.80434869384771e-07 
0.0893282815814018 -0.000253476377110928 -2.67749655904481e-05 -4.06600662472556e-07 
0.083059161901474 -0.00024312651657965 -2.83164463326102e-05 -7.12618430043221e-07 
0.0767566189169884 -0.00023152148060035 -2.78621082543395e-05 -7.17924478976784e-07 
0.0705297365784645 -0.000218638204387389 -2.64289119513705e-05 -1.0299577297701e-06 
0.0645404681563377 -0.000205288451979868 -2.57464016613085e-05 -9.64494802246918e-07 
0.0589618310332298 -0.000189713129657321 -2.40520766965346e-05 -1.04503430975456e-06 
0.0539442896842957 -0.000174875414813869 -2.16955868381774e-05 -1.0552679441389e-06 
0.0494783520698547 -0.00016057379252743 -2.05261312657967e-05 -1.19714684387873e-06 
0.0456272251904011 -0.000149447354488075 -2.01215352717554e-05 -1.06947106814914e-06 
0.0422741994261742 -0.0001379287277814 -1.95159718714422e-05 -1.4888362329657e-06 
0.0394034348428249 -0.000128650426631793 -1.93664036487462e-05 -1.58188015575433e-06 
0.0369003415107727 -0.000117018367745914 -1.92035749932984e-05 -1.40507256674027e-06 
0.034698199480772 -0.000110579341708217 -1.864081423264e-05 -1.32105822103767e-06 
0.0327171385288239 -0.000101076002465561 -1.77415531652514e-05 -1.4747586192243e-06 
0.0310014802962542 -9.3930160801392e-05 -1.70230086951051e-05 -1.33333287521964e-06 
0.0294123366475105 -8.88987779035233e-05 -1.5338495359174e-05 -1.2062816949765e-06 
0.0279630869626999 -8.67062117322348e-05 -1.50025371112861e-05 -1.44379418998142e-06 
0.0265980586409569 -8.29973796498962e-05 -1.48730559885735e-05 -1.52148368215421e-06 
0.0252596195787191 -7.83374489401467e-05 -1.50799542097957e-05 -1.41388056817959e-06 
0.0239533502608538 -7.71700069890358e-05 -1.51194390127785e-05 -1.22073652164545e-06 
0.0226763114333153 -7.4014715210069e-05 -1.55348734551808e-05 -1.11869087504601e-06 
0.0214051231741905 -7.31316467863508e-05 -1.5585173969157e-05 -8.02339172878419e-07 
0.0201921723783016 -6.93461988703348e-05 -1.64795201271772e-05 -6.45829857148783e-07 
0.0190336126834154 -6.88256550347432e-05 -1.65482779266313e-05 -5.39942675459315e-07 
0.0178954415023327 -6.68253705953248e-05 -1.67829530255403e-05 -4.43870362687449e-07 
0.0168618466705084 -6.43189996480942e-05 -1.7129768821178e-05 -3.04289926589263e-07 
0.0159432180225849 -6.23047671979293e-05 -1.73684475157643e-05 -2.46284315608136e-07 
0.015145355835557 -6.09717899351381e-05 -1.69800568983192e-05 -1.21994034429918e-07 
0.0144721996039152 -6.04053129791282e-05 -1.68294391187374e-05 -1.11174585981644e-07 
0.0139500582590699 -6.00893508817535e-05 -1.71973715623608e-05 -1.12382501527009e-07 
0.0135334469377995 -6.10176102782134e-05 -1.71598185261246e-05 1.23922561101608e-08 
0.0132128670811653 -6.09917115070857e-05 -1.72090058185859e-05 2.37613249964852e-07 
0.0129685960710049 -6.12879812251776e-05 -1.7357438991894e-05 2.93871750045582e-07 
0.0128186261281371 -6.10083334322553e-05 -1.76320118043805e-05 5.13732913987042e-07 
0.0127335768193007 -6.15176104474813e-05 -1.7967666281038e-05 7.02206364167068e-07 
0.0127115128561854 -6.31597940810025e-05 -1.8230959540233e-05 7.57081068059051e-07 
0.0127617055550218 -6.50302536087111e-05 -1.84779019036796e-05 7.13058454948623e-07 
0.0128624495118856 -6.69115761411376e-05 -1.92352781596128e-05 8.07129993063427e-07 
0.0130027374252677 -6.88818981871009e-05 -1.98220477614086e-05 9.00002930848132e-07 
0.0131464283913374 -7.03632904333062e-05 -1.99050627998076e-05 8.98490782219596e-07 
0.0133136827498674 -7.12611436028965e-05 -2.02654337044805e-05 9.65546973930032e-07 
0.0134718809276819 -7.0835420046933e-05 -2.08057062991429e-05 1.10005623810139e-06 
0.0136020230129361 -7.18113078619353e-05 -2.01682869374054e-05 1.13033070192614e-06 
0.0136426761746407 -7.20916941645555e-05 -1.93515679711709e-05 1.10391260932374e-06 
0.0136510180309415 -7.09526866558008e-05 -1.83482898137299e-05 1.19966489364742e-06 
0.0136189535260201 -6.95279377396218e-05 -1.75017594301607e-05 1.13010275981651e-06 
0.0135400202125311 -6.79625009070151e-05 -1.66730769706191e-05 1.07008042959933e-06 
0.0134424129500985 -6.6008411522489e-05 -1.64536832016893e-05 1.10016344478936e-06 
0.0133781405165792 -6.37988487142138e-05 -1.57689337356715e-05 1.08319147784641e-06 
0.0133131593465805 -6.23531523160636e-05 -1.49766246977379e-05 1.05456592791597e-06 
0.0132158854976296 -6.06893263466191e-05 -1.45124504342675e-05 1.08479844129761e-06 
0.0131338853389025 -5.87311988056172e-05 -1.33312223624671e-05 1.25656629279547e-06 
0.013054434210062 -5.77463324589189e-05 -1.23021391118527e-05 1.32400600705296e-06 
0.0129758045077324 -5.68045397812966e-05 -1.20401346066501e-05 1.3767139535048e-06 
0.012904797680676 -5.51118828298058e-05 -1.2095504644094e-05 1.47216439927433e-06 
0.0128495553508401 -5.46157971257344e-05 -1.18412308438565e-05 1.68332769590052e-06 
0.0127758821472526 -5.4330153943738e-05 -1.21539251267677e-05 1.64792345458409e-06 
0.0126527640968561 -5.30983488715719e-05 -1.19781616376713e-05 1.72613101767638e-06 
0.0125176757574081 -5.18208835273981e-05 -1.15601542347576e-05 1.92946345123346e-06 
0.0123659893870354 -5.11246107635088e-05 -1.10729033622192e-05 2.05461947189178e-06 
0.0121709695085883 -4.87551806145348e-05 -1.07355399450171e-05 2.21859932025836e-06 
0.011932167224586 -4.78207657579333e-05 -1.03447846413474e-05 2.35582092500408e-06 
0.0116910617798567 -4.5582029997604e-05 -1.00388197097345e-05 2.47325669988641e-06 
0.0114050917327404 -4.30854379374068e-05 -1.00347797342693e-05 2.53763960245124e-06 
0.0110826166346669 -4.04390775656793e-05 -9.80404365691356e-06 2.68512803813792e-06 
0.0107190748676658 -3.86642750527244e-05 -9.16726548894076e-06 2.73144291895733e-06 
0.0103197759017348 -3.63855760951992e-05 -8.67870312504238e-06 2.87955117528327e-06 
0.00990297924727201 -3.46082961186767e-05 -8.36412073113024e-06 3.17151625495171e-06 
0.00944021344184875 -3.36296398018021e-05 -7.64543528930517e-06 3.43774240718631e-06 
0.00890818983316422 -3.23872700391803e-05 -7.15493706593406e-06 3.67416032531764e-06 
0.00836633704602718 -3.05776920868084e-05 -7.1161234700412e-06 3.96654559153831e-06 
0.00778167182579637 -2.8125074095442e-05 -6.70244844513945e-06 4.19748948843335e-06 
0.00715169357135892 -2.63125330093317e-05 -6.15997214481467e-06 4.22169341618428e-06 
0.00648903893306851 -2.34473973250715e-05 -5.4651900427416e-06 4.35347146776621e-06 
0.0058355862274766 -2.04086572921369e-05 -4.86954650114058e-06 4.34817548011779e-06 
0.00515258638188243 -1.72572308656527e-05 -3.94062271880102e-06 4.21621052737464e-06 
0.00450479565188289 -1.41004193210392e-05 -2.88988394459011e-06 4.06164826927125e-06 
0.00388036854565144 -1.05406452348689e-05 -1.63917127338209e-06 3.89406341128051e-06 
0.00328849605284631 -6.21160324953962e-06 -2.36958172195045e-07 3.54238454747247e-06 
0.00270054489374161 -1.34300228182838e-06 1.66156212344504e-06 3.16438081426895e-06 
0.00215936521999538 3.91028152080253e-06 3.93654818253708e-06 2.75234287983039e-06 
0.00166140287183225 8.76429839991033e-06 6.23858068138361e-06 2.32388970289321e-06 
0.00120611872989684 1.40978791023372e-05 8.47055525809992e-06 1.86006491276203e-06 
0.000812113110441715 1.87730838661082e-05 1.06944326034863e-05 1.38949121719634e-06 
0.000483859796077013 2.37921685766196e-05 1.26538852782687e-05 9.69965185504407e-07 
0.000221455789869651 2.82635410258081e-05 1.44238911161665e-05 5.98635892856691e-07 
1.27954331219371e-06 3.24395623465534e-05 1.58864204422571e-05 2.90192190277594e-07 
-0.000167607358889654 3.53780342265964e-05 1.68638143804856e-05 2.78096496941771e-08 
-0.000283513305475935 3.66144449799322e-05 1.71970896190032e-05 -1.28106819374807e-07 
-0.000336390105076134 3.52612478309311e-05 1.71039027918596e-05 -1.88037745374459e-07 
-0.000373827439034358 3.35322329192422e-05 1.66661538969493e-05 -2.17134228819305e-07 
-0.000395460927393287 3.14749449898954e-05 1.62967025971739e-05 -2.41059098016194e-07 
-0.000413349393056706 2.99508556054207e-05 1.60943254741142e-05 -2.32097079333471e-07 
-0.000425923994043842 2.87275197479175e-05 1.62058131536469e-05 -2.18735451085195e-07 
-0.000456330075394362 2.86053691525012e-05 1.62190681294305e-05 -2.72658752464849e-07 
-0.000470614962978289 2.79109590337612e-05 1.63892254931852e-05 -2.86323654563603e-07 
-0.000479345733765513 2.75348011200549e-05 1.64457069331547e-05 -2.98322618164093e-07 
-0.000478743808344007 2.64678856183309e-05 1.61932202900061e-05 -3.01516905665267e-07 
-0.000474729924462736 2.55017948802561e-05 1.57300419232342e-05 -2.97214853617334e-07 
-0.000458128313766792 2.41682846535696e-05 1.52571728904149e-05 -2.94772718234526e-07 
-0.00044578398228623 2.33364444284234e-05 1.44377081596758e-05 -2.97264392656871e-07 
-0.000424462341470644 2.16617736441549e-05 1.35644386318745e-05 -2.78544803222758e-07 
-0.000401547236833721 2.03552262973972e-05 1.28413912534597e-05 -2.6190821245109e-07 
-0.000380167708499357 1.89813363249414e-05 1.21659531941987e-05 -2.47124518182318e-07 
-0.000361527170753106 1.78475111169973e-05 1.15040547825629e-05 -2.15935315850402e-07 
-0.000342654180712998 1.67446614796063e-05 1.1024761988665e-05 -1.98496721282027e-07 
-0.000325749948387966 1.57319118443411e-05 1.06237657746533e-05 -1.83552359089845e-07 
-0.000313108525006101 1.52605734911049e-05 1.02986941783456e-05 -1.98656124439367e-07 
-0.000306925794575363 1.47219298014534e-05 9.88994634099072e-06 -2.16735188018902e-07 
0 0 0 0 
0 0 0 0 
0 0 0 0 
0 0 0 0 
0 0 0 0 
0 0 0 0 
0 0 0 0 
0 0 0 0 
0 0 0 0 
0 0 0 0 
0 0 0 0 
0 0 0 0 
0 0 0 0 
0 0 0 0 
99.5897827148438 0.383652210235596 0.0204736925661564 0.00219970382750034 
