0.000545675575267524 -0.00128534680698067 
0.000576019287109375 -0.000862262444570661 
0.000601583626121283 -0.000446557998657227 
0.000619675032794476 -0.000196194276213646 
0.000659896468278021 -0.000139104624395259 
0.000729280291125178 -0.000166945799719542 
0.000843141810037196 -0.000297808670438826 
0.000997592229396105 -0.000797965563833714 
0.00118954561185092 -0.00132405152544379 
0.00141419295687228 -0.00190972327254713 
0.00168023363221437 -0.00226448220200837 
0.0019692366477102 -0.00262089748866856 
0.00227300240658224 -0.00279059889726341 
0.00256306701339781 -0.00297620962373912 
0.00287316320464015 -0.00297625176608562 
0.0032478126231581 -0.00271211005747318 
0.00360375107266009 -0.00204497063532472 
0.00381482695229352 -0.00137203943450004 
0.00381468795239925 -0.000980515382252634 
0.0036682712379843 -0.000693214766215533 
0.0034581630025059 -0.000615459866821766 
0.00322677264921367 -0.000361299840733409 
0.00299939070828259 -0.00024023036530707 
0.00283417757600546 -7.41797994123772e-05 
0.0027412953786552 -0.000126378276036121 
0.00274712103419006 -0.000250954530201852 
0.00284918770194054 -0.000268453062744811 
0.00303144589997828 -6.84188780724071e-05 
0.00325377774424851 -6.55975381960161e-05 
0.00347668468020856 -0.000190178427146748 
0.00366206676699221 -0.000360281963367015 
0.00379455066286027 -0.000330351991578937 
0.0038429843261838 -0.000290520605631173 
0.00382738397456706 -0.000252525554969907 
0.00375704211182892 -0.000241493587964214 
0.00366120878607035 -0.000227256241487339 
0.00360075710341334 -0.000227101030759513 
0.00363696250133216 -0.000406637031119317 
0.00386437983252108 -0.000535398779902607 
0.00432133767753839 -0.000675657764077187 
0.00512411585077643 -0.000783012132160366 
0.00643897755071521 -0.000820621615275741 
0.0084785558283329 -0.00103773095179349 
0.0115480348467827 -0.000736591056920588 
0.0158949941396713 -0.000865968526341021 
0.0217948742210865 -0.000110869106720202 
0.0293271373957396 0.00116027134936303 
0.0381444282829762 0.00266104028560221 
0.0477151870727539 0.0037285415455699 
0.0575426891446114 0.00535620236769319 
0.0669565945863724 0.00728278094902635 
0.0758037343621254 0.00591116631403565 
0.0835837945342064 0.00575851695612073 
0.0904561802744865 0.00474765291437507 
0.0965282618999481 0.00484763132408261 
0.101720757782459 0.0056517873890698 
0.106077916920185 0.00741562619805336 
0.109549179673195 0.00994348805397749 
0.112556770443916 0.00968206766992807 
0.115058720111847 0.00560054695233703 
0.117193713784218 0.00529483566060662 
0.118939325213432 0.00284354435279965 
0.120750389993191 0.00678090751171112 
0.12231769412756 0.00402438221499324 
0.12351942807436 0.00631713308393955 
0.124389089643955 0.00456335488706827 
0.124936193227768 0.00986124388873577 
0.125376909971237 0.0105387680232525 
0.125583037734032 0.00772234704345465 
0.125833377242088 0.00727327447384596 
0.126029953360558 0.00813154503703117 
0.126359358429909 0.00702128699049354 
0.126654729247093 0.00305063603445888 
0.127092853188515 0.00327793275937438 
0.12739160656929 0.00995498709380627 
0.127529323101044 0.0106334192678332 
0.127695530653 0.0105150938034058 
0.127499476075172 0.000703587720636278 
0.127249360084534 0.000153797736857086 
0.126863092184067 -0.00300107896327972 
0.126865193247795 0.00433119898661971 
0.126573547720909 0.00385309313423932 
0.126203566789627 0.00494764698669314 
0.125693425536156 0.000523631228134036 
0.125345885753632 -0.000592293858062476 
0.124945133924484 -0.00722942454740405 
0.124161571264267 -0.0066839805804193 
0.123524218797684 -0.00348186306655407 
0.122750796377659 0.00289067276753485 
0.122256353497505 0.00601006951183081 
0.121542751789093 0.00309797679074109 
0.120840728282928 -0.00444743549451232 
0.119991436600685 -0.00586688425391912 
0.119013942778111 -0.006203418597579 
0.11790008097887 -0.00277906935662031 
0.116693340241909 -0.00251706410199404 
0.115707047283649 -0.00491199316456914 
0.114596523344517 -0.00585974799469113 
0.113654851913452 -0.00854626670479774 
0.112886607646942 -0.00664647063240409 
0.112433843314648 -0.00204855529591441 
0.112195834517479 -0.000269452924840152 
0.111683882772923 -0.000108543084934354 
0.111207090318203 -0.00424098549410701 
0.110323928296566 -0.00407042494043708 
0.109224900603294 -0.00549780577421188 
0.107585452497005 -0.00300306058488786 
0.106036812067032 -0.00590536231175065 
0.104393765330315 -0.00715790688991547 
0.102465957403183 -0.00852265395224094 
0.100390322506428 -0.00721165630966425 
0.0982651561498642 -0.00597475050017238 
0.0963722094893456 -0.00873150210827589 
0.0946143642067909 -0.00860989559441805 
0.0928883999586105 -0.0119111612439156 
0.0915180295705795 -0.0123466551303864 
0.0900402665138245 -0.0101419435814023 
0.0884534642100334 -0.00431171013042331 
0.0869183763861656 -0.00131583388429135 
0.0851207301020622 -0.00290864543057978 
0.0833753198385239 -0.00340295862406492 
0.0813822895288467 -0.00617615412920713 
0.0792133212089539 -0.00558381108567119 
0.0770900323987007 -0.00581151712685823 
0.0750380828976631 -0.00446457229554653 
0.0729597806930542 -0.00340229994617403 
0.0707491561770439 -0.00295205786824226 
0.0682908445596695 0.000188137317309156 
0.065909706056118 0.000370254914741963 
0.0635063424706459 0.00283875525929034 
0.0608841590583324 0.00387745653279126 
0.0583639778196812 0.00762492604553699 
0.0557937994599342 0.00920091941952705 
0.0533413738012314 0.0115351118147373 
0.0507030002772808 0.0102633982896805 
0.0481591038405895 0.0126727232709527 
0.0456357412040234 0.0129427695646882 
0.0432139970362186 0.0174925234168768 
0.0406067445874214 0.0188622362911701 
0.0380474925041199 0.023284338414669 
0.0354955121874809 0.0238241739571095 
0.0329876840114594 0.0256280675530434 
0.0301943123340607 0.0258317701518536 
0.0272846817970276 0.0267567969858646 
0.0244168788194656 0.0271644424647093 
0.0217308290302753 0.0274597872048616 
0.0192393381148577 0.0277674365788698 
0.0168273597955704 0.0269019939005375 
0.0146040320396423 0.0266745984554291 
0.0124224070459604 0.0251780673861504 
0.0104531701654196 0.0237722061574459 
0.00864230934530497 0.0210159439593554 
0.00705771753564477 0.0184930600225925 
0.00566901732236147 0.0154850287362933 
0.00447286432608962 0.0129002314060926 
0.00346926646307111 0.0101308198645711 
0.00264456681907177 0.00796578172594309 
0.00199842848815024 0.00592697970569134 
0.00149348832201213 0.00422719260677695 
0.00110739865340292 0.00263675791211426 
0.000817979336716235 0.00152706436347216 
0.000630023598205298 0.000900186947546899 
0.000482835224829614 0.000550374912563711 
0.000379033182980493 0.000240555120399222 
0.000295262725558132 2.09427671507001e-05 
0.000243829796090722 -0.000185702738235705 
0.000207014978514053 -0.000175985725945793 
0.000181280032848008 -0.000166458412422799 
0.000150082254549488 -0.000211146951187402 
0.000128911531646736 -0.000275441387202591 
0.000105717677797657 -0.000224201619857922 
9.70533001236618e-05 -0.000143252254929394 
7.59828108130023e-05 -0.000200109541765414 
6.17911937297322e-05 -0.000322971871355549 
5.85227971896529e-05 -0.000211273494642228 
5.63336798222736e-05 -0.000143558616400696 
6.17898913333192e-05 7.02154238751973e-06 
4.2882478737738e-05 -5.5615291785216e-05 
4.14283604186494e-05 2.02328956220299e-05 
3.19468308589421e-05 -7.60086504669744e-06 
4.99061425216496e-05 2.41680518229259e-05 
4.8039153625723e-05 -3.27083143929485e-05 
4.34768844570499e-05 -6.79297008900903e-05 
3.52625975210685e-05 -6.46945773041807e-05 
3.83661717933137e-05 -1.81360610440606e-05 
