0 0 0 0 
0 0 0 0 
0 0 0 0 
0 0 0 0 
0 0 0 0 
0 0 0 0 
0 0 0 0 
0 0 0 0 
0 0 0 0 
0 0 0 0 
0.00164216849952936 1.2980819974473e-06 -1.06622752293895e-10 -3.45226985887237e-10 
0.00192049390170723 1.45483386404521e-06 8.10821205732282e-08 1.84287699767083e-07 
0.00214923219755292 1.38339066779736e-06 6.20181372923412e-09 -2.64422284068644e-09 
0.00237123691476882 1.24742018670077e-06 -2.42798677163591e-07 -1.72692253386231e-07 
0.00257214880548418 9.73035298557079e-07 2.99358021038643e-07 -2.18232383275563e-08 
0.00272899167612195 6.26015321358864e-07 -1.94881195625385e-07 2.20481766177727e-07 
0.00283606047742069 3.28943087879452e-07 5.48561978064299e-08 -1.18473529653329e-07 
0.00288876844570041 5.57238344356392e-08 -4.08130151896557e-09 1.49212535660581e-08 
0.00288145430386066 -1.09069887344049e-07 -2.5286930882551e-10 1.32378474848593e-09 
0.00279510277323425 -1.80062102117517e-07 -8.1581970345912e-11 -9.62283794314622e-11 
0.00266202283091843 -2.07183688871737e-07 -1.1720655002101e-10 -5.45816794539355e-11 
0.00250501069240272 -2.76105254215508e-07 1.89714823711773e-11 1.90704535496522e-11 
0.00234997947700322 -3.33149841935665e-07 -1.99740519263303e-11 2.4759996136714e-11 
0.00222316011786461 -4.04236430995297e-07 4.05439327944013e-11 -7.16941367384649e-11 
0.00215260265395045 -4.7830440053076e-07 -2.97487139089281e-11 2.01400788407691e-11 
0.00215029739774764 -5.37619882834406e-07 -1.28229704632332e-10 3.43111615508374e-11 
0.00221761665306985 -5.67426468478516e-07 -1.95054569718245e-10 1.21109386408413e-10 
0.00234020478092134 -5.84348981647054e-07 -1.26520377508044e-10 3.71675502874869e-11 
0.00249615381471813 -5.67932374906377e-07 -3.60139140731519e-11 1.91405349903029e-10 
0.00265873246826231 -5.74742955450347e-07 -1.96909225036457e-10 1.5287988930357e-10 
0.0027976050041616 -5.79415313950449e-07 -1.91559546003361e-11 -2.60822387992965e-11 
0.00289096310734749 -6.01216527229553e-07 -2.44505526936223e-10 3.47177953052835e-10 
0.00292998622171581 -5.94356947658525e-07 -1.42053147023091e-10 7.61317675568307e-11 
0.00291246944107115 -6.47208139525901e-07 -8.19530970863624e-11 -1.31767236011271e-10 
0.00284344609826803 -6.94211166774039e-07 -1.07826428341617e-10 -3.37655528537262e-11 
0.00275989156216383 -7.31354532490514e-07 -8.40462005546883e-11 1.06393074905675e-10 
0.00271636061370373 -6.84060466937808e-07 -1.0819238560611e-10 -1.0609794293126e-11 
0.00275977631099522 -6.77107664159848e-07 -6.36713876067674e-11 1.15749798634823e-10 
0.0029482317622751 -6.04991271302424e-07 -7.43858794005625e-11 -1.04975722559075e-10 
0.00338384578935802 -4.65732853172085e-07 5.58147521256824e-11 -8.2062384665349e-11 
0.00415262347087264 -3.41567641726215e-07 4.71823899395041e-11 5.35398912704377e-11 
0.00538835115730762 -4.36282249438591e-07 2.70322736417583e-10 -2.12846379410436e-10 
0.00730295898392797 -4.1908396042345e-07 2.73475603274065e-10 -3.30719979180216e-10 
0.010106023401022 -6.52536527923075e-07 -3.33770289184798e-10 -1.00335122155126e-10 
0.0140300439670682 -1.07971118268324e-06 1.16199015687268e-10 -3.67524011224418e-10 
0.0192512925714254 -1.52681707277225e-06 2.55302112783795e-10 6.26998730712813e-11 
0.0259185656905174 -2.17854972106579e-06 -1.3295993195328e-09 8.01543664774584e-10 
0.0337022505700588 -3.53835048372275e-06 -7.4942529959543e-10 1.04550403057235e-10 
0.0422309525310993 -4.10725760957575e-06 4.05589506424775e-10 -3.06806802186088e-09 
0.0514159984886646 -5.20298863193602e-06 -1.8409928026486e-09 9.68564228820412e-10 
0.0605341047048569 -4.88053092340124e-06 -1.01194930213211e-09 -7.39989458597989e-10 
0.0690537914633751 -4.70284476250526e-06 7.54739881703159e-10 -1.17082565864735e-09 
0.0770692601799965 -4.2625388232409e-06 -3.83485421195928e-09 3.5066909376269e-09 
0.0845369398593903 -3.51878134097205e-06 -2.93045920862767e-09 2.66480948418746e-10 
0.0911410599946976 -2.31351418733539e-06 6.9194067142675e-10 -3.61040508600752e-09 
0.0965990051627159 -2.28491239795403e-06 3.49444340130844e-09 1.05871134081781e-09 
0.101436711847782 -1.19818071198097e-06 1.8795627276802e-09 -1.60713931052214e-09 
0.105512171983719 -1.90804144040158e-07 7.81878617406306e-10 7.23476445418925e-10 
0.108746200799942 1.70091198015143e-07 9.24678444924609e-10 -5.4882538513823e-09 
0.11137555539608 4.68351316840199e-07 4.93235896570354e-09 -7.01339653019772e-09 
0.114005967974663 -5.28875609973056e-08 8.22099099906382e-09 -8.02663446819452e-09 
0.116206638514996 -1.16127807814337e-06 2.78289480348803e-09 7.72901409540339e-10 
0.117961160838604 -2.75609340860683e-06 5.32220267857042e-09 -4.3359107415597e-09 
0.119468986988068 -4.77302046419936e-06 -2.88171242424085e-09 7.1263555057044e-09 
0.120668791234493 -4.77907587992377e-06 7.12461156737731e-09 -3.2618259204753e-09 
0.121550172567368 -3.45513649335771e-06 4.33680757971899e-10 -2.71539102314478e-09 
0.122257828712463 -4.07940979130217e-06 8.01103983150142e-09 -8.76441141883788e-09 
0.122889615595341 -1.14339695755916e-06 -6.67387034525291e-09 6.2312173199075e-09 
0.12340072542429 2.0861123175564e-06 -6.9616561404473e-09 1.41952793963895e-09 
0.123843900859356 3.50697155226953e-06 2.76176526092797e-09 -7.14977854698873e-09 
0.124313816428185 4.64442109660013e-06 -1.27757795453931e-08 3.40257266806532e-09 
0.124890871345997 7.15761007086257e-06 -2.8094007675783e-10 -5.1133186573793e-09 
0.125666365027428 6.20321179667371e-06 3.31516436524737e-09 2.57744492415668e-09 
0.126902356743813 3.18247839459218e-06 -3.70793351578413e-09 5.40380229452353e-09 
0.127476572990417 1.66591883044021e-06 1.24842514104273e-09 4.06937677999153e-10 
0.128110975027084 1.25176370602276e-06 -4.46910242146714e-09 4.33405711319779e-09 
0.128724947571754 2.11222709367576e-06 -2.76641620722273e-09 2.9132880552396e-09 
0.128701075911522 4.10511120207957e-06 2.59320520612505e-09 -3.64501762106784e-09 
0.128501042723656 9.07860339793842e-06 -1.07659869907906e-09 4.73752370666602e-09 
0.128532618284225 1.12380766950082e-05 2.87708235013895e-09 -6.12259798415948e-10 
0.128801375627518 1.03061211120803e-05 -2.94361135466659e-09 -3.65897312448737e-09 
0.128558129072189 7.23715947970049e-06 -8.89019968752791e-10 7.06083247425937e-10 
0.128570526838303 6.35515425528865e-06 1.6706304117875e-09 -1.62689839378061e-09 
0.128078833222389 4.94011328555644e-06 1.35404942813722e-09 -2.77831624373448e-09 
0.128245130181313 1.9794131276285e-06 -2.0211250451041e-09 1.09253595059755e-09 
0.127756401896477 4.02646310249111e-06 -3.58234641950617e-09 5.18066833876674e-09 
0.127092853188515 5.25671975992736e-06 -9.12286579612953e-10 4.61815963248569e-09 
0.1267961114645 2.54961832979461e-06 9.21124343467028e-10 7.62839680312766e-10 
0.126237198710442 2.13912153412821e-06 5.80808823258394e-09 -4.85260942539867e-09 
0.125551715493202 1.93199139175704e-06 -7.48735384803467e-09 5.5431224055269e-09 
0.124540820717812 1.03882496205188e-06 -1.16221726687016e-10 -2.22878959732498e-09 
0.123806871473789 2.12210579775274e-06 -4.31507318765512e-09 -2.17438489436006e-09 
0.122693441808224 4.11270548283937e-06 -1.87987581057314e-09 3.64560825971694e-09 
0.121861360967159 3.39926486958575e-06 -8.62743598784022e-10 -2.44251929792938e-09 
0.120742596685886 1.89363095159933e-06 4.70695082910311e-09 3.17802162363989e-09 
0.120182774960995 -1.18298305551434e-06 -1.05654631710195e-08 3.9099483650773e-09 
0.119460344314575 -2.03228751161078e-06 8.00138000300876e-09 -1.4061172226576e-09 
0.118405871093273 -2.21344112105726e-06 -1.44267275903331e-09 1.76457093381543e-09 
0.117545537650585 -1.88831802461209e-06 -4.32049462872897e-09 9.42099021017384e-09 
0.116975501179695 -3.26781758985817e-07 2.16990869716938e-09 -4.12086187395744e-09 
0.116312600672245 -2.42379724113562e-06 2.06223010890128e-10 3.24965387932252e-10 
0.115523546934128 -3.28091800838592e-06 1.97850114069809e-09 -5.32561217347904e-10 
0.115142799913883 -3.23270774060802e-06 -2.39104347432573e-10 7.95098298311814e-09 
0.114974446594715 -4.46183503299835e-06 1.4023391337048e-09 4.97806285082447e-09 
0.113923408091068 -1.76312971689185e-06 -1.2156740059055e-09 1.40835210160617e-09 
0.112224370241165 1.68539440892346e-06 3.85419030024536e-09 -2.63852872883774e-09 
0.110670857131481 2.42811665884801e-06 -1.43542178143719e-09 -2.46339326714917e-09 
0.108777426183224 2.64680784312077e-06 7.46816208874179e-09 -8.38256752899724e-09 
0.10659209638834 2.58169211519998e-06 4.38083702647418e-09 1.43997369583815e-09 
0.10451877862215 1.64501318522525e-06 1.73488179378012e-09 -4.09274364399081e-10 
0.102703765034676 2.10994085136917e-06 -3.20183191071521e-09 1.82078696564503e-09 
0.100752383470535 3.00558963317599e-06 3.40023009748336e-10 -2.21384621745813e-09 
0.0986885949969292 1.3080813232591e-06 1.71667025039568e-09 -4.35606217763507e-09 
0.0967682152986526 2.123345268501e-07 1.17992549064638e-09 2.48114861989279e-09 
0.0947276577353477 -3.02119588013738e-07 2.64111110759302e-09 -6.18283380049434e-09 
0.0928920209407806 -1.8928614053948e-06 4.9553594561047e-10 -3.1531035560306e-09 
0.0913201719522476 -5.4031957006373e-06 -3.75827902132642e-09 5.44324807449925e-09 
0.0897761359810829 -5.35908338861191e-06 -2.21788387655408e-09 -1.5097349759241e-10 
0.0880821272730827 -5.9324220273993e-06 6.0063922724396e-09 -7.31998239800191e-09 
0.0863244906067848 -5.70769952901173e-06 -5.67232871784284e-10 -8.89057716335628e-10 
0.0845743268728256 -3.90631657865015e-06 4.37993336044329e-10 9.34942123720361e-11 
0.0825630575418472 -1.49013897043915e-06 3.15715814602768e-10 -1.75733283480639e-09 
0.0806107893586159 -2.0157588096481e-06 2.20987539378825e-09 -2.53003229477855e-10 
0.0780450850725174 -7.45299644222541e-07 -5.77990544314844e-09 1.39254296982472e-09 
0.0757252797484398 -3.21085894938733e-06 -2.750098593296e-09 6.46057385367271e-09 
0.0731145516037941 -5.73201486986363e-06 -2.22646456826681e-09 -5.06982927861443e-11 
0.0705566108226776 -6.97374616720481e-06 3.67942926127185e-10 -1.31759733332237e-11 
0.0676029026508331 -5.10899963046541e-06 1.03631103698376e-09 2.91056845291848e-09 
0.0646896660327911 -5.54362304683309e-06 -2.72694156144837e-09 1.77050119010147e-09 
0.0618052147328854 -5.84325835006894e-06 -8.29846080740992e-10 -1.2812321203981e-09 
0.0587537325918674 -4.93825018565985e-06 2.70892996923067e-09 9.78812697560727e-10 
0.0554115474224091 -5.33800493940362e-06 -3.15304604647793e-09 6.9197902963225e-10 
0.0523459725081921 -7.69847702031257e-06 -1.23155252662599e-09 2.26011187542952e-09 
0.0493778921663761 -8.35480204841588e-06 7.61948948380109e-10 9.07993846777089e-10 
0.0461386404931545 -6.7946557464893e-06 1.01664753004993e-10 2.06324757279219e-09 
0.042995635420084 -7.27110136722331e-06 -2.46272202630848e-09 1.89957116702999e-09 
0.039985153824091 -7.40710038371617e-06 1.91240592806174e-10 1.57094637298627e-09 
0.0367899648845196 -6.49611865810584e-06 -2.05954742149572e-09 2.97422253492385e-10 
0.0336659029126167 -6.1719615587208e-06 3.95674298880877e-10 -8.33957514156936e-10 
0.030655138194561 -6.48194691166282e-06 6.41038055970711e-10 -1.03439945497996e-09 
0.0277371183037758 -6.0781881074945e-06 -5.37811239986752e-10 -2.888105588017e-10 
0.0246712956577539 -4.86894487039535e-06 6.2844085491065e-10 -1.89965862484875e-10 
0.0217251274734735 -4.46377089247108e-06 -5.06312047843238e-10 -6.08439271188033e-11 
0.018787270411849 -3.83056476493948e-06 -1.04717712279268e-09 3.44111378280942e-10 
0.0159810855984688 -3.44712452715612e-06 2.91761420578851e-10 3.26227433955495e-10 
0.013305613771081 -2.96342932415428e-06 -7.24414583874733e-10 -2.26475338482857e-10 
0.0110425595194101 -3.32051740770112e-06 -6.27481788750828e-10 4.7699655336686e-10 
0.00903734099119902 -3.34165747517545e-06 -7.51549489308445e-10 4.36963451533323e-11 
0.00728326244279742 -3.21592347063415e-06 -2.63040811354642e-10 1.58254340187902e-10 
0.0057706474326551 -2.89488548332884e-06 -5.20419707328301e-10 4.9616245140216e-11 
0.00450192391872406 -2.63970810010505e-06 -4.19135559592831e-10 2.22908830282975e-10 
0.00341448141261935 -2.16745229408843e-06 -3.60700080914711e-10 2.24267701631753e-10 
0.00256569939665496 -1.94485164684011e-06 -2.46376502532897e-10 -9.15992108552199e-12 
0.00188456603791565 -1.68744747952587e-06 -2.02355313061453e-10 6.65065528690501e-12 
0.00135546026285738 -1.5027535482659e-06 -1.8359284925662e-10 2.18349140851393e-11 
0.000955507741309702 -1.38280381634104e-06 -1.89359278257584e-10 1.22963340898341e-11 
0.000663636194076389 -1.36607718559389e-06 -1.78830575348066e-10 3.36661080957423e-11 
0.000445651268819347 -1.37096992602892e-06 -1.59315047265629e-10 2.64588091020146e-11 
0.000280770036624745 -1.39324686188047e-06 -1.71601913234731e-10 1.28018212350312e-11 
0.00016548263374716 -1.38699090257433e-06 -1.66325189732142e-10 2.41418517121783e-11 
8.40474458527751e-05 -1.37337724481768e-06 -1.64623703557965e-10 1.89267039540919e-11 
2.57299598160898e-05 -1.33167611693352e-06 -1.5797732566547e-10 1.76584424166348e-11 
-1.23424160847208e-05 -1.27034252273006e-06 -1.494491613796e-10 1.50007072735603e-11 
-3.67901557183359e-05 -1.18621460387658e-06 -1.40129213788143e-10 1.18103591142948e-11 
-5.28904638485983e-05 -1.11219253540185e-06 -1.30814789556233e-10 1.19669309184278e-11 
-6.47790875518695e-05 -1.02994488315744e-06 -1.18307974528165e-10 5.53000267106141e-12 
-7.19679446774535e-05 -9.4916202897366e-07 -1.14803354323012e-10 1.01930044266174e-11 
-7.76077868067659e-05 -8.84143560142547e-07 -1.04556661939537e-10 4.45865957002245e-12 
-8.2968435890507e-05 -8.36688855088141e-07 -9.60896431867475e-11 2.56709128780563e-12 
-8.67416529217735e-05 -7.8947493875603e-07 -9.46710210225632e-11 9.56201003793344e-12 
-9.19902304303832e-05 -7.56976589855185e-07 -9.07696071084096e-11 5.19201565421512e-12 
0 0 0 0 
0 0 0 0 
0 0 0 0 
0 0 0 0 
0 0 0 0 
0 0 0 0 
0 0 0 0 
0 0 0 0 
0 0 0 0 
0 0 0 0 
0 0 0 0 
0 0 0 0 
0 0 0 0 
0 0 0 0 
99.9942932128906 0.00452353432774544 4.44361976406071e-05 3.58376637450419e-05 
