0 0 0 0 
0 0 0 0 
0 0 0 0 
0 0 0 0 
0 0 0 0 
0 0 0 0 
0 0 0 0 
0 0 0 0 
0 0 0 0 
0 0 0 0 
-0.000339714897563681 -6.05319712576602e-07 -1.56683688601333e-06 -4.19055737665985e-07 
-0.000309621042106301 -7.22216043413937e-07 -1.55914722199668e-06 -4.52764737701727e-07 
-0.000271655968390405 -1.10629468963452e-06 -1.69882753198181e-06 -4.82330278828158e-07 
-0.000137238501338288 -1.58863269916765e-06 -1.95074335351819e-06 -5.6481559340682e-07 
0.000247082469286397 -2.13987800634641e-06 -2.27511486627918e-06 -6.50272170332755e-07 
0.000828563759569079 -2.52922859544924e-06 -2.50290213443805e-06 -6.86189991938591e-07 
0.0014803089434281 -2.60985984823492e-06 -2.56978069046454e-06 -6.99622205502237e-07 
0.00211163703352213 -2.42454711951723e-06 -2.48954734161089e-06 -6.60734599478019e-07 
0.00259682349860668 -2.00659383153834e-06 -2.23137612920254e-06 -5.60462638077297e-07 
0.00277264253236353 -1.4468007520918e-06 -1.86631700671569e-06 -4.45672640125849e-07 
0.002687007188797 -1.0402270618215e-06 -1.5871581808824e-06 -3.70396207927115e-07 
0.002490249928087 -8.52973585097061e-07 -1.42907879308041e-06 -3.05014509649482e-07 
0.00227448879741132 -7.86650105055742e-07 -1.33537355395674e-06 -2.56034724088749e-07 
0.00210212310776114 -7.65514982958848e-07 -1.25359247249435e-06 -2.25417565502539e-07 
0.00200517335906625 -8.15742623672122e-07 -1.22906385513488e-06 -2.03500462703232e-07 
0.00199702614918351 -8.56275960359199e-07 -1.21078687698173e-06 -1.75391463130836e-07 
0.0020710276439786 -9.00128156899882e-07 -1.22441304029053e-06 -1.63613947279373e-07 
0.00221516098827124 -9.32334216940944e-07 -1.24170924209466e-06 -1.50233375961761e-07 
0.00239959126338363 -9.3070474349588e-07 -1.26423731217074e-06 -1.19282006494359e-07 
0.00259020086377859 -8.95375819709443e-07 -1.24652194699593e-06 -1.02865826079324e-07 
0.00275519397109747 -8.50942512897745e-07 -1.24502673770621e-06 -8.60840643213123e-08 
0.00286312540993094 -8.0876549191089e-07 -1.21139521525038e-06 -7.16002901413049e-08 
0.00289663556031883 -7.68823497310223e-07 -1.20946356219065e-06 -6.75877345202025e-08 
0.00284135551191866 -7.97879181391181e-07 -1.30149771848664e-06 -9.86575443562288e-08 
0.00271007372066379 -8.35058017401025e-07 -1.48254912346601e-06 -1.31782158518945e-07 
0.00258539221249521 -8.71338500019192e-07 -1.64659843449044e-06 -1.55979648752691e-07 
0.00254510925151408 -9.04924718270195e-07 -1.78067602973897e-06 -1.4823926619556e-07 
0.00263982452452183 -9.58293071562366e-07 -1.88668946066173e-06 -1.01638690352956e-07 
0.00294062960892916 -9.71293957263697e-07 -1.9954434264946e-06 -2.60763659554186e-08 
0.00353407277725637 -1.00693796412088e-06 -2.14601163861516e-06 8.97728611448656e-08 
0.00448904279619455 -1.17544675504178e-06 -2.40923213823407e-06 2.05010266540739e-07 
0.00593742309138179 -1.47812363593403e-06 -2.87146826849494e-06 3.60379658559395e-07 
0.00810085888952017 -1.92648940355866e-06 -3.53434325006674e-06 4.41512469251393e-07 
0.01125752273947 -2.49270624408382e-06 -4.28281509812223e-06 5.19503316809278e-07 
0.0156130054965615 -3.50107598023897e-06 -5.07315462527913e-06 5.74608634451579e-07 
0.021376321092248 -4.41537986262119e-06 -5.69662324778619e-06 6.7471796683094e-07 
0.0285902470350266 -5.94149832977564e-06 -6.00980320086819e-06 6.98780013408395e-07 
0.0370304808020592 -7.25312111171661e-06 -5.5133364185167e-06 7.38479741357878e-07 
0.0463010035455227 -8.60551517689601e-06 -4.76154355055769e-06 7.32360547317512e-07 
0.0560064315795898 -9.05985962162958e-06 -3.61288243766467e-06 3.39977304975037e-07 
0.0653910636901855 -9.32930470298743e-06 -2.02250976144569e-06 3.70738995059128e-08 
0.0740464925765991 -7.7153717938927e-06 -2.93516649207959e-07 -7.42735792869098e-08 
0.0819463133811951 -6.91363993610139e-06 1.37866106797446e-06 -2.71590153033685e-07 
0.0888519287109375 -5.541936843656e-06 2.97715951091959e-06 -4.61451918454259e-07 
0.0947093069553375 -5.37858477400732e-06 4.88465047965292e-06 -3.25370564269178e-07 
0.0996617078781128 -4.97982318847789e-06 5.9758990573755e-06 -7.91583886439184e-07 
0.103933244943619 -4.61956642539008e-06 7.74551426729886e-06 -8.96029746400018e-07 
0.107547268271446 -4.36326990893576e-06 8.64296544023091e-06 -8.7071686039053e-07 
0.110595509409904 -4.24218433181522e-06 9.44093244470423e-06 -1.26191844174173e-06 
0.113261356949806 -3.56651958099974e-06 8.50643573357956e-06 -1.32534694330388e-06 
0.115771412849426 -4.08341520596878e-06 8.19083379610674e-06 -8.58808050452353e-07 
0.118100665509701 -5.74173054701532e-06 6.74496777719469e-06 -1.04077821561077e-06 
0.120021723210812 -6.9048751356604e-06 5.65824166187667e-06 -6.68992583996442e-07 
0.121853455901146 -7.07389153831173e-06 3.71376313523797e-06 -1.66117544608824e-07 
0.123359099030495 -7.99933968664845e-06 2.30559794545115e-06 1.39657259978776e-07 
0.124490484595299 -7.33218939785729e-06 8.63573347942292e-07 2.46966436634466e-07 
0.125228002667427 -6.14517057329067e-06 -1.16206926747964e-07 8.19835690890613e-07 
0.125608831644058 -4.42173404735513e-06 -1.42311603212875e-06 6.27180554602091e-07 
0.125751286745071 -4.01983606934664e-06 -1.39792143727391e-06 5.38128233529278e-07 
0.125929102301598 -2.3099937607185e-06 -1.34600577439414e-06 8.52662992656406e-07 
0.126105919480324 -3.80671110633557e-07 -9.91635147329362e-07 1.6821968529257e-06 
0.126473680138588 7.46110629279428e-07 -1.16062949473417e-06 1.7360755464324e-06 
0.127041816711426 2.46443141804775e-06 6.22911727532482e-07 2.17660635826178e-06 
0.127484053373337 3.0791595690971e-06 2.70584536110619e-07 3.03497108689044e-06 
0.127930164337158 4.26618998972117e-06 1.37782194542524e-06 3.12828296955558e-06 
0.128323033452034 4.67058680442278e-06 2.4249186481029e-06 1.67117059390876e-06 
0.128537714481354 5.99210034124553e-06 4.18058380091679e-06 1.53561052229634e-06 
0.12868894636631 6.29305986876716e-06 4.10048551202635e-06 5.74586692891899e-07 
0.128479897975922 7.42344445825438e-06 6.01045348957996e-06 -6.81812139191607e-07 
0.128077358007431 5.13726445205975e-06 6.55471058053081e-06 -1.69229008406546e-06 
0.127233222126961 4.5856213546358e-06 4.78069887321908e-06 -1.03373304227716e-06 
0.126439124345779 2.33687160289264e-06 2.97103474622418e-06 -9.94568495116255e-07 
0.12539629638195 -9.95777099888073e-07 7.38426535917824e-07 -2.71317247779734e-07 
0.124889954924583 -4.08295181841822e-06 -1.75259128809557e-06 7.39120650905534e-07 
0.124347858130932 -5.08346238348167e-06 -2.16150078813371e-06 1.00580746220658e-06 
0.12423911690712 -6.74620059726294e-06 -2.31944090955949e-06 1.48987896864128e-06 
0.123809650540352 -6.70260033075465e-06 -3.96576115235803e-06 1.84640509814926e-06 
0.1235710978508 -5.05783782500657e-06 -3.0962305572757e-06 2.41675502365979e-06 
0.12285827845335 -3.00340548164968e-06 -2.10431312552828e-06 2.32017055168399e-06 
0.121940366923809 -1.09523341507156e-06 -3.53678456121997e-06 3.89981869375333e-06 
0.120958872139454 1.01321290912892e-06 -2.3983432129171e-06 3.67055827155127e-06 
0.119874052703381 1.63624986271316e-06 -1.18045716135384e-06 3.30280340676836e-06 
0.118623621761799 2.31848366638587e-06 -7.33046988443675e-07 2.38806683228177e-06 
0.117488533258438 1.86963802661921e-06 3.21249427059911e-09 2.32452953241591e-06 
0.116372846066952 2.93913808491197e-06 2.21358118324133e-06 2.48433138949622e-07 
0.115149453282356 2.27368059313449e-06 2.63766287389444e-06 -7.02120757978264e-07 
0.114071287214756 2.52092831942718e-06 3.51107951246377e-06 -1.39020244205312e-06 
0.113330818712711 2.55759164247138e-06 4.27144277637126e-06 -2.12247800845944e-06 
0.112644799053669 2.7548335310712e-06 4.04739830628387e-06 -2.7200933345739e-06 
0.112205892801285 3.1651100016461e-06 2.68567669081676e-06 -2.52233348874142e-06 
0.11177783459425 4.45578507424216e-06 1.88034061920916e-06 -2.12413988265325e-06 
0.111554048955441 5.03410501551116e-06 2.27351051762525e-06 -1.08270194232318e-06 
0.11109471321106 4.34455523645738e-06 9.00343593457364e-07 -4.77081357530551e-07 
0.110450901091099 5.20528874403681e-06 4.75580719694335e-07 -2.28870590035513e-07 
0.109503537416458 3.52730808117485e-06 -2.03863184111697e-08 5.5273254417898e-08 
0.108370453119278 6.76532465604396e-07 -7.79724985022767e-07 -9.06741774997499e-08 
0.106768064200878 3.88742051882218e-07 -2.28362546295102e-06 -8.75099317454442e-07 
0.104729630053043 -5.36493587333098e-07 -2.5422232283745e-06 -1.06020593193534e-06 
0.102717630565166 -1.60574131768954e-06 -3.01894692711357e-06 -1.57820409185661e-06 
0.100534364581108 -1.5534152453256e-06 -4.61904164694715e-06 -9.98846871880232e-07 
0.0983257591724396 -1.83468659997743e-06 -4.06979506806238e-06 -1.10886583115644e-06 
0.0962704718112946 -3.66562062481535e-06 -4.02318983105943e-06 -1.17618276362919e-06 
0.0944741144776344 -3.94737253373023e-06 -3.77729816136707e-06 -3.27694806401269e-07 
0.0927778705954552 -4.71275870950194e-06 -4.11979090131354e-06 2.9290185921127e-07 
0.091295912861824 -4.26889209848014e-06 -2.2731489934813e-06 4.35791235986471e-07 
0.0900076925754547 -2.85745477413002e-06 -2.34380604524631e-06 1.21144432796427e-06 
0.0887244120240211 -8.79316758073401e-07 -1.66789152444835e-06 1.46873821904592e-06 
0.0875188037753105 1.20124150271295e-06 -2.99352973343048e-06 4.39574364463624e-07 
0.0860616266727448 4.42325381300179e-06 -2.95411359729769e-06 -8.30270181495507e-08 
0.0845551937818527 5.95756591792451e-06 -3.90464629163034e-06 -9.97257075141533e-07 
0.0830619335174561 8.02967133495258e-06 -4.4379535211192e-06 -1.2710750070255e-06 
0.0812523663043976 8.08875756774796e-06 -4.14321266362094e-06 -1.53746975684044e-06 
0.0790947154164314 8.20806144474773e-06 -3.14594967676385e-06 -1.67262987815775e-06 
0.0771223977208138 7.20924072084017e-06 -3.7743895973108e-06 -1.82342364496435e-06 
0.0749339684844017 7.4509744081297e-06 -3.37072424372309e-06 -1.85881174274982e-06 
0.0724929347634315 6.49699813948246e-06 -2.98863187708776e-06 -1.91898288903758e-06 
0.0702448487281799 6.29162514087511e-06 -3.04794548355858e-06 -1.737364868859e-06 
0.0681517496705055 5.6558951655461e-06 -3.11411486109137e-06 -1.33529249524145e-06 
0.0659877061843872 5.0645994633669e-06 -2.18467152990343e-06 -1.25389919958252e-06 
0.0638500154018402 3.86651436201646e-06 -2.24190944209113e-06 -1.30778539642051e-06 
0.061691626906395 3.44931049767183e-06 -2.62391017713526e-06 -1.69098962032876e-06 
0.0596295297145844 2.46264062297996e-06 -2.80433005173109e-06 -2.02395631276886e-06 
0.05755814909935 1.16974081265653e-06 -3.40674728249724e-06 -2.14240913010144e-06 
0.0555818006396294 7.01686815318681e-08 -3.35689128405647e-06 -1.6102230802062e-06 
0.0538102686405182 -7.19804233995092e-07 -3.77203764401202e-06 -1.21015739296126e-06 
0.0521621443331242 -2.06898880605877e-06 -4.17678302255808e-06 -1.04163075320685e-06 
0.0504868887364864 -2.13315001929004e-06 -5.30127817910397e-06 -7.03575778970844e-07 
0.0488763004541397 -1.31516253532027e-06 -5.61288743483601e-06 -4.52228334779647e-07 
0.04720738530159 -1.38139330374543e-06 -6.42856412014225e-06 -6.25125949227368e-07 
0.0454590134322643 -1.35487982788618e-06 -6.33988020126708e-06 -4.55005221056126e-07 
0.043811060488224 -1.42493286148238e-06 -6.19187403572141e-06 -3.83322884545123e-07 
0.0421395599842072 -2.54947167377395e-06 -6.10128017797251e-06 -7.8376757528531e-07 
0.040489986538887 -3.08242215396604e-06 -5.50179811398266e-06 -1.03924651284615e-06 
0.0387378856539726 -2.49846721089853e-06 -5.30949273525039e-06 -1.42010719628161e-06 
0.0370291098952293 -1.58119007664936e-06 -5.17655735166045e-06 -2.00457748178451e-06 
0.035177793353796 2.50176412919245e-07 -4.48158925792086e-06 -2.00899398805632e-06 
0.0332991257309914 3.12949964609288e-06 -3.53249720319582e-06 -1.59636374519323e-06 
0.0311940889805555 6.36759887129301e-06 -2.77295293926727e-06 -9.84849521046272e-07 
0.0289828907698393 9.9961280284333e-06 -1.7624885231271e-06 -1.92169125057262e-07 
0.0264517161995173 1.36997559820884e-05 -5.50417382783053e-07 6.4678755506975e-07 
0.0236487295478582 1.83260945050279e-05 -5.09541653315182e-09 1.20271522519033e-06 
0.0205229874700308 2.23192364501301e-05 3.38789732268197e-07 1.50030018630787e-06 
0.0172972306609154 2.50522225542227e-05 3.09207393911493e-07 1.41092016292532e-06 
0.014037324115634 2.58870659308741e-05 2.45373712459696e-08 1.11912208922149e-06 
0.0109723741188645 2.51513120019808e-05 -5.68107111575955e-07 8.06254263352457e-07 
0.0082009844481945 2.19210651266621e-05 -9.31590250274894e-07 4.59673856312293e-07 
0.00588864833116531 1.81715058715781e-05 -1.41468183301185e-06 1.28288903056273e-07 
0.00404704734683037 1.39797120937146e-05 -1.66365816767211e-06 -1.27918525549831e-07 
0.00264632981270552 1.01994091892266e-05 -1.92043739843939e-06 -2.52360734975809e-07 
0.0016305836616084 6.97632685842109e-06 -1.99235159925593e-06 -3.29754840322494e-07 
0.000931051385123283 4.65432276541833e-06 -2.05686478693679e-06 -4.00348142193252e-07 
0.000457815622212365 3.03922479361063e-06 -2.04312004825624e-06 -4.34542073435296e-07 
0.000149422281538136 2.07216226044693e-06 -1.98537713913538e-06 -4.48446371592581e-07 
-5.22170921612997e-05 1.35360471631429e-06 -1.93592950381571e-06 -4.37804004604914e-07 
-0.000186155870324001 8.77420518463623e-07 -1.85866144875035e-06 -4.30702357334667e-07 
-0.000271459954092279 5.68481823393086e-07 -1.79448511516966e-06 -4.09258660738487e-07 
-0.000327308283885941 3.21526044899656e-07 -1.71225599387981e-06 -3.98923788225147e-07 
-0.000368800945580006 1.09575644557935e-07 -1.6642313767079e-06 -3.84107153195146e-07 
-0.000396567775169387 -3.94211632226416e-08 -1.60439299179416e-06 -3.74467362007636e-07 
-0.000417194591136649 -1.32719435441686e-07 -1.5645839539502e-06 -3.59326264742776e-07 
-0.000434419780503958 -2.0983861759305e-07 -1.51432561779075e-06 -3.52264493130861e-07 
0 0 0 0 
0 0 0 0 
0 0 0 0 
0 0 0 0 
0 0 0 0 
0 0 0 0 
0 0 0 0 
0 0 0 0 
0 0 0 0 
0 0 0 0 
0 0 0 0 
0 0 0 0 
0 0 0 0 
0 0 0 0 
99.9836120605469 0.00810344982892275 0.00433277105912566 0.00153923965990543 
