0 0 0 0 
0 0 0 0 
0 0 0 0 
0 0 0 0 
0 0 0 0 
0 0 0 0 
0 0 0 0 
0 0 0 0 
0 0 0 0 
0 0 0 0 
0.0214907228946686 1.19512387755094e-05 7.26028404063328e-10 0 
0.0243548080325127 9.58967666520039e-06 4.23516262060275e-08 -6.99963953465499e-09 
0.0260824095457792 8.49979551276192e-06 -8.83632935710921e-08 -5.89128967831698e-10 
0.0279813967645168 5.823000719829e-06 1.76121162098752e-07 -8.16497980338227e-09 
0.0295602139085531 3.56450959770882e-06 -3.36536949419042e-08 -1.2057212117611e-08 
0.0308540612459183 5.96266261254641e-07 -9.38660704719041e-08 -2.15364952538266e-08 
0.031818263232708 -2.02331420950941e-06 3.314300167645e-09 -3.52472575571028e-08 
0.0323599129915237 -4.30591717304196e-06 1.00384811574372e-08 4.69925487411871e-10 
0.0323247984051704 -4.80747121400782e-06 3.61500429590933e-09 2.45957139100028e-08 
0.0316325612366199 -5.00988016938209e-06 -1.47107426240467e-09 -6.02632610480214e-09 
0.0304715670645237 -4.52681024398771e-06 -5.46875078555331e-09 -1.48068872718454e-08 
0.0290282312780619 -3.96998893847922e-06 2.64833543983656e-10 -3.50973330398574e-08 
0.0273928679525852 -3.67381085197849e-06 -1.04932351696618e-09 -5.3733777427567e-09 
0.0256827641278505 -3.45581906913139e-06 -3.73674841069871e-10 2.65405866173296e-08 
0.0240420084446669 -3.4214260722365e-06 -7.31750993132607e-10 -3.37896359781098e-08 
0.0225231479853392 -3.19068658427568e-06 2.75568345919908e-09 1.91877816746455e-07 
0.0211337115615606 -3.45307239513204e-06 1.54092150150831e-09 -7.33383487272476e-08 
0.0198596362024546 -3.03456636174815e-06 8.20250622979302e-09 -2.06695038862392e-09 
0.0187234748154879 -2.88396267933422e-06 -9.02852459461201e-10 2.36929009744813e-09 
0.0175897255539894 -2.57032093031739e-06 5.51028889184124e-10 -1.62262314695738e-09 
0.0165541395545006 -2.41379734688962e-06 -3.39348306399589e-11 1.27914345782187e-09 
0.0155722871422768 -2.05389187613036e-06 1.47797474259193e-09 9.99511473587233e-10 
0.0147155858576298 -2.10039297598996e-06 2.91908319738354e-09 -6.95114632520699e-10 
0.0139542305842042 -2.14471060644428e-06 -6.93811952334755e-10 1.2512867408887e-09 
0.0132679538801312 -2.2616445676249e-06 1.533865368053e-09 -3.84318532553607e-09 
0.0125461090356112 -2.25007465814997e-06 3.84757292692939e-09 -2.08052375327838e-09 
0.011838411912322 -2.38437337429787e-06 -2.12967560253574e-10 -1.44994549700073e-09 
0.0111709423363209 -2.35886068367108e-06 3.20967008526907e-09 -1.3372149221258e-10 
0.0104996487498283 -2.17561796489463e-06 7.38681893430737e-10 -4.75870065574924e-10 
0.0099318316206336 -2.02146634364908e-06 -1.73604908226821e-09 -6.56002308030423e-10 
0.00953018292784691 -1.94767903849424e-06 2.4245088159347e-09 2.22559237705866e-09 
0.00924849323928356 -1.74024421539798e-06 -6.95269397610332e-11 -7.9725320789592e-10 
0.00902805011719465 -1.54707845467783e-06 4.60359333986915e-10 -1.37901712271571e-09 
0.00894502457231283 -1.55909572185919e-06 7.3308609183087e-10 -1.34968169973604e-09 
0.00895241741091013 -1.47551020290848e-06 -1.06747921613248e-09 -3.03559927194996e-10 
0.00910419877618551 -1.56988721755624e-06 1.4919542268288e-09 7.45633416121549e-12 
0.00939031783491373 -1.57539602696488e-06 -4.49892567644383e-10 2.58783294272702e-12 
0.00980365369468927 -1.89461945865332e-06 2.4535977694029e-09 1.00723840379402e-09 
0.0102637819945812 -2.10568032343872e-06 2.2601495675012e-10 -7.17821774243177e-11 
0.0108048068359494 -2.46266176873178e-06 2.98036262336154e-10 -1.71156522288385e-09 
0.0113369049504399 -2.62509547610534e-06 8.06320343826883e-10 -2.18729426931796e-11 
0.0118321664631367 -3.22864798363298e-06 3.14258896683128e-10 -4.19408424656709e-10 
0.0122804371640086 -3.34816422764561e-06 -2.61748095420344e-10 -3.21882909215532e-10 
0.0126775503158569 -3.43194801644131e-06 -5.38216637924194e-10 -1.7932434426271e-09 
0.012971137650311 -3.47513764609175e-06 -4.76354233835963e-10 -1.00457453466873e-09 
0.0132140638306737 -3.45800208378932e-06 2.39887087971624e-09 -1.03367348014416e-09 
0.0134276375174522 -3.05623075291805e-06 8.61904159155102e-10 -5.21108378670476e-10 
0.0136179691180587 -2.99668772640871e-06 1.15430753844237e-09 -1.23040111432715e-09 
0.0137798124924302 -2.76175637736742e-06 2.04366135125866e-10 7.00739577474963e-10 
0.0139698944985867 -2.3103168587113e-06 1.50039314306127e-09 2.82984136124043e-10 
0.0141772842034698 -2.09456152333587e-06 5.99930605194032e-10 -1.73831848915285e-09 
0.0143847689032555 -1.94692916011263e-06 -1.77728265438049e-09 -3.34914362909444e-09 
0.014658572152257 -1.95677353076462e-06 -6.29809815411164e-10 -1.10715825396568e-09 
0.0150349158793688 -2.32710954151116e-06 1.78436365683154e-09 2.23683005451392e-09 
0.015461009927094 -2.34557592193596e-06 -1.62228341871185e-10 3.70830477436357e-10 
0.0160126071423292 -2.45289220401901e-06 1.87815740737562e-09 -3.36521943644641e-09 
0.0166947357356548 -2.44376565206039e-06 1.14785903004844e-09 8.8698975941881e-10 
0.0174590945243835 -2.19569210457848e-06 7.38279049006252e-10 3.42860184687765e-10 
0.0182898733764887 -1.97137751456467e-06 -2.32580132930593e-09 -1.79882175821433e-09 
0.0191994067281485 -2.21154800783552e-06 4.3394429716237e-10 -3.9909524574e-09 
0.0200682170689106 -2.05155333787843e-06 5.26803844991264e-09 -1.19359255812412e-09 
0.0208607818931341 -2.06991694540193e-06 -3.23329407692086e-09 -5.54655280038396e-11 
0.0216039828956127 -2.03011700250499e-06 4.55949855648896e-09 6.64637622715958e-10 
0.0221115071326494 -1.65626124726259e-06 1.8381277056001e-10 -1.43253853224223e-10 
0.0223744232207537 -1.86544502867036e-06 5.33127708646219e-10 5.86112935963001e-09 
0.0223611146211624 -2.41266570810694e-06 2.31962685171005e-10 1.31279065396228e-09 
0.0220987163484097 -2.81170196103631e-06 -2.66902344669973e-09 -4.23131751858818e-09 
0.0215288307517767 -2.93830794362293e-06 -2.325984516105e-09 1.88018800528766e-09 
0.0209125801920891 -3.75746344616346e-06 9.38914154757775e-11 2.40873410106701e-09 
0.0202442761510611 -3.82778580387821e-06 5.39596189952363e-09 -3.17883230849247e-09 
0.019681055098772 -4.02137493438204e-06 -3.01817015824213e-09 4.80320172524529e-10 
0.0192464925348759 -4.13219595429837e-06 -3.40036754309381e-09 -2.48089571108778e-09 
0.0190196298062801 -4.40920257460675e-06 -8.66144045374995e-10 -2.73238737191761e-10 
0.0188649371266365 -4.6947852752055e-06 2.55907606216965e-09 2.15697570915552e-10 
0.0189110245555639 -4.39134146290598e-06 1.74564751542761e-09 -1.94881710768868e-09 
0.01905282959342 -4.91455466544721e-06 -5.02300701032965e-10 5.13737996588048e-10 
0.0192634779959917 -5.28611326444661e-06 2.95528246319066e-09 -2.80212075765007e-10 
0.0193938929587603 -5.60109401703812e-06 1.74460046409308e-09 -4.11083878049112e-09 
0.019599225372076 -5.24643201060826e-06 -4.7548803783215e-10 -2.85976486935624e-09 
0.0197417344897985 -5.82294751438894e-06 -1.37303779457199e-09 -2.34770758389402e-09 
0.0198948625475168 -4.52422773378203e-06 -5.88104565046876e-10 -3.00116376195092e-09 
0.0200106780976057 -3.81830250262283e-06 6.54699627844479e-09 -2.65567479118545e-09 
0.0202650018036366 -3.10078598886321e-06 -2.47015896626124e-09 -2.85150392187461e-09 
0.0207713209092617 -3.26359986502212e-06 6.38539665587246e-09 3.05286351753864e-10 
0.0219004787504673 -3.01212594422395e-06 4.55484050476684e-09 7.53598516922693e-10 
0.0244805477559566 -2.89501713268692e-08 5.52913403950583e-09 -2.54870102800453e-09 
0.0302130654454231 -1.10662745100853e-08 3.32058669449964e-09 -8.16882894660864e-10 
0.0401361100375652 4.71185671813146e-09 -6.73246081106527e-09 -1.43300726840323e-09 
0.0556695237755775 4.04117827201844e-08 -1.61044066970817e-09 -9.29619581313545e-09 
0.077578991651535 9.23524930840358e-08 -8.88462725612271e-09 -4.06867262103816e-10 
0.104111418128014 1.28100591609837e-07 -3.09413401566871e-08 -1.05568798147715e-08 
0.13272263109684 1.07838768599322e-07 2.53830378937892e-08 3.9905421189701e-09 
0.159909963607788 1.50380910781678e-07 1.13498934695144e-08 2.01142036360125e-09 
0.183460026979446 9.78626576397801e-08 -1.18351461964039e-08 1.11903606381247e-08 
0.200620949268341 3.7710674405389e-08 3.43769741562028e-08 1.01332497948192e-08 
0.212473675608635 9.45447986566705e-11 -1.4423293670518e-09 9.05689523378328e-10 
0.218391984701157 -7.42699285183335e-09 -2.85304206926185e-08 4.60324534046208e-09 
0.221244543790817 -2.57219562627142e-08 1.27679022909888e-08 -4.39499210358463e-08 
0.220747694373131 -3.29111776409263e-08 2.81409615610073e-08 -1.64434830196569e-08 
0.219193622469902 -2.40185636357637e-08 -6.6253512898129e-08 5.65770630345241e-09 
0.215151712298393 -8.45600652610301e-09 -1.14505160908607e-08 1.80482384593006e-08 
0.210631713271141 2.30795151878738e-09 4.0286785463195e-08 1.5955027521386e-08 
0.205567926168442 -4.4386210902303e-08 -3.51083819793985e-08 2.67978217394216e-09 
0.200715735554695 -3.37452161147667e-08 -3.3037910185385e-09 4.56211637356319e-08 
0.196022734045982 -5.2066693569941e-08 2.08397832324181e-08 7.40109085128893e-09 
0.191017791628838 -7.82620463724015e-08 -4.81756412540335e-09 6.47390185903873e-09 
0.186223521828651 -6.7840651354345e-08 1.76033054799518e-08 -3.34999867845909e-08 
0.181519374251366 -5.70891825191211e-08 3.67000430046005e-09 6.10139361256756e-09 
0.175872728228569 -3.51247012986278e-08 -8.38927771695808e-09 -2.13539097515536e-09 
0.169344842433929 -1.26967029245861e-08 4.1818375429159e-09 1.38131586169266e-08 
0.163368999958038 -2.29491570280516e-08 -2.36736550363048e-08 1.4110251633781e-08 
0.156806752085686 -5.71321243114653e-08 -6.29245544558898e-09 -2.92767978748998e-08 
0.149470672011375 -6.08713344263379e-08 3.43056747453829e-08 -5.69453817433896e-09 
0.14262555539608 -4.53661641586223e-08 6.68348043575406e-09 -8.6974250024241e-09 
0.135048165917397 -4.96817301609553e-08 6.97913726810384e-10 -1.77526204847567e-09 
0.127653673291206 -2.4804983240756e-08 -2.0079646834148e-09 -6.34406438493329e-09 
0.120386213064194 3.06096285385138e-08 1.36321332000477e-09 -1.5456993907037e-08 
0.113020204007626 3.91510184272192e-08 -1.58751323198203e-08 -7.09454273106758e-10 
0.105268590152264 4.61561876363703e-08 -4.97357000028842e-09 -6.15417983240718e-09 
0.0981076881289482 7.7634385888814e-08 9.50329503979219e-09 1.22130030533185e-08 
0.0902941450476646 9.41331472859019e-08 1.29796804415605e-08 -1.02535642199086e-08 
0.0825534984469414 7.47388594390941e-08 6.00937566375137e-09 1.86941573332433e-08 
0.0748867243528366 8.66713344294112e-08 1.99730787464603e-09 5.09859798825119e-09 
0.0671010985970497 9.67264440987492e-08 -5.00304686568143e-09 -8.13246092690179e-09 
0.0593218952417374 9.92845889413729e-08 2.24848709096115e-10 2.84670598205139e-09 
0.0520388148725033 1.11232911876868e-07 -1.51170254092392e-09 -4.49797399326712e-09 
0.0447694845497608 1.20837003123597e-07 -4.60037163918514e-09 -8.44327896487584e-09 
0.0378627367317677 1.29658274090616e-07 -9.03184194100959e-09 -1.48515102993407e-10 
0.0318106487393379 1.15982747956878e-07 -1.88291937597285e-09 -2.92947643920627e-09 
0.0261570829898119 1.06062771010329e-07 -1.99582950166644e-09 5.42676792392172e-10 
0.0212453659623861 8.89448256202741e-08 1.42813094683447e-09 -5.53977930195515e-09 
0.0170544516295195 7.81074322731001e-08 -1.48935408450512e-09 -1.42817579984467e-09 
0.0134875383228064 5.31016212335089e-08 -1.75795611401242e-09 -2.69756750270744e-09 
0.0105804549530149 3.33634579874342e-08 -1.59024293733268e-09 -1.02640440591273e-09 
0.00832269247621298 1.68423446211818e-08 -9.04313124383549e-10 -5.43179057288512e-10 
0.00657382886856794 1.18406681792749e-09 -5.20465448516916e-10 2.07901491161566e-11 
0.00530912028625607 -7.88460852163553e-09 -7.35193683709667e-10 -1.04828457025974e-09 
0.004435442853719 -1.43049078360491e-08 -6.96158825030935e-11 2.61350923541626e-11 
0.00379520235583186 -1.69288921370026e-08 2.27688271015047e-10 -7.74085517907253e-11 
0.00334817636758089 -2.34692265621561e-08 2.47158071786657e-10 2.13626810685597e-10 
0.00296036596409976 -2.77491244560224e-08 1.8211961938519e-09 -9.2183677358193e-11 
0.00268185697495937 -3.1635572668165e-08 8.22184098581147e-10 -2.80148765297028e-10 
0.00244864635169506 -3.2984346489684e-08 1.22864307616766e-09 -2.60192783985147e-10 
0.00229084608145058 -3.41111785928661e-08 1.24861487815764e-09 -1.6022398685589e-11 
0.00214029010385275 -3.40182782565535e-08 1.31385036183929e-09 6.24029161677697e-11 
0.00204484537243843 -2.97012752525916e-08 5.58838975095455e-10 -1.79735781813406e-10 
0.00202431692741811 -2.4680364276719e-08 9.70127422839084e-10 -4.52945264628468e-10 
0.00195540022104979 -2.78038100987033e-08 1.05630160174286e-09 1.09123404756772e-10 
0.00188208289910108 -2.64815275841102e-08 9.00439334206027e-10 8.42091882335971e-11 
0.00180264667142183 -2.64134473582089e-08 8.47841685747142e-10 -1.01827817011735e-10 
0.00169082160573453 -2.78615493698453e-08 1.15637988074013e-09 -1.8943045743125e-10 
0.00149800546932966 -3.23133554047672e-08 1.0043113007896e-09 8.83966927434088e-11 
0.0013848397647962 -2.79223627330794e-08 9.91075443934619e-10 1.51991225161296e-10 
0.00125271116849035 -2.91912579086784e-08 1.07916520164508e-09 -9.07542374584125e-11 
0.00118296837899834 -2.63275660472573e-08 7.88500986725893e-10 1.94223470639798e-10 
0.00113125646021217 -2.5214105789928e-08 6.23586793313535e-10 1.3913596663695e-10 
0.0011047818697989 -2.12669897337037e-08 7.29110105623931e-10 6.13267145399554e-11 
0.00106316187884659 -2.01222383111599e-08 6.25048457436606e-10 1.9574855625315e-10 
0.00102820503525436 -1.73613932474836e-08 4.84106088549652e-10 -8.12761663526729e-11 
0.000972699781414121 -1.61909997586918e-08 5.15653353350132e-10 -9.58027233932679e-12 
0.000911918003112078 -1.76294201992278e-08 5.70866576232731e-10 -6.90590076443676e-12 
0 0 0 0 
0 0 0 0 
0 0 0 0 
0 0 0 0 
0 0 0 0 
0 0 0 0 
0 0 0 0 
0 0 0 0 
0 0 0 0 
0 0 0 0 
0 0 0 0 
0 0 0 0 
0 0 0 0 
0 0 0 0 
99.9927673339844 0.0061519374139607 2.58777326962445e-05 2.39889977819985e-05 
