0.000370773748727515 -0.00157980679068714 
0.000302553176879883 -0.000342884595738724 
0.000270181655650958 0.000675976276397705 
0.000315454642986879 0.00179821252822876 
0.000375171570340171 0.00293942913413048 
0.00048051419435069 0.00496046571061015 
0.000708958832547069 0.0075390636920929 
0.00100348354317248 0.0115872314199805 
0.00149051414337009 0.0160657837986946 
0.00205159513279796 0.0205890275537968 
0.0027567925862968 0.0249524638056755 
0.0035382341593504 0.0288813654333353 
0.00436129886657 0.0319970548152924 
0.00514934118837118 0.0340708829462528 
0.00597283709794283 0.0339824147522449 
0.00692390836775303 0.0316495969891548 
0.00782095454633236 0.0251352991908789 
0.00844221282750368 0.01805648393929 
0.00866387318819761 0.0119509724900126 
0.00864879041910172 0.00808409042656422 
0.00852459482848644 0.00535203376784921 
0.0082801217213273 0.00357185886241496 
0.00795660819858313 0.00237100012600422 
0.00755720352753997 0.00159900402650237 
0.00718662142753601 0.000673937611281872 
0.00684592640027404 0.000526559597346932 
0.00656080106273293 0.000392734771594405 
0.00630176765844226 -0.000310295145027339 
0.00605285167694092 -0.000123325735330582 
0.00579399475827813 7.83257346483879e-05 
0.00552616221830249 0.000704888894688338 
0.00526819145306945 0.000619958329480141 
0.00500969449058175 0.000747746089473367 
0.00478762481361628 0.00111432804260403 
0.00459570903331041 0.000858679180964828 
0.00437403935939074 0.000466568162664771 
0.0041125244461 0.000424423778895289 
0.00386173254810274 0.000556432059966028 
0.00376153225079179 0.000629485526587814 
0.00376592949032784 0.000424437574110925 
0.00386048201471567 0.000764025317039341 
0.00398193998262286 0.00101134472060949 
0.00414192536845803 0.000911141454707831 
0.00435590418055654 0.000844012480229139 
0.00462511880323291 0.00118649879004806 
0.00498461443930864 0.00187468039803207 
0.00541791645810008 0.00231839367188513 
0.0058700512163341 0.00261253770440817 
0.00633761752396822 0.0028640900272876 
0.00680196285247803 0.00249652261845767 
0.0072637340053916 0.00218473584391177 
0.00769243855029345 0.00228438549675047 
0.00806395709514618 0.00272393459454179 
0.00844330061227083 0.00324917258694768 
0.00885926652699709 0.00341169838793576 
0.00933679938316345 0.00346680218353868 
0.00980325881391764 0.00328660430386662 
0.0102890422567725 0.00338208023458719 
0.0107595883309841 0.00292156939394772 
0.011241496540606 0.00358911603689194 
0.0117148458957672 0.003403628943488 
0.0121744079515338 0.00418615248054266 
0.0126864528283477 0.00290843821130693 
0.0132685322314501 0.00306367827579379 
0.0139376586303115 0.0032809607218951 
0.014748202636838 0.00439068395644426 
0.0156592018902302 0.00398411368951201 
0.01671445928514 0.00404599588364363 
0.0178261380642653 0.00461274664849043 
0.0189915522933006 0.00513750314712524 
0.0201707072556019 0.00577701348811388 
0.0212697666138411 0.00709047075361013 
0.0222085937857628 0.00857063569128513 
0.0228318683803082 0.0077168857678771 
0.0230861287564039 0.00720301689580083 
0.0228437334299088 0.00654022395610809 
0.0222472213208675 0.00713031925261021 
0.0213057231158018 0.00744961574673653 
0.0202841684222221 0.00740836001932621 
0.0192456431686878 0.00754431542009115 
0.0183702763170004 0.00630012759938836 
0.0176445953547955 0.00619495892897248 
0.0170710813254118 0.0053293346427381 
0.016673244535923 0.00576219148933887 
0.0164252761751413 0.00571312755346298 
0.0163061823695898 0.00711021246388555 
0.0162502080202103 0.00653829565271735 
0.0162852630019188 0.00575509062036872 
0.0164284892380238 0.0051275035366416 
0.016642278060317 0.00525161018595099 
0.0168968457728624 0.00664394302293658 
0.0172415319830179 0.00786686129868031 
0.0178004112094641 0.00828269030898809 
0.0187704600393772 0.00869655702263117 
0.0206375941634178 0.00751172425225377 
0.0242175776511431 0.00915784481912851 
0.0309915337711573 0.0139963300898671 
0.0422882065176964 0.0228517036885023 
0.0592384599149227 0.0321451090276241 
0.081595703959465 0.0349939353764057 
0.107685469090939 0.036734689027071 
0.134348824620247 0.0377519428730011 
0.157747313380241 0.0412736125290394 
0.175910338759422 0.0509188883006573 
0.188149973750114 0.0472078546881676 
0.195671677589417 0.0508959218859673 
0.199268445372581 0.0410550273954868 
0.200868144631386 0.0419097915291786 
0.200654283165932 0.0432129390537739 
0.198705181479454 0.0474106892943382 
0.195669054985046 0.0537032335996628 
0.191966116428375 0.0445026122033596 
0.18838594853878 0.0438211858272552 
0.184717416763306 0.0434962473809719 
0.181044921278954 0.0546122901141644 
0.177995458245277 0.0573414042592049 
0.174816012382507 0.0476702265441418 
0.171427235007286 0.0357900820672512 
0.168272718787193 0.025977935642004 
0.164710536599159 0.0284240506589413 
0.161484077572823 0.0178306698799133 
0.157761782407761 0.0212462302297354 
0.153745472431183 0.0166179817169905 
0.149809911847115 0.0228320471942425 
0.14605924487114 0.0157255604863167 
0.142398789525032 0.00998133886605501 
0.138325959444046 0.00242461380548775 
0.133786782622337 -0.0123574417084455 
0.129354104399681 -0.023791927844286 
0.124921567738056 -0.0369739346206188 
0.120000757277012 -0.0413445048034191 
0.115190923213959 -0.0551842525601387 
0.110120475292206 -0.0632667616009712 
0.10538811981678 -0.0779178813099861 
0.100230269134045 -0.0821088179945946 
0.0953167378902435 -0.101814091205597 
0.0903488248586655 -0.112071096897125 
0.0854388549923897 -0.133150979876518 
0.0801786929368973 -0.143034473061562 
0.0749182850122452 -0.165943384170532 
0.0697527602314949 -0.17337504029274 
0.0645730569958687 -0.183536440134048 
0.0587890706956387 -0.186668932437897 
0.0526947788894176 -0.192347213625908 
0.0467365123331547 -0.192621931433678 
0.0412405654788017 -0.190902695059776 
0.0361759923398495 -0.191520050168037 
0.0312922224402428 -0.185728549957275 
0.0267482418566942 -0.177608504891396 
0.0224140286445618 -0.161017179489136 
0.0185826048254967 -0.146923393011093 
0.0151631664484739 -0.130488127470016 
0.0122769689187407 -0.117776222527027 
0.00981069542467594 -0.102636426687241 
0.00766146089881659 -0.0866630300879478 
0.0058006658218801 -0.0680287256836891 
0.00428699050098658 -0.0521871373057365 
0.00311911781318486 -0.0376738086342812 
0.00228416291065514 -0.0268922671675682 
0.00162945606280118 -0.0170672256499529 
0.00120015756692737 -0.0102019179612398 
0.000865000358317047 -0.0051066717132926 
0.00067151035182178 -0.00181332742795348 
0.000525221868883818 -0.000322767649777234 
0.000443020806415007 0.000469725782750174 
0.000384337676223367 0.000378350727260113 
0.000314770848490298 0.000408959633205086 
0.000263700698269531 0.000783845956902951 
0.000239837958361022 0.00101259688381106 
0.000213734165299684 0.00102548219729215 
0.000208813697099686 0.000609578506555408 
0.000165115168783814 -5.14975981786847e-05 
0.000145165628055111 -5.42089073860552e-05 
0.000130484637338668 0.000413787405705079 
0.000106187515484635 0.000886159657966346 
7.9200261097867e-05 0.000541994930244982 
4.08586929552257e-05 0.000143140583531931 
4.9922542530112e-05 -0.000158834780449979 
5.55606929992791e-05 0.000280685955658555 
6.52260423521511e-05 0.000104470673250034 
5.51000957784709e-05 0.000704633246641606 
5.26575386174954e-05 0.000543060654308647 
4.67808349640109e-05 0.000574707344640046 
4.0589329728391e-05 0.000288066745270044 
3.71723544958513e-05 0.000212894912692718 
