{
    "resId":"nlu_vision_group",
    "domain":"nlu",
    "district":"china",
    "deviceType":"common",
    "productName":"common",
    "romVersion":"common",
    "osVersion":"common",
    "version":"0x01010000",
    "releaseNotes":"",
    "digest":"",
    "fileName":"",
    "ResMetaData":[
        {
            "origin_id":"0x0000000002001312",
            "res_value":"",
            "res_path":"nlu/model/local/fst/zh/vision/VISION_HOTWORDS.far",
            "domain":"nlu",
            "data_version":"0x01010000",
            "encrypt_mode":"0"
        },
        {
            "origin_id":"0x0000000002001313",
            "res_value":"",
            "res_path":"nlu/model/local/fst/zh/vision/VISION_SELECT.far",
            "domain":"nlu",
            "data_version":"0x01010000",
            "encrypt_mode":"0"
        },
        {
            "origin_id":"0x0000000002001315",
            "res_value":"",
            "res_path":"nlu/model/local/fst/zh/vision/VISION_HOTWORDS_CARRYON.far",
            "domain":"nlu",
            "data_version":"0x01010000",
            "encrypt_mode":"0"
        }
    ]
}