unified_raw_limit,,,,,,,,,,,,,,,,,,,,,,,,,,,,,,,,,,,,,,,,,,,,,,,,,,,,,,,,,,,,,,,,,,,,,,,,,,,,,,,,,,,,,,,,,,,
9999,500,110,,,,,,,,,,,,,,,,,,,,,,,,,,,,,,,,,,,,,,,,,,,,,,,,,,,,,,,,,,,,,,,,,,,,,,,,,,,,,,,,,,,,,,,,,
noise_data_limit,,,,,,,,,,,,,,,,,,,,,,,,,,,,,,,,,,,,,,,,,,,,,,,,,,,,,,,,,,,,,,,,,,,,,,,,,,,,,,,,,,,,,,,,,,,
100,,,,,,,,,,,,,,,,,,,,,,,,,,,,,,,,,,,,,,,,,,,,,,,,,,,,,,,,,,,,,,,,,,,,,,,,,,,,,,,,,,,,,,,,,,,
shortciurt_threshold,,,,,,,,,,,,,,,,,,,,,,,,,,,,,,,,,,,,,,,,,,,,,,,,,,,,,,,,,,,,,,,,,,,,,,,,,,,,,,,,,,,,,,,,,,,
30,150,150,150,100,100,20,,,,,,,,,,,,,,,,,,,,,,,,,,,,,,,,,,,,,,,,,,,,,,,,,,,,,,,,,,,,,,,,,,,,,,,,,,,,,,,,,,,,,
specail_raw_max,,,,,,,,,,,,,,,,,,,,,,,,,,,,,,,,,,,,,,,,,,,,,,,,,,,,,,,,,,,,,,,,,,,,,,,,,,,,,,,,,,,,,,,,,,,
3092,3591,3620,3575,3594,3635,3617,3615,3661,3618,3628,3668,3659,3627,3692,3644,3672,3711,3365,3449,3436,3428,3458,3477,3443,3503,3496,3462,3518,3507,3521,3501,3555,3515,3534,2976,,,,,,,,,,,,,,,,,,,,,,,,,,,,,,,,,,,,,,,,,,,,,,,,,,,,,,,,
3586,3565,3589,3546,3568,3615,3589,3588,3633,3589,3605,3651,3659,3630,3695,3646,3675,3719,3356,3442,3430,3421,3453,3466,3419,3476,3469,3435,3490,3480,3496,3481,3536,3497,3520,3553,,,,,,,,,,,,,,,,,,,,,,,,,,,,,,,,,,,,,,,,,,,,,,,,,,,,,,,,
3596,3582,3607,3563,3585,3627,3614,3606,3652,3604,3625,3671,3676,3646,3713,3666,3692,3737,3371,3459,3447,3436,3469,3480,3435,3489,3481,3449,3503,3493,3508,3498,3549,3511,3537,3568,,,,,,,,,,,,,,,,,,,,,,,,,,,,,,,,,,,,,,,,,,,,,,,,,,,,,,,,
3570,3563,3598,3546,3568,3608,3590,3591,3633,3586,3607,3654,3657,3627,3696,3646,3675,3718,3358,3441,3430,3417,3450,3461,3415,3474,3467,3428,3484,3473,3489,3478,3530,3492,3518,3553,,,,,,,,,,,,,,,,,,,,,,,,,,,,,,,,,,,,,,,,,,,,,,,,,,,,,,,,
3570,3574,3603,3555,3582,3614,3595,3595,3641,3592,3610,3658,3662,3633,3700,3654,3681,3727,3359,3447,3435,3419,3453,3464,3420,3474,3468,3434,3488,3476,3493,3483,3537,3499,3527,3560,,,,,,,,,,,,,,,,,,,,,,,,,,,,,,,,,,,,,,,,,,,,,,,,,,,,,,,,
3586,3594,3615,3565,3585,3623,3606,3605,3644,3600,3622,3666,3668,3640,3707,3660,3689,3731,3363,3456,3443,3430,3462,3475,3429,3482,3479,3445,3500,3488,3507,3492,3548,3511,3539,3572,,,,,,,,,,,,,,,,,,,,,,,,,,,,,,,,,,,,,,,,,,,,,,,,,,,,,,,,
3568,3575,3601,3551,3570,3608,3587,3582,3627,3581,3601,3644,3651,3624,3688,3643,3669,3713,3348,3432,3424,3410,3445,3453,3406,3464,3458,3422,3477,3468,3487,3475,3527,3494,3522,3553,,,,,,,,,,,,,,,,,,,,,,,,,,,,,,,,,,,,,,,,,,,,,,,,,,,,,,,,
3584,3588,3612,3567,3587,3622,3603,3599,3643,3596,3619,3662,3664,3638,3703,3657,3686,3727,3359,3446,3440,3428,3458,3471,3423,3479,3473,3437,3495,3484,3499,3487,3542,3510,3536,3570,,,,,,,,,,,,,,,,,,,,,,,,,,,,,,,,,,,,,,,,,,,,,,,,,,,,,,,,
3556,3572,3601,3553,3572,3609,3588,3586,3629,3582,3604,3646,3649,3622,3688,3637,3667,3711,3342,3430,3421,3408,3438,3449,3403,3461,3453,3421,3478,3461,3480,3470,3523,3490,3513,3551,,,,,,,,,,,,,,,,,,,,,,,,,,,,,,,,,,,,,,,,,,,,,,,,,,,,,,,,
3562,3581,3610,3560,3583,3615,3597,3594,3633,3590,3607,3655,3660,3629,3695,3647,3676,3718,3353,3440,3428,3418,3448,3459,3415,3470,3464,3427,3483,3470,3490,3479,3534,3501,3523,3563,,,,,,,,,,,,,,,,,,,,,,,,,,,,,,,,,,,,,,,,,,,,,,,,,,,,,,,,
3584,3610,3634,3591,3604,3639,3619,3616,3659,3616,3634,3678,3684,3653,3720,3672,3704,3744,3374,3463,3452,3442,3473,3484,3437,3492,3486,3452,3503,3493,3510,3500,3558,3525,3549,3589,,,,,,,,,,,,,,,,,,,,,,,,,,,,,,,,,,,,,,,,,,,,,,,,,,,,,,,,
3581,3612,3640,3588,3607,3641,3623,3623,3666,3620,3641,3683,3687,3657,3724,3676,3709,3750,3377,3467,3458,3444,3478,3489,3443,3495,3487,3454,3510,3495,3516,3503,3558,3527,3549,3594,,,,,,,,,,,,,,,,,,,,,,,,,,,,,,,,,,,,,,,,,,,,,,,,,,,,,,,,
3553,3596,3626,3574,3592,3627,3608,3607,3650,3609,3624,3669,3680,3639,3707,3661,3692,3743,3368,3455,3447,3434,3469,3478,3432,3486,3479,3445,3500,3485,3505,3491,3549,3516,3542,3579,,,,,,,,,,,,,,,,,,,,,,,,,,,,,,,,,,,,,,,,,,,,,,,,,,,,,,,,
3560,3614,3645,3589,3610,3645,3624,3623,3668,3626,3646,3690,3693,3668,3724,3682,3719,3750,3378,3467,3459,3446,3477,3485,3443,3495,3491,3455,3507,3496,3516,3503,3558,3527,3551,3593,,,,,,,,,,,,,,,,,,,,,,,,,,,,,,,,,,,,,,,,,,,,,,,,,,,,,,,,
3555,3615,3646,3598,3613,3643,3627,3625,3672,3628,3656,3693,3698,3665,3732,3694,3714,3757,3380,3468,3461,3448,3477,3486,3441,3497,3493,3458,3509,3497,3519,3505,3563,3529,3553,3596,,,,,,,,,,,,,,,,,,,,,,,,,,,,,,,,,,,,,,,,,,,,,,,,,,,,,,,,
3534,3615,3645,3596,3612,3644,3625,3624,3672,3628,3649,3700,3698,3665,3737,3683,3711,3754,3384,3467,3458,3449,3479,3486,3444,3500,3493,3458,3508,3498,3520,3505,3565,3530,3555,3596,,,,,,,,,,,,,,,,,,,,,,,,,,,,,,,,,,,,,,,,,,,,,,,,,,,,,,,,
3527,3589,3617,3570,3583,3613,3600,3598,3644,3611,3622,3668,3671,3633,3702,3656,3682,3725,3353,3439,3429,3423,3451,3460,3418,3472,3465,3431,3478,3469,3491,3477,3537,3503,3525,3567,,,,,,,,,,,,,,,,,,,,,,,,,,,,,,,,,,,,,,,,,,,,,,,,,,,,,,,,
3556,3607,3634,3588,3599,3640,3618,3612,3662,3619,3637,3680,3684,3649,3718,3676,3698,3737,3367,3453,3443,3435,3467,3476,3434,3486,3480,3446,3494,3484,3505,3489,3549,3516,3541,3581,,,,,,,,,,,,,,,,,,,,,,,,,,,,,,,,,,,,,,,,,,,,,,,,,,,,,,,,
3575,3614,3641,3596,3610,3647,3626,3622,3673,3627,3643,3689,3694,3656,3729,3685,3710,3751,3388,3471,3465,3455,3483,3494,3450,3503,3499,3462,3512,3505,3527,3509,3567,3534,3555,3596,,,,,,,,,,,,,,,,,,,,,,,,,,,,,,,,,,,,,,,,,,,,,,,,,,,,,,,,
3582,3614,3636,3591,3606,3640,3623,3622,3659,3619,3637,3681,3689,3648,3718,3674,3698,3739,3379,3464,3455,3445,3469,3484,3442,3496,3488,3457,3505,3498,3519,3501,3563,3525,3546,3589,,,,,,,,,,,,,,,,,,,,,,,,,,,,,,,,,,,,,,,,,,,,,,,,,,,,,,,,
3584,3605,3629,3584,3597,3633,3625,3610,3652,3610,3626,3670,3680,3642,3709,3667,3688,3733,3369,3453,3446,3436,3464,3477,3437,3488,3481,3448,3500,3491,3513,3492,3555,3522,3541,3584,,,,,,,,,,,,,,,,,,,,,,,,,,,,,,,,,,,,,,,,,,,,,,,,,,,,,,,,
3610,3624,3659,3605,3614,3649,3635,3628,3671,3630,3643,3692,3702,3665,3731,3686,3709,3753,3384,3467,3461,3451,3477,3488,3448,3503,3493,3457,3510,3503,3526,3506,3567,3534,3556,3589,,,,,,,,,,,,,,,,,,,,,,,,,,,,,,,,,,,,,,,,,,,,,,,,,,,,,,,,
3620,3631,3657,3608,3627,3658,3641,3634,3678,3638,3649,3699,3707,3669,3736,3692,3714,3757,3391,3477,3468,3460,3484,3495,3455,3507,3500,3467,3516,3506,3533,3512,3575,3541,3560,3601,,,,,,,,,,,,,,,,,,,,,,,,,,,,,,,,,,,,,,,,,,,,,,,,,,,,,,,,
3624,3634,3657,3610,3622,3658,3640,3632,3678,3640,3651,3698,3705,3666,3737,3691,3711,3758,3391,3476,3468,3458,3484,3497,3452,3507,3501,3468,3517,3508,3532,3514,3572,3541,3560,3600,,,,,,,,,,,,,,,,,,,,,,,,,,,,,,,,,,,,,,,,,,,,,,,,,,,,,,,,
3593,3593,3619,3575,3586,3623,3606,3595,3642,3601,3611,3657,3666,3626,3698,3651,3671,3718,3360,3438,3432,3425,3449,3462,3422,3473,3465,3431,3482,3471,3494,3479,3536,3508,3527,3568,,,,,,,,,,,,,,,,,,,,,,,,,,,,,,,,,,,,,,,,,,,,,,,,,,,,,,,,
3607,3603,3629,3591,3594,3633,3614,3606,3653,3609,3617,3664,3674,3633,3701,3662,3680,3727,3367,3445,3440,3433,3457,3469,3424,3477,3472,3441,3486,3479,3502,3485,3548,3516,3534,3574,,,,,,,,,,,,,,,,,,,,,,,,,,,,,,,,,,,,,,,,,,,,,,,,,,,,,,,,
3653,3638,3667,3626,3631,3669,3652,3646,3690,3646,3656,3702,3711,3672,3739,3698,3726,3766,3405,3486,3480,3471,3493,3507,3459,3511,3509,3478,3526,3516,3540,3520,3582,3549,3570,3610,,,,,,,,,,,,,,,,,,,,,,,,,,,,,,,,,,,,,,,,,,,,,,,,,,,,,,,,
3707,3626,3653,3610,3615,3656,3639,3629,3673,3632,3642,3691,3695,3653,3727,3681,3709,3762,3402,3481,3476,3471,3491,3503,3461,3508,3506,3473,3522,3516,3538,3518,3579,3548,3567,3610,,,,,,,,,,,,,,,,,,,,,,,,,,,,,,,,,,,,,,,,,,,,,,,,,,,,,,,,
3529,3467,3495,3453,3458,3492,3481,3463,3508,3469,3484,3537,3534,3495,3561,3519,3542,3581,3231,3315,3308,3301,3324,3334,3293,3337,3337,3305,3354,3351,3377,3350,3408,3380,3401,3432,,,,,,,,,,,,,,,,,,,,,,,,,,,,,,,,,,,,,,,,,,,,,,,,,,,,,,,,
3484,3471,3498,3464,3467,3503,3488,3475,3517,3481,3494,3543,3544,3507,3571,3528,3551,3590,3234,3318,3313,3302,3324,3340,3297,3342,3341,3311,3357,3350,3375,3353,3412,3387,3405,3432,,,,,,,,,,,,,,,,,,,,,,,,,,,,,,,,,,,,,,,,,,,,,,,,,,,,,,,,
3474,3477,3505,3467,3467,3507,3490,3477,3519,3481,3493,3544,3545,3508,3572,3528,3550,3591,3234,3321,3313,3300,3324,3335,3293,3344,3341,3317,3360,3351,3378,3354,3415,3387,3405,3439,,,,,,,,,,,,,,,,,,,,,,,,,,,,,,,,,,,,,,,,,,,,,,,,,,,,,,,,
3502,3512,3536,3495,3503,3535,3523,3512,3555,3513,3526,3573,3578,3540,3604,3561,3588,3625,3263,3347,3339,3327,3352,3360,3324,3370,3368,3341,3384,3378,3402,3384,3446,3415,3436,3467,,,,,,,,,,,,,,,,,,,,,,,,,,,,,,,,,,,,,,,,,,,,,,,,,,,,,,,,
3471,3488,3512,3474,3478,3510,3498,3489,3526,3487,3498,3552,3552,3518,3579,3534,3563,3604,3239,3328,3319,3304,3324,3336,3297,3346,3342,3311,3359,3355,3379,3359,3422,3391,3408,3443,,,,,,,,,,,,,,,,,,,,,,,,,,,,,,,,,,,,,,,,,,,,,,,,,,,,,,,,
3474,3495,3526,3477,3487,3523,3509,3495,3536,3495,3506,3563,3558,3522,3585,3542,3565,3608,3248,3339,3324,3311,3333,3344,3309,3359,3354,3324,3371,3360,3389,3370,3429,3398,3419,3450,,,,,,,,,,,,,,,,,,,,,,,,,,,,,,,,,,,,,,,,,,,,,,,,,,,,,,,,
3460,3488,3512,3467,3478,3513,3500,3487,3526,3485,3500,3552,3548,3512,3578,3532,3555,3595,3235,3324,3315,3302,3328,3338,3299,3350,3345,3314,3363,3356,3379,3360,3419,3387,3408,3439,,,,,,,,,,,,,,,,,,,,,,,,,,,,,,,,,,,,,,,,,,,,,,,,,,,,,,,,
3484,3519,3543,3502,3511,3547,3531,3519,3559,3514,3533,3586,3581,3545,3610,3568,3588,3630,3265,3354,3343,3332,3357,3366,3330,3378,3372,3344,3391,3383,3405,3390,3450,3422,3443,3471,,,,,,,,,,,,,,,,,,,,,,,,,,,,,,,,,,,,,,,,,,,,,,,,,,,,,,,,
3471,3516,3540,3498,3511,3543,3526,3517,3556,3516,3532,3581,3578,3544,3609,3566,3588,3631,3262,3348,3341,3328,3353,3362,3324,3375,3374,3339,3386,3379,3402,3386,3443,3419,3439,3471,,,,,,,,,,,,,,,,,,,,,,,,,,,,,,,,,,,,,,,,,,,,,,,,,,,,,,,,
3471,3523,3554,3509,3520,3555,3536,3526,3567,3523,3540,3590,3586,3552,3616,3572,3600,3638,3275,3356,3348,3335,3362,3374,3330,3384,3383,3350,3397,3387,3412,3394,3453,3422,3450,3477,,,,,,,,,,,,,,,,,,,,,,,,,,,,,,,,,,,,,,,,,,,,,,,,,,,,,,,,
3429,3505,3529,3488,3499,3529,3516,3507,3549,3506,3522,3569,3565,3534,3594,3549,3580,3617,3249,3337,3326,3318,3341,3352,3312,3366,3363,3331,3377,3369,3390,3376,3436,3401,3429,3457,,,,,,,,,,,,,,,,,,,,,,,,,,,,,,,,,,,,,,,,,,,,,,,,,,,,,,,,
3464,3523,3547,3505,3518,3550,3536,3529,3566,3524,3540,3589,3585,3553,3618,3571,3597,3639,3267,3354,3345,3330,3363,3372,3333,3385,3379,3349,3399,3386,3409,3394,3453,3419,3443,3477,,,,,,,,,,,,,,,,,,,,,,,,,,,,,,,,,,,,,,,,,,,,,,,,,,,,,,,,
3471,3519,3547,3502,3516,3550,3532,3525,3564,3518,3537,3584,3584,3552,3618,3566,3594,3635,3264,3353,3342,3327,3358,3370,3330,3382,3376,3344,3395,3386,3406,3390,3446,3419,3446,3481,,,,,,,,,,,,,,,,,,,,,,,,,,,,,,,,,,,,,,,,,,,,,,,,,,,,,,,,
3502,3554,3571,3529,3545,3580,3561,3551,3594,3549,3563,3610,3610,3584,3647,3599,3625,3666,3288,3381,3367,3355,3387,3397,3355,3410,3403,3369,3425,3416,3436,3425,3481,3443,3471,3498,,,,,,,,,,,,,,,,,,,,,,,,,,,,,,,,,,,,,,,,,,,,,,,,,,,,,,,,
3498,3536,3557,3516,3530,3565,3545,3537,3581,3534,3552,3598,3598,3566,3633,3582,3609,3652,3274,3368,3352,3339,3373,3383,3337,3395,3386,3355,3414,3403,3425,3407,3464,3429,3464,3484,,,,,,,,,,,,,,,,,,,,,,,,,,,,,,,,,,,,,,,,,,,,,,,,,,,,,,,,
3523,3554,3571,3529,3547,3582,3562,3557,3599,3553,3571,3617,3612,3584,3645,3601,3627,3666,3291,3384,3371,3359,3388,3398,3357,3414,3408,3370,3430,3431,3453,3424,3481,3446,3477,3502,,,,,,,,,,,,,,,,,,,,,,,,,,,,,,,,,,,,,,,,,,,,,,,,,,,,,,,,
3519,3540,3564,3516,3536,3571,3552,3547,3587,3541,3558,3608,3598,3571,3634,3587,3620,3653,3280,3373,3361,3349,3383,3389,3345,3407,3396,3363,3421,3411,3430,3415,3471,3432,3464,3495,,,,,,,,,,,,,,,,,,,,,,,,,,,,,,,,,,,,,,,,,,,,,,,,,,,,,,,,
3502,3523,3547,3505,3519,3555,3537,3529,3567,3521,3542,3588,3582,3554,3619,3572,3599,3640,3264,3353,3347,3336,3365,3370,3327,3384,3383,3344,3402,3391,3408,3394,3453,3415,3443,3474,,,,,,,,,,,,,,,,,,,,,,,,,,,,,,,,,,,,,,,,,,,,,,,,,,,,,,,,
3509,3529,3554,3505,3522,3554,3538,3532,3572,3526,3543,3591,3589,3558,3621,3573,3606,3643,3271,3363,3351,3341,3375,3381,3336,3392,3386,3356,3402,3394,3415,3404,3460,3425,3453,3484,,,,,,,,,,,,,,,,,,,,,,,,,,,,,,,,,,,,,,,,,,,,,,,,,,,,,,,,
3512,3529,3554,3509,3522,3554,3538,3531,3574,3526,3545,3593,3588,3561,3626,3575,3602,3640,3273,3361,3353,3342,3380,3380,3335,3394,3388,3346,3402,3394,3417,3399,3460,3422,3450,3484,,,,,,,,,,,,,,,,,,,,,,,,,,,,,,,,,,,,,,,,,,,,,,,,,,,,,,,,
3512,3523,3547,3502,3519,3552,3535,3532,3570,3521,3541,3589,3586,3558,3619,3570,3601,3640,3272,3360,3351,3338,3369,3386,3337,3395,3387,3350,3405,3396,3418,3399,3464,3425,3457,3488,,,,,,,,,,,,,,,,,,,,,,,,,,,,,,,,,,,,,,,,,,,,,,,,,,,,,,,,
3550,3561,3588,3540,3559,3590,3574,3569,3609,3562,3581,3626,3623,3593,3658,3608,3638,3680,3304,3395,3384,3375,3402,3409,3370,3429,3420,3385,3439,3431,3450,3433,3495,3457,3481,3516,,,,,,,,,,,,,,,,,,,,,,,,,,,,,,,,,,,,,,,,,,,,,,,,,,,,,,,,
3575,3581,3606,3557,3574,3608,3591,3589,3625,3582,3600,3648,3643,3611,3675,3631,3662,3702,3328,3419,3408,3390,3417,3431,3389,3447,3441,3403,3458,3448,3468,3451,3512,3471,3498,3533,,,,,,,,,,,,,,,,,,,,,,,,,,,,,,,,,,,,,,,,,,,,,,,,,,,,,,,,
3550,3554,3581,3536,3549,3583,3567,3564,3602,3558,3576,3624,3618,3590,3653,3607,3638,3682,3307,3400,3386,3372,3401,3411,3375,3423,3419,3385,3435,3427,3446,3427,3491,3453,3474,3495,,,,,,,,,,,,,,,,,,,,,,,,,,,,,,,,,,,,,,,,,,,,,,,,,,,,,,,,
3564,3568,3592,3547,3561,3598,3583,3576,3616,3571,3590,3638,3633,3603,3664,3620,3653,3694,3319,3409,3398,3383,3413,3424,3379,3436,3431,3398,3448,3438,3457,3443,3498,3457,3471,3505,,,,,,,,,,,,,,,,,,,,,,,,,,,,,,,,,,,,,,,,,,,,,,,,,,,,,,,,
3575,3568,3588,3547,3559,3593,3581,3575,3615,3571,3590,3637,3636,3602,3668,3622,3653,3693,3320,3412,3400,3384,3413,3423,3381,3434,3428,3397,3445,3435,3457,3440,3495,3436,3172,3360,,,,,,,,,,,,,,,,,,,,,,,,,,,,,,,,,,,,,,,,,,,,,,,,,,,,,,,,
3613,3599,3627,3578,3590,3627,3612,3607,3652,3608,3626,3673,3672,3639,3705,3656,3682,3728,3350,3451,3437,3418,3446,3461,3415,3470,3463,3429,3482,3472,3491,3469,3516,2680,3408,3401,,,,,,,,,,,,,,,,,,,,,,,,,,,,,,,,,,,,,,,,,,,,,,,,,,,,,,,,
2743,3498,3519,3477,3486,3526,3515,3516,3564,3523,3543,3585,3587,3551,3614,3562,3588,3633,3284,3365,3356,3346,3373,3386,3344,3400,3388,3362,3401,3384,3400,3372,3429,3037,2902,2233,,,,,,,,,,,,,,,,,,,,,,,,,,,,,,,,,,,,,,,,,,,,,,,,,,,,,,,,
specail_raw_min,,,,,,,,,,,,,,,,,,,,,,,,,,,,,,,,,,,,,,,,,,,,,,,,,,,,,,,,,,,,,,,,,,,,,,,,,,,,,,,,,,,,,,,,,,,
1665,1933,1949,1925,1935,1957,1948,1946,1971,1948,1953,1975,1970,1953,1988,1962,1977,1998,1812,1857,1850,1846,1862,1872,1854,1886,1882,1864,1894,1888,1896,1885,1914,1892,1903,1602,,,,,,,,,,,,,,,,,,,,,,,,,,,,,,,,,,,,,,,,,,,,,,,,,,,,,,,,
1931,1919,1932,1909,1921,1946,1932,1932,1956,1932,1941,1966,1970,1954,1989,1963,1979,2002,1807,1853,1847,1842,1859,1866,1841,1872,1868,1850,1879,1873,1882,1874,1904,1883,1895,1913,,,,,,,,,,,,,,,,,,,,,,,,,,,,,,,,,,,,,,,,,,,,,,,,,,,,,,,,
1936,1929,1942,1918,1930,1953,1946,1942,1966,1940,1952,1976,1979,1963,1999,1974,1988,2012,1815,1862,1856,1850,1868,1874,1849,1878,1874,1857,1886,1880,1889,1883,1911,1890,1904,1921,,,,,,,,,,,,,,,,,,,,,,,,,,,,,,,,,,,,,,,,,,,,,,,,,,,,,,,,
1922,1918,1937,1909,1921,1942,1933,1933,1956,1931,1942,1967,1969,1953,1990,1963,1979,2002,1808,1853,1847,1840,1857,1863,1839,1870,1867,1845,1876,1870,1878,1873,1901,1880,1894,1913,,,,,,,,,,,,,,,,,,,,,,,,,,,,,,,,,,,,,,,,,,,,,,,,,,,,,,,,
1922,1924,1940,1914,1928,1946,1935,1935,1960,1934,1944,1970,1972,1956,1992,1967,1982,2007,1808,1856,1849,1841,1859,1865,1841,1871,1867,1849,1878,1871,1880,1875,1904,1884,1899,1917,,,,,,,,,,,,,,,,,,,,,,,,,,,,,,,,,,,,,,,,,,,,,,,,,,,,,,,,
1931,1935,1946,1919,1930,1951,1941,1941,1962,1938,1950,1974,1975,1960,1996,1971,1986,2009,1811,1861,1854,1847,1864,1871,1846,1875,1873,1855,1884,1878,1888,1880,1910,1890,1905,1923,,,,,,,,,,,,,,,,,,,,,,,,,,,,,,,,,,,,,,,,,,,,,,,,,,,,,,,,
1921,1925,1939,1912,1922,1942,1931,1929,1953,1928,1939,1962,1966,1951,1986,1961,1975,1999,1803,1848,1843,1836,1855,1859,1834,1865,1862,1842,1872,1867,1878,1871,1899,1881,1896,1913,,,,,,,,,,,,,,,,,,,,,,,,,,,,,,,,,,,,,,,,,,,,,,,,,,,,,,,,
1930,1932,1945,1920,1931,1950,1940,1938,1961,1936,1948,1971,1973,1959,1994,1969,1985,2007,1808,1855,1852,1846,1862,1869,1843,1873,1870,1851,1882,1876,1884,1878,1907,1890,1904,1922,,,,,,,,,,,,,,,,,,,,,,,,,,,,,,,,,,,,,,,,,,,,,,,,,,,,,,,,
1915,1923,1939,1913,1923,1943,1932,1931,1954,1929,1940,1963,1965,1950,1986,1958,1974,1998,1799,1847,1842,1835,1851,1857,1832,1864,1859,1842,1873,1864,1874,1868,1897,1879,1891,1912,,,,,,,,,,,,,,,,,,,,,,,,,,,,,,,,,,,,,,,,,,,,,,,,,,,,,,,,
1918,1928,1944,1917,1929,1946,1936,1935,1956,1933,1942,1968,1971,1954,1989,1964,1979,2002,1805,1852,1846,1840,1856,1862,1839,1868,1865,1845,1875,1868,1879,1873,1903,1885,1897,1918,,,,,,,,,,,,,,,,,,,,,,,,,,,,,,,,,,,,,,,,,,,,,,,,,,,,,,,,
1930,1944,1957,1933,1941,1959,1949,1947,1970,1947,1957,1980,1983,1967,2003,1977,1994,2016,1817,1864,1859,1853,1870,1876,1851,1880,1877,1858,1886,1881,1890,1885,1916,1898,1911,1932,,,,,,,,,,,,,,,,,,,,,,,,,,,,,,,,,,,,,,,,,,,,,,,,,,,,,,,,
1928,1945,1960,1932,1942,1960,1951,1951,1974,1949,1960,1983,1985,1969,2005,1979,1997,2019,1818,1867,1862,1854,1873,1878,1854,1882,1877,1860,1890,1882,1893,1886,1916,1899,1911,1935,,,,,,,,,,,,,,,,,,,,,,,,,,,,,,,,,,,,,,,,,,,,,,,,,,,,,,,,
1913,1936,1952,1924,1934,1953,1942,1942,1965,1943,1951,1976,1981,1959,1996,1971,1988,2015,1813,1860,1856,1849,1868,1873,1848,1877,1873,1855,1884,1876,1887,1880,1911,1893,1907,1927,,,,,,,,,,,,,,,,,,,,,,,,,,,,,,,,,,,,,,,,,,,,,,,,,,,,,,,,
1917,1946,1962,1932,1943,1963,1951,1951,1975,1952,1963,1987,1988,1975,2005,1982,2002,2019,1819,1867,1862,1855,1872,1876,1854,1882,1880,1860,1888,1882,1893,1886,1916,1899,1912,1934,,,,,,,,,,,,,,,,,,,,,,,,,,,,,,,,,,,,,,,,,,,,,,,,,,,,,,,,
1914,1946,1963,1937,1945,1961,1953,1952,1977,1953,1969,1988,1991,1973,2009,1989,2000,2023,1820,1867,1863,1856,1872,1877,1853,1883,1881,1862,1889,1883,1895,1887,1918,1900,1913,1936,,,,,,,,,,,,,,,,,,,,,,,,,,,,,,,,,,,,,,,,,,,,,,,,,,,,,,,,
1903,1946,1962,1936,1945,1962,1952,1951,1977,1953,1965,1992,1991,1973,2012,1983,1998,2021,1822,1867,1862,1857,1873,1877,1854,1884,1880,1862,1889,1883,1895,1887,1919,1901,1914,1936,,,,,,,,,,,,,,,,,,,,,,,,,,,,,,,,,,,,,,,,,,,,,,,,,,,,,,,,
1899,1932,1947,1922,1929,1945,1938,1937,1962,1944,1950,1975,1976,1956,1993,1968,1982,2006,1805,1852,1846,1843,1858,1863,1840,1869,1866,1847,1872,1868,1879,1872,1904,1886,1898,1920,,,,,,,,,,,,,,,,,,,,,,,,,,,,,,,,,,,,,,,,,,,,,,,,,,,,,,,,
1915,1942,1957,1932,1938,1960,1948,1945,1972,1948,1958,1981,1983,1965,2002,1979,1991,2012,1813,1859,1854,1849,1867,1871,1849,1877,1874,1855,1881,1876,1887,1878,1911,1893,1906,1928,,,,,,,,,,,,,,,,,,,,,,,,,,,,,,,,,,,,,,,,,,,,,,,,,,,,,,,,
1925,1946,1960,1936,1944,1964,1952,1950,1977,1953,1962,1986,1989,1968,2008,1984,1997,2020,1824,1869,1866,1860,1875,1881,1857,1886,1884,1864,1891,1887,1899,1889,1920,1903,1914,1936,,,,,,,,,,,,,,,,,,,,,,,,,,,,,,,,,,,,,,,,,,,,,,,,,,,,,,,,
1929,1946,1958,1933,1942,1960,1951,1950,1970,1949,1958,1982,1986,1964,2002,1978,1991,2013,1819,1865,1860,1855,1868,1876,1853,1882,1878,1861,1887,1883,1895,1885,1918,1898,1909,1932,,,,,,,,,,,,,,,,,,,,,,,,,,,,,,,,,,,,,,,,,,,,,,,,,,,,,,,,
1930,1941,1954,1930,1937,1956,1952,1943,1966,1944,1952,1976,1981,1961,1997,1974,1986,2010,1814,1859,1855,1850,1865,1872,1850,1878,1874,1857,1884,1879,1891,1880,1914,1896,1906,1930,,,,,,,,,,,,,,,,,,,,,,,,,,,,,,,,,,,,,,,,,,,,,,,,,,,,,,,,
1944,1951,1970,1941,1946,1964,1957,1953,1977,1954,1961,1988,1993,1973,2009,1985,1997,2021,1822,1867,1863,1858,1872,1878,1857,1886,1880,1861,1890,1886,1899,1888,1920,1903,1915,1932,,,,,,,,,,,,,,,,,,,,,,,,,,,,,,,,,,,,,,,,,,,,,,,,,,,,,,,,
1949,1955,1969,1943,1953,1970,1960,1956,1980,1959,1965,1992,1996,1975,2011,1988,2000,2023,1826,1872,1867,1863,1876,1882,1860,1888,1885,1866,1893,1888,1902,1891,1925,1906,1917,1939,,,,,,,,,,,,,,,,,,,,,,,,,,,,,,,,,,,,,,,,,,,,,,,,,,,,,,,,
1951,1957,1969,1944,1950,1969,1960,1956,1980,1960,1966,1991,1995,1974,2012,1987,1998,2023,1826,1871,1867,1862,1876,1883,1858,1888,1885,1867,1893,1889,1901,1892,1923,1906,1917,1938,,,,,,,,,,,,,,,,,,,,,,,,,,,,,,,,,,,,,,,,,,,,,,,,,,,,,,,,
1934,1934,1948,1925,1931,1951,1941,1936,1961,1939,1944,1969,1974,1952,1991,1966,1976,2002,1809,1851,1848,1844,1857,1864,1842,1870,1866,1847,1875,1869,1881,1873,1904,1889,1899,1921,,,,,,,,,,,,,,,,,,,,,,,,,,,,,,,,,,,,,,,,,,,,,,,,,,,,,,,,
1942,1940,1954,1933,1935,1956,1946,1941,1967,1943,1948,1973,1978,1956,1993,1972,1981,2007,1813,1855,1852,1848,1861,1868,1844,1872,1869,1853,1877,1873,1886,1876,1910,1893,1903,1924,,,,,,,,,,,,,,,,,,,,,,,,,,,,,,,,,,,,,,,,,,,,,,,,,,,,,,,,
1967,1959,1974,1952,1955,1975,1966,1963,1987,1963,1968,1993,1998,1977,2013,1991,2006,2028,1833,1877,1874,1869,1881,1888,1862,1890,1889,1872,1898,1893,1906,1895,1929,1911,1922,1944,,,,,,,,,,,,,,,,,,,,,,,,,,,,,,,,,,,,,,,,,,,,,,,,,,,,,,,,
1996,1952,1967,1944,1946,1968,1959,1954,1977,1955,1961,1987,1989,1967,2007,1982,1997,2025,1832,1874,1871,1869,1880,1886,1863,1889,1887,1870,1896,1893,1905,1894,1927,1910,1920,1944,,,,,,,,,,,,,,,,,,,,,,,,,,,,,,,,,,,,,,,,,,,,,,,,,,,,,,,,
1900,1867,1882,1859,1862,1880,1874,1865,1889,1868,1876,1904,1903,1882,1917,1895,1907,1928,1740,1785,1781,1777,1789,1795,1773,1797,1796,1780,1806,1804,1818,1804,1835,1820,1831,1848,,,,,,,,,,,,,,,,,,,,,,,,,,,,,,,,,,,,,,,,,,,,,,,,,,,,,,,,
1876,1869,1883,1865,1867,1886,1878,1871,1893,1874,1881,1907,1908,1888,1923,1899,1912,1933,1741,1786,1784,1778,1789,1798,1775,1799,1799,1782,1808,1804,1817,1805,1837,1824,1833,1848,,,,,,,,,,,,,,,,,,,,,,,,,,,,,,,,,,,,,,,,,,,,,,,,,,,,,,,,
1870,1872,1887,1867,1867,1888,1879,1872,1894,1874,1881,1908,1909,1889,1923,1899,1911,1933,1741,1788,1784,1777,1790,1795,1773,1800,1799,1786,1809,1804,1819,1806,1839,1824,1833,1852,,,,,,,,,,,,,,,,,,,,,,,,,,,,,,,,,,,,,,,,,,,,,,,,,,,,,,,,
1885,1891,1904,1882,1886,1903,1897,1891,1914,1891,1898,1924,1926,1906,1940,1917,1932,1952,1757,1802,1798,1791,1805,1809,1790,1815,1813,1799,1822,1819,1832,1822,1855,1839,1850,1867,,,,,,,,,,,,,,,,,,,,,,,,,,,,,,,,,,,,,,,,,,,,,,,,,,,,,,,,
1869,1878,1891,1870,1872,1890,1883,1879,1899,1877,1883,1913,1912,1894,1927,1903,1918,1940,1744,1792,1787,1779,1789,1796,1775,1802,1799,1782,1809,1806,1819,1808,1842,1826,1835,1854,,,,,,,,,,,,,,,,,,,,,,,,,,,,,,,,,,,,,,,,,,,,,,,,,,,,,,,,
1870,1882,1898,1872,1877,1897,1889,1882,1904,1882,1888,1918,1915,1896,1930,1907,1919,1943,1749,1798,1790,1783,1795,1801,1781,1809,1806,1789,1815,1809,1825,1814,1846,1829,1841,1857,,,,,,,,,,,,,,,,,,,,,,,,,,,,,,,,,,,,,,,,,,,,,,,,,,,,,,,,
1863,1878,1891,1867,1872,1891,1885,1878,1899,1876,1885,1912,1910,1891,1926,1902,1914,1936,1742,1790,1785,1778,1792,1797,1776,1803,1801,1784,1811,1807,1819,1809,1841,1824,1835,1852,,,,,,,,,,,,,,,,,,,,,,,,,,,,,,,,,,,,,,,,,,,,,,,,,,,,,,,,
1876,1895,1908,1885,1890,1910,1901,1895,1916,1892,1902,1931,1928,1909,1944,1921,1932,1954,1758,1806,1800,1794,1807,1812,1793,1819,1816,1801,1826,1821,1833,1825,1857,1842,1854,1869,,,,,,,,,,,,,,,,,,,,,,,,,,,,,,,,,,,,,,,,,,,,,,,,,,,,,,,,
1869,1893,1906,1883,1890,1908,1898,1893,1914,1893,1901,1928,1927,1908,1943,1920,1932,1955,1756,1803,1799,1792,1805,1810,1790,1817,1816,1798,1823,1819,1831,1823,1854,1841,1852,1869,,,,,,,,,,,,,,,,,,,,,,,,,,,,,,,,,,,,,,,,,,,,,,,,,,,,,,,,
1869,1897,1913,1889,1895,1914,1904,1898,1921,1897,1906,1933,1931,1913,1947,1923,1938,1959,1763,1807,1803,1796,1810,1816,1793,1822,1821,1803,1829,1823,1837,1827,1859,1842,1857,1872,,,,,,,,,,,,,,,,,,,,,,,,,,,,,,,,,,,,,,,,,,,,,,,,,,,,,,,,
1846,1887,1900,1878,1884,1900,1893,1888,1911,1888,1896,1921,1920,1903,1935,1911,1927,1947,1749,1797,1791,1786,1799,1805,1783,1812,1810,1793,1818,1814,1825,1818,1850,1831,1846,1861,,,,,,,,,,,,,,,,,,,,,,,,,,,,,,,,,,,,,,,,,,,,,,,,,,,,,,,,
1865,1897,1910,1887,1894,1911,1904,1900,1920,1897,1906,1932,1930,1913,1948,1923,1937,1959,1759,1806,1801,1793,1811,1816,1795,1823,1819,1803,1830,1823,1836,1827,1859,1841,1854,1872,,,,,,,,,,,,,,,,,,,,,,,,,,,,,,,,,,,,,,,,,,,,,,,,,,,,,,,,
1869,1895,1910,1885,1893,1911,1901,1898,1919,1894,1904,1930,1929,1913,1948,1920,1935,1957,1757,1805,1799,1791,1808,1815,1793,1821,1817,1800,1828,1823,1834,1825,1855,1841,1855,1874,,,,,,,,,,,,,,,,,,,,,,,,,,,,,,,,,,,,,,,,,,,,,,,,,,,,,,,,
1885,1913,1923,1900,1909,1928,1917,1912,1935,1911,1918,1944,1944,1929,1964,1938,1952,1974,1770,1820,1813,1806,1823,1829,1806,1836,1832,1814,1844,1839,1850,1844,1874,1854,1869,1883,,,,,,,,,,,,,,,,,,,,,,,,,,,,,,,,,,,,,,,,,,,,,,,,,,,,,,,,
1883,1904,1915,1893,1901,1920,1909,1904,1928,1903,1912,1937,1937,1920,1956,1929,1943,1966,1763,1813,1805,1798,1816,1822,1797,1828,1823,1806,1838,1832,1844,1834,1865,1846,1865,1876,,,,,,,,,,,,,,,,,,,,,,,,,,,,,,,,,,,,,,,,,,,,,,,,,,,,,,,,
1897,1913,1923,1900,1910,1929,1918,1915,1938,1913,1922,1947,1945,1930,1962,1939,1953,1974,1772,1822,1815,1808,1824,1830,1808,1838,1835,1815,1847,1847,1859,1844,1874,1855,1872,1885,,,,,,,,,,,,,,,,,,,,,,,,,,,,,,,,,,,,,,,,,,,,,,,,,,,,,,,,
1895,1906,1919,1893,1904,1922,1913,1910,1931,1907,1915,1942,1937,1922,1957,1931,1949,1967,1766,1816,1810,1803,1821,1824,1801,1834,1829,1810,1842,1836,1847,1838,1869,1848,1865,1882,,,,,,,,,,,,,,,,,,,,,,,,,,,,,,,,,,,,,,,,,,,,,,,,,,,,,,,,
1885,1897,1910,1887,1895,1914,1904,1900,1921,1896,1907,1932,1928,1914,1948,1923,1938,1960,1757,1805,1802,1796,1812,1814,1791,1822,1822,1801,1832,1826,1835,1827,1859,1839,1854,1870,,,,,,,,,,,,,,,,,,,,,,,,,,,,,,,,,,,,,,,,,,,,,,,,,,,,,,,,
1889,1900,1913,1887,1896,1913,1905,1901,1923,1899,1907,1933,1932,1916,1950,1924,1941,1961,1761,1811,1804,1799,1817,1820,1796,1826,1823,1807,1831,1827,1839,1833,1863,1844,1859,1876,,,,,,,,,,,,,,,,,,,,,,,,,,,,,,,,,,,,,,,,,,,,,,,,,,,,,,,,
1891,1900,1913,1889,1896,1914,1905,1901,1924,1899,1908,1935,1932,1917,1952,1925,1939,1960,1762,1810,1805,1799,1820,1820,1795,1827,1824,1802,1832,1827,1840,1830,1863,1842,1857,1876,,,,,,,,,,,,,,,,,,,,,,,,,,,,,,,,,,,,,,,,,,,,,,,,,,,,,,,,
1891,1897,1910,1885,1894,1912,1903,1901,1922,1896,1907,1932,1931,1915,1948,1922,1939,1960,1762,1809,1804,1797,1814,1823,1797,1828,1823,1803,1833,1828,1840,1830,1865,1844,1861,1878,,,,,,,,,,,,,,,,,,,,,,,,,,,,,,,,,,,,,,,,,,,,,,,,,,,,,,,,
1911,1917,1932,1906,1916,1933,1924,1922,1943,1918,1928,1952,1951,1935,1969,1943,1959,1981,1779,1828,1822,1817,1831,1836,1814,1846,1841,1823,1851,1847,1858,1848,1882,1861,1874,1893,,,,,,,,,,,,,,,,,,,,,,,,,,,,,,,,,,,,,,,,,,,,,,,,,,,,,,,,
1925,1928,1941,1915,1924,1942,1933,1932,1952,1928,1938,1964,1961,1944,1979,1955,1972,1993,1792,1841,1835,1825,1840,1847,1824,1856,1853,1832,1862,1856,1867,1858,1891,1869,1883,1902,,,,,,,,,,,,,,,,,,,,,,,,,,,,,,,,,,,,,,,,,,,,,,,,,,,,,,,,
1911,1913,1928,1904,1911,1929,1920,1919,1939,1915,1925,1951,1948,1933,1967,1942,1959,1982,1780,1831,1823,1815,1831,1837,1817,1843,1841,1823,1849,1845,1855,1845,1880,1859,1870,1882,,,,,,,,,,,,,,,,,,,,,,,,,,,,,,,,,,,,,,,,,,,,,,,,,,,,,,,,
1919,1921,1934,1910,1917,1937,1929,1925,1947,1923,1933,1959,1956,1940,1973,1949,1967,1989,1787,1835,1829,1821,1837,1844,1819,1850,1847,1830,1856,1851,1861,1854,1883,1861,1869,1887,,,,,,,,,,,,,,,,,,,,,,,,,,,,,,,,,,,,,,,,,,,,,,,,,,,,,,,,
1925,1921,1932,1910,1916,1935,1928,1925,1946,1923,1933,1958,1957,1939,1975,1950,1967,1988,1787,1837,1831,1822,1837,1843,1820,1849,1845,1829,1855,1849,1861,1852,1882,1850,1708,1809,,,,,,,,,,,,,,,,,,,,,,,,,,,,,,,,,,,,,,,,,,,,,,,,,,,,,,,,
1945,1938,1953,1926,1933,1953,1945,1942,1966,1942,1952,1977,1977,1959,1995,1968,1982,2007,1804,1858,1850,1840,1855,1863,1839,1868,1865,1846,1875,1869,1880,1868,1893,1443,1835,1831,,,,,,,,,,,,,,,,,,,,,,,,,,,,,,,,,,,,,,,,,,,,,,,,,,,,,,,,
1477,1883,1895,1872,1877,1898,1892,1893,1919,1897,1907,1930,1931,1912,1946,1918,1932,1956,1768,1812,1807,1801,1816,1823,1801,1830,1824,1810,1831,1822,1830,1816,1846,1635,1562,1202,,,,,,,,,,,,,,,,,,,,,,,,,,,,,,,,,,,,,,,,,,,,,,,,,,,,,,,,
special_raw_delta,,,,,,,,,,,,,,,,,,,,,,,,,,,,,,,,,,,,,,,,,,,,,,,,,,,,,,,,,,,,,,,,,,,,,,,,,,,,,,,,,,,,,,,,,,,
444,403,300,300,300,300,300,300,300,300,300,300,300,300,300,300,300,353,365,300,300,300,300,300,300,300,300,300,300,300,300,300,300,300,443,495,,,,,,,,,,,,,,,,,,,,,,,,,,,,,,,,,,,,,,,,,,,,,,,,,,,,,,,,
424,300,300,300,300,300,301,300,300,300,300,300,300,300,300,300,300,357,370,300,300,300,300,300,300,300,300,300,300,300,300,300,300,300,300,449,,,,,,,,,,,,,,,,,,,,,,,,,,,,,,,,,,,,,,,,,,,,,,,,,,,,,,,,
300,300,300,300,300,300,300,300,300,300,300,300,300,300,300,300,300,357,368,300,300,300,300,300,300,300,300,300,300,300,300,300,300,300,300,300,,,,,,,,,,,,,,,,,,,,,,,,,,,,,,,,,,,,,,,,,,,,,,,,,,,,,,,,
300,300,300,300,300,300,300,300,300,300,300,300,300,300,300,300,300,356,369,300,300,300,300,300,300,300,300,300,300,300,300,300,300,300,300,300,,,,,,,,,,,,,,,,,,,,,,,,,,,,,,,,,,,,,,,,,,,,,,,,,,,,,,,,
300,300,300,300,300,300,300,300,300,300,300,300,300,300,300,300,300,358,374,300,300,300,300,300,300,300,300,300,300,300,300,300,300,300,300,300,,,,,,,,,,,,,,,,,,,,,,,,,,,,,,,,,,,,,,,,,,,,,,,,,,,,,,,,
300,300,300,300,300,300,300,300,300,300,300,300,300,300,300,300,300,358,374,300,300,300,300,300,300,300,300,300,300,300,300,300,300,300,300,300,,,,,,,,,,,,,,,,,,,,,,,,,,,,,,,,,,,,,,,,,,,,,,,,,,,,,,,,
300,300,300,300,300,300,300,300,300,300,300,300,300,300,300,300,300,356,371,300,300,300,300,300,300,300,300,300,300,300,300,300,300,300,300,300,,,,,,,,,,,,,,,,,,,,,,,,,,,,,,,,,,,,,,,,,,,,,,,,,,,,,,,,
300,300,300,300,300,300,300,300,300,300,300,300,300,300,300,300,300,363,376,300,300,300,300,300,300,300,300,300,300,300,300,300,300,300,300,300,,,,,,,,,,,,,,,,,,,,,,,,,,,,,,,,,,,,,,,,,,,,,,,,,,,,,,,,
300,300,300,300,300,300,300,300,300,300,300,300,300,300,300,300,300,357,368,300,300,300,300,300,300,300,300,300,300,300,300,300,300,300,300,300,,,,,,,,,,,,,,,,,,,,,,,,,,,,,,,,,,,,,,,,,,,,,,,,,,,,,,,,
300,300,300,300,300,300,300,300,300,300,304,300,300,300,300,300,300,358,371,300,303,300,300,300,300,300,300,300,300,300,300,300,300,300,300,300,,,,,,,,,,,,,,,,,,,,,,,,,,,,,,,,,,,,,,,,,,,,,,,,,,,,,,,,
300,300,300,300,300,300,300,300,300,300,300,300,300,300,300,300,300,361,376,300,300,300,300,300,300,300,300,300,300,300,300,300,300,300,300,300,,,,,,,,,,,,,,,,,,,,,,,,,,,,,,,,,,,,,,,,,,,,,,,,,,,,,,,,
300,300,300,300,300,300,300,300,300,300,300,300,300,300,300,300,300,362,377,300,300,300,300,300,300,300,300,300,300,300,300,300,300,300,300,300,,,,,,,,,,,,,,,,,,,,,,,,,,,,,,,,,,,,,,,,,,,,,,,,,,,,,,,,
300,300,300,300,300,300,300,300,300,300,300,300,300,300,300,300,300,357,369,300,300,300,300,300,300,300,300,300,300,300,300,300,300,300,300,300,,,,,,,,,,,,,,,,,,,,,,,,,,,,,,,,,,,,,,,,,,,,,,,,,,,,,,,,
300,300,300,300,300,300,300,300,300,300,300,300,300,300,300,300,300,361,374,300,300,300,300,300,300,300,300,300,300,300,300,300,300,300,300,300,,,,,,,,,,,,,,,,,,,,,,,,,,,,,,,,,,,,,,,,,,,,,,,,,,,,,,,,
300,300,300,300,300,300,300,300,300,300,300,300,300,300,300,300,300,356,370,300,300,300,300,300,300,300,300,300,300,300,300,300,300,300,300,300,,,,,,,,,,,,,,,,,,,,,,,,,,,,,,,,,,,,,,,,,,,,,,,,,,,,,,,,
300,300,300,300,300,300,300,300,300,300,300,300,300,300,300,300,300,361,376,300,300,300,300,300,300,300,300,300,300,300,300,300,300,300,300,300,,,,,,,,,,,,,,,,,,,,,,,,,,,,,,,,,,,,,,,,,,,,,,,,,,,,,,,,
300,300,300,300,300,300,300,300,300,300,300,300,300,300,300,300,300,362,377,300,300,300,300,300,300,300,300,300,300,300,300,300,300,300,300,300,,,,,,,,,,,,,,,,,,,,,,,,,,,,,,,,,,,,,,,,,,,,,,,,,,,,,,,,
300,300,300,300,300,300,300,300,300,300,300,300,300,300,300,300,300,358,374,300,300,300,300,300,300,300,300,300,300,300,300,300,300,300,300,300,,,,,,,,,,,,,,,,,,,,,,,,,,,,,,,,,,,,,,,,,,,,,,,,,,,,,,,,
300,300,300,300,300,300,300,300,300,300,300,300,300,300,300,300,300,356,367,300,300,300,300,300,300,300,300,300,300,300,300,300,300,300,300,300,,,,,,,,,,,,,,,,,,,,,,,,,,,,,,,,,,,,,,,,,,,,,,,,,,,,,,,,
300,300,300,300,300,300,300,300,300,300,300,300,300,300,300,300,300,354,366,300,300,300,300,300,300,300,300,300,300,300,300,300,300,300,300,300,,,,,,,,,,,,,,,,,,,,,,,,,,,,,,,,,,,,,,,,,,,,,,,,,,,,,,,,
300,300,300,300,300,300,300,300,300,300,300,300,300,300,300,300,300,362,376,300,300,300,300,300,300,300,300,300,300,300,300,300,300,300,300,300,,,,,,,,,,,,,,,,,,,,,,,,,,,,,,,,,,,,,,,,,,,,,,,,,,,,,,,,
300,300,300,300,300,300,300,300,300,300,300,300,300,300,300,300,300,362,377,300,300,300,300,300,300,300,300,300,300,300,300,300,300,300,300,300,,,,,,,,,,,,,,,,,,,,,,,,,,,,,,,,,,,,,,,,,,,,,,,,,,,,,,,,
300,300,300,300,300,300,300,300,300,300,300,300,300,300,300,300,300,356,368,300,300,300,300,300,300,300,300,300,300,300,300,300,300,300,300,300,,,,,,,,,,,,,,,,,,,,,,,,,,,,,,,,,,,,,,,,,,,,,,,,,,,,,,,,
300,300,300,300,300,300,300,300,300,300,300,300,300,300,300,300,300,360,372,300,300,300,300,300,300,300,300,300,300,300,300,300,300,300,300,300,,,,,,,,,,,,,,,,,,,,,,,,,,,,,,,,,,,,,,,,,,,,,,,,,,,,,,,,
300,300,300,300,300,300,300,300,300,300,300,300,300,300,300,300,300,358,371,300,300,300,300,300,300,300,300,300,300,300,300,300,300,300,300,300,,,,,,,,,,,,,,,,,,,,,,,,,,,,,,,,,,,,,,,,,,,,,,,,,,,,,,,,
300,300,300,300,300,300,300,300,300,300,300,300,300,300,300,300,300,354,367,300,300,300,300,300,300,300,300,300,300,300,300,300,300,300,300,300,,,,,,,,,,,,,,,,,,,,,,,,,,,,,,,,,,,,,,,,,,,,,,,,,,,,,,,,
300,300,300,300,300,300,300,300,300,300,300,300,300,300,300,300,300,360,375,300,300,300,300,300,300,300,300,300,300,300,300,300,300,300,300,300,,,,,,,,,,,,,,,,,,,,,,,,,,,,,,,,,,,,,,,,,,,,,,,,,,,,,,,,
330,332,329,334,331,332,342,340,339,335,336,329,336,331,339,332,335,355,366,329,339,333,335,332,331,345,338,338,334,334,340,330,330,334,338,336,,,,,,,,,,,,,,,,,,,,,,,,,,,,,,,,,,,,,,,,,,,,,,,,,,,,,,,,
337,336,336,340,335,338,348,346,345,341,340,331,340,338,345,337,342,359,372,333,344,338,339,339,337,350,347,347,339,340,348,337,336,341,343,341,,,,,,,,,,,,,,,,,,,,,,,,,,,,,,,,,,,,,,,,,,,,,,,,,,,,,,,,
309,300,300,300,300,300,300,300,300,300,300,300,300,300,300,300,300,355,370,300,300,300,300,300,300,300,300,300,300,300,300,300,300,300,300,300,,,,,,,,,,,,,,,,,,,,,,,,,,,,,,,,,,,,,,,,,,,,,,,,,,,,,,,,
300,300,300,300,300,300,300,300,300,300,300,300,300,300,300,300,300,352,363,300,300,300,300,300,300,300,300,300,300,300,300,300,300,300,300,300,,,,,,,,,,,,,,,,,,,,,,,,,,,,,,,,,,,,,,,,,,,,,,,,,,,,,,,,
300,300,300,300,300,300,300,300,300,300,300,300,300,300,300,300,300,355,366,300,300,300,300,300,300,300,300,300,300,300,300,300,300,300,300,300,,,,,,,,,,,,,,,,,,,,,,,,,,,,,,,,,,,,,,,,,,,,,,,,,,,,,,,,
300,300,300,300,300,300,300,300,300,300,300,300,300,300,300,300,300,359,372,300,300,300,300,300,300,300,300,300,300,300,300,300,300,300,300,300,,,,,,,,,,,,,,,,,,,,,,,,,,,,,,,,,,,,,,,,,,,,,,,,,,,,,,,,
300,300,300,300,300,300,300,300,300,300,300,300,300,300,300,300,300,360,375,300,300,300,300,300,300,300,300,300,300,300,300,300,300,300,300,300,,,,,,,,,,,,,,,,,,,,,,,,,,,,,,,,,,,,,,,,,,,,,,,,,,,,,,,,
300,300,300,300,300,300,300,300,300,300,300,300,300,300,300,300,300,358,369,300,300,300,300,300,300,300,300,300,300,300,300,300,300,300,300,300,,,,,,,,,,,,,,,,,,,,,,,,,,,,,,,,,,,,,,,,,,,,,,,,,,,,,,,,
300,300,300,300,300,300,300,300,300,300,300,300,300,300,300,300,300,356,371,300,300,300,300,300,300,300,300,300,300,300,300,300,300,300,300,300,,,,,,,,,,,,,,,,,,,,,,,,,,,,,,,,,,,,,,,,,,,,,,,,,,,,,,,,
300,300,300,300,300,300,300,300,300,300,300,300,300,300,300,300,300,354,367,300,300,300,300,300,300,300,300,300,300,300,300,300,300,300,300,300,,,,,,,,,,,,,,,,,,,,,,,,,,,,,,,,,,,,,,,,,,,,,,,,,,,,,,,,
300,300,300,300,300,300,300,300,300,300,300,300,300,300,300,300,300,357,368,300,300,300,300,300,300,300,300,300,300,300,300,300,300,300,300,300,,,,,,,,,,,,,,,,,,,,,,,,,,,,,,,,,,,,,,,,,,,,,,,,,,,,,,,,
300,300,300,300,300,300,300,300,300,300,300,300,300,300,300,300,300,356,368,300,300,300,300,300,300,300,300,300,300,300,300,300,300,300,300,300,,,,,,,,,,,,,,,,,,,,,,,,,,,,,,,,,,,,,,,,,,,,,,,,,,,,,,,,
300,300,300,300,300,300,300,300,300,300,300,300,300,300,300,300,300,358,371,300,300,300,300,300,300,300,300,300,300,300,300,300,300,300,300,300,,,,,,,,,,,,,,,,,,,,,,,,,,,,,,,,,,,,,,,,,,,,,,,,,,,,,,,,
300,300,300,300,300,300,300,300,300,300,300,300,300,300,300,300,300,356,366,300,300,300,300,300,300,300,300,300,300,300,300,300,300,300,300,300,,,,,,,,,,,,,,,,,,,,,,,,,,,,,,,,,,,,,,,,,,,,,,,,,,,,,,,,
300,300,300,300,300,300,300,300,300,300,300,300,300,300,300,300,300,359,373,300,300,300,300,300,300,300,300,300,300,300,300,300,300,300,300,300,,,,,,,,,,,,,,,,,,,,,,,,,,,,,,,,,,,,,,,,,,,,,,,,,,,,,,,,
300,300,300,300,300,300,300,300,300,300,300,300,300,300,300,300,300,359,374,300,300,300,300,300,300,300,300,300,300,307,307,300,300,300,300,300,,,,,,,,,,,,,,,,,,,,,,,,,,,,,,,,,,,,,,,,,,,,,,,,,,,,,,,,
300,300,300,300,300,300,300,300,300,300,300,300,300,300,300,300,300,360,374,300,300,300,300,300,300,300,300,300,300,300,300,300,300,300,300,300,,,,,,,,,,,,,,,,,,,,,,,,,,,,,,,,,,,,,,,,,,,,,,,,,,,,,,,,
300,300,300,300,300,300,300,300,300,300,300,300,300,300,300,300,300,358,372,300,300,300,300,300,300,300,300,300,300,300,300,300,300,300,300,300,,,,,,,,,,,,,,,,,,,,,,,,,,,,,,,,,,,,,,,,,,,,,,,,,,,,,,,,
300,300,300,300,300,300,300,300,300,300,300,300,300,300,300,300,300,363,375,300,300,300,300,300,300,300,300,300,300,300,300,300,300,300,300,300,,,,,,,,,,,,,,,,,,,,,,,,,,,,,,,,,,,,,,,,,,,,,,,,,,,,,,,,
304,300,300,300,300,300,300,300,300,300,300,300,300,300,300,300,300,362,376,300,300,301,308,300,300,300,300,300,304,302,305,300,300,300,300,300,,,,,,,,,,,,,,,,,,,,,,,,,,,,,,,,,,,,,,,,,,,,,,,,,,,,,,,,
301,300,300,300,300,300,300,300,300,300,300,300,300,300,300,300,300,351,362,300,300,300,305,300,300,300,300,300,300,300,300,300,300,300,300,300,,,,,,,,,,,,,,,,,,,,,,,,,,,,,,,,,,,,,,,,,,,,,,,,,,,,,,,,
300,300,300,300,300,300,300,300,300,300,300,300,300,300,300,300,300,355,366,300,300,300,301,300,300,300,300,300,300,300,300,300,300,300,300,300,,,,,,,,,,,,,,,,,,,,,,,,,,,,,,,,,,,,,,,,,,,,,,,,,,,,,,,,
300,300,300,300,300,300,300,300,300,300,300,300,300,300,300,300,300,357,369,300,300,300,300,300,300,300,300,300,300,300,300,300,300,300,300,300,,,,,,,,,,,,,,,,,,,,,,,,,,,,,,,,,,,,,,,,,,,,,,,,,,,,,,,,
300,300,300,300,300,300,300,300,300,300,300,300,300,300,300,300,300,357,368,300,300,300,300,300,300,300,300,300,300,300,300,300,300,300,300,300,,,,,,,,,,,,,,,,,,,,,,,,,,,,,,,,,,,,,,,,,,,,,,,,,,,,,,,,
300,300,300,300,300,300,300,300,300,300,300,300,300,300,300,300,300,361,375,300,300,300,300,300,300,300,300,300,300,300,300,300,300,300,300,300,,,,,,,,,,,,,,,,,,,,,,,,,,,,,,,,,,,,,,,,,,,,,,,,,,,,,,,,
300,300,300,300,300,300,300,300,300,300,300,300,300,300,300,300,300,356,370,300,300,300,300,300,300,300,300,300,300,300,300,300,300,300,399,364,,,,,,,,,,,,,,,,,,,,,,,,,,,,,,,,,,,,,,,,,,,,,,,,,,,,,,,,
300,300,300,300,300,300,300,300,300,300,300,300,300,300,300,300,300,359,372,300,300,300,300,300,300,300,300,300,300,300,300,300,300,478,407,326,,,,,,,,,,,,,,,,,,,,,,,,,,,,,,,,,,,,,,,,,,,,,,,,,,,,,,,,
541,307,300,300,300,300,300,300,300,300,300,300,300,300,303,301,300,357,371,300,300,300,300,300,300,300,300,300,300,300,300,302,512,601,473,623,,,,,,,,,,,,,,,,,,,,,,,,,,,,,,,,,,,,,,,,,,,,,,,,,,,,,,,,
653,535,300,300,301,300,301,300,300,300,300,300,300,300,301,304,301,354,368,300,303,300,300,300,300,300,300,300,300,300,301,305,382,397,482,843,,,,,,,,,,,,,,,,,,,,,,,,,,,,,,,,,,,,,,,,,,,,,,,,,,,,,,,,
unified_selfraw_limit,,,,,,,,,,,,,,,,,,,,,,,,,,,,,,,,,,,,,,,,,,,,,,,,,,,,,,,,,,,,,,,,,,,,,,,,,,,,,,,,,,,,,,,,,,,
99999,100,,,,,,,,,,,,,,,,,,,,,,,,,,,,,,,,,,,,,,,,,,,,,,,,,,,,,,,,,,,,,,,,,,,,,,,,,,,,,,,,,,,,,,,,,,
noise_selfdata_limit,,,,,,,,,,,,,,,,,,,,,,,,,,,,,,,,,,,,,,,,,,,,,,,,,,,,,,,,,,,,,,,,,,,,,,,,,,,,,,,,,,,,,,,,,,,
500,,,,,,,,,,,,,,,,,,,,,,,,,,,,,,,,,,,,,,,,,,,,,,,,,,,,,,,,,,,,,,,,,,,,,,,,,,,,,,,,,,,,,,,,,,,
special_selfraw_max,,,,,,,,,,,,,,,,,,,,,,,,,,,,,,,,,,,,,,,,,,,,,,,,,,,,,,,,,,,,,,,,,,,,,,,,,,,,,,,,,,,,,,,,,,,
13893,15500,15662,15789,16574,16833,16607,17020,16939,17261,17486,17557,16644,17839,17550,17529,16890,17745,16418,16543,17088,16615,16670,16517,15749,15736,15631,14076,10602,11252,11200,12495,11845,12516,12591,12950,12710,12849,12489,12824,11827,12753,12833,11943,12280,12007,11578,11893,11818,11373,11600,11058,11163,10953,10985,9272,17147,17591,17777,17852,17765,17888,17997,18427,18332,18311,18653,18251,18657,18371,18430,18018,18328,18763,15675,17136,17526,16834,16978,16552,16774,16755,17102,16259,16878,16333,16614,15982,16217,15938,15820,12239
special_selfraw_min,,,,,,,,,,,,,,,,,,,,,,,,,,,,,,,,,,,,,,,,,,,,,,,,,,,,,,,,,,,,,,,,,,,,,,,,,,,,,,,,,,,,,,,,,,,
730,814,823,830,871,886,874,895,890,908,920,923,875,937,923,921,888,933,863,870,899,873,876,869,829,827,821,496,274,592,589,656,623,657,661,680,668,675,656,674,622,671,675,627,645,632,608,626,622,597,610,582,586,575,578,301,406,924,934,939,934,940,946,968,964,962,981,960,982,966,969,948,963,901,401,413,422,396,407,384,394,401,410,379,408,385,397,395,413,369,399,221
