{
	"centerX" : 0.5,
	"centerY" : 0.5,
	"angle" : 0,
	"scale" : 1,
	"width" : 200,
	"height" : 114,
	"contents" : [{
			"type" : "image",
			"resource" : {
				"type" : "static",
				"path" : "res/tea_time.png"
			},
			"centerX" : 0.5,
			"centerY" : 0.5,
			"width" : 200,
			"height" : 114,
			"angle" : 0,
			"zorder" : 1
		},
		{
            "type": "text",
            "centerX": 0.68,
            "centerY": 0.92,
            "width": 110,
            "height": 16,
            "angle": 0,
            "color": "#ffffffff",
            "isVertical": 0,
			"alignment": 0,
            "text": "{yyyy-MM-dd}",
            "zorder": 2
        }
	]
}
