zyskowski	Z IH S K AO F S K IY
zurawski	Z ER AA F S K IY
zuccarelli	Z UW K ER EH L IY
zlomsowitch	Z L AA M S OW IH CH
zillionaire	Z IH L Y AH N EH R
advising	AE D V AY Z IH NG
trustworthiness	T R AH S T W ER DH IY N AH S
trustworthy	T R AH S T W ER DH IY
trusty	T R AH S T IY
truszkowski	T R AH SH K AO F S K IY
thanking	TH AE NG K IH NG
thankless	TH AE NG K L AH S
thanks	TH AE NG K S
thanksgiving	TH AE NG K S G IH V IH NG
thankyou	TH AE NG K Y UW
thano	TH AA N OW
solorio	S OW L AO R IY OW
solorzano	S OW L AO R Z AA N OW
saturating	S AE CH ER EY T IH NG
saturation	S AE CH ER EY SH AH N
resolving	R IY Z AA L V IH NG
resonance	R EH Z AH N AH N S
resonant	R EH Z AH N AH N T
positioned	P AH Z IH SH AH N D
opportunistic	AA P ER T UW N IH S T IH K
mitsukoshi	M IY T S UW K OW SH IY
machivellian	M AE K AH V EH L IY AH N
lafferty	L AE F ER T IY
kammerzell	K AE M ER Z AH L
impressionistic	IH M P R EH SH AH N IH S T IH K
huibregtse	HH UW B R EH K T S
gelatinous	JH AH L AE T AH N AH S
emissions	IH M IH SH AH N Z
diodato	D IY OW D AA T OW
customary	K AH S T AH M EH R IY
belabors	B IH L EY B ER Z
obermiller	OW B ER M IH L ER
signers	S AY N ER Z
superficially	S UW P ER F IH SH AH L IY
tonsillectomies	T AA N S IH L EH K T AH M IY Z
tonsillectomy	T AA N S IH L EH K T AH M IY
mimnaugh	M IH M N AW
luminescence	L UW M AH N EH S AH N S
luminescent	L UW M AH N EH S AH N T
clientele	K L AY AH N T EH L
coarticulated	K OW AA R T IH K Y UW L EY T AH D
darwinism	D AA R W IH N IH Z AH M
daydreaming	D EY D R IY M IH NG
escalated	EH S K AH L EY T IH D
investimento	IH N V EH S T IH M EH N T OW
replenished	R IY P L EH N IH SH T
replenishing	R IY P L EH N IH SH IH NG
replenishment	R IH P L EH N IH SH M AH N T
seasonable	S IY Z AH N AH B AH L
secondaries	S EH K AH N D EH R IY Z
stimulative	S T IH M Y AH L EY T IH V
torpedoing	T AO R P IY D OW IH NG
unaccompanied	AH N AH K AH M P AH N IY D
undelivered	AH N D IH L IH V ER D
viewfinder	V Y UW F AY N D ER
wettergreen	W EH T ER G R IY N
workaholics	W ER K AH HH AA L IH K S
workmanlike	W ER K M AE N L AY K
zylstra	Z IH L S T R AH
zimmerle	Z IH M ER AH L
zimmerly	Z IH M ER L IY
zinser	Z IH N S ER
zinsmeister	Z IH N S M AY S T ER
zinter	Z IH N T ER
ziobro	Z IY OW B R OW
ziolkowski	Z IY OW L K AO F S K IY
zircon	Z ER K AH N
zirconium	Z ER K OW N IY AH M
zirconiums	Z ER K OW N IY AH M Z
zircons	Z ER K AA N Z
zoologists	Z OW AA L AH JH AH S
nightengales	N AY T IH NG G AH L Z
mindboggling	M AY N D B AO G L IH NG