{
	"config":{
		"hw_platform": ["QRD"],
		"soc_id": ["540", "552"]
	},
	"aw9610x_0_sar":{
		"owner": "sns_aw9610x",
		".register_b":{
			"owner": "sns_aw9610x",
			"check_sum": { "type": "int", "ver": "0",
			"data": "0x85002356"
			},
			"reg_0x0110":{ "type": "int", "ver": "0", "data": "0x0110"},
			"reg_0x0110_val":{ "type": "int", "ver": "0", "data": "0x00000000"},
			"reg_0x0114":{ "type": "int", "ver": "0", "data": "0x0114"},
			"reg_0x0114_val":{ "type": "int", "ver": "0", "data": "0x00000000"},
			"reg_0x0118":{ "type": "int", "ver": "0", "data": "0x0118"},
			"reg_0x0118_val":{ "type": "int", "ver": "0", "data": "0xE0400000"},
			"reg_0x011C":{ "type": "int", "ver": "0", "data": "0x011C"},
			"reg_0x011C_val":{ "type": "int", "ver": "0", "data": "0x00000000"},
			"reg_0x0120":{ "type": "int", "ver": "0", "data": "0x0120"},
			"reg_0x0120_val":{ "type": "int", "ver": "0", "data": "0x000008D2"},
			"reg_0x0124":{ "type": "int", "ver": "0", "data": "0x0124"},
			"reg_0x0124_val":{ "type": "int", "ver": "0", "data": "0x00000000"},
			"reg_0x0128":{ "type": "int", "ver": "0", "data": "0x0128"},
			"reg_0x0128_val":{ "type": "int", "ver": "0", "data": "0x00000000"},
			"reg_0x0130":{ "type": "int", "ver": "0", "data": "0x0130"},
			"reg_0x0130_val":{ "type": "int", "ver": "0", "data": "0x00000000"},
			"reg_0x0134":{ "type": "int", "ver": "0", "data": "0x0134"},
			"reg_0x0134_val":{ "type": "int", "ver": "0", "data": "0x00000000"},
			"reg_0x0138":{ "type": "int", "ver": "0", "data": "0x0138"},
			"reg_0x0138_val":{ "type": "int", "ver": "0", "data": "0x00000000"},
			"reg_0x013C":{ "type": "int", "ver": "0", "data": "0x013C"},
			"reg_0x013C_val":{ "type": "int", "ver": "0", "data": "0x00000000"},
			"reg_0x0140":{ "type": "int", "ver": "0", "data": "0x0140"},
			"reg_0x0140_val":{ "type": "int", "ver": "0", "data": "0x00000000"},
			"reg_0x0144":{ "type": "int", "ver": "0", "data": "0x0144"},
			"reg_0x0144_val":{ "type": "int", "ver": "0", "data": "0x00000000"},
			"reg_0x0148":{ "type": "int", "ver": "0", "data": "0x0148"},
			"reg_0x0148_val":{ "type": "int", "ver": "0", "data": "0x00000000"},
			"reg_0x014C":{ "type": "int", "ver": "0", "data": "0x014C"},
			"reg_0x014C_val":{ "type": "int", "ver": "0", "data": "0x00000000"},
			"reg_0x0150":{ "type": "int", "ver": "0", "data": "0x0150"},
			"reg_0x0150_val":{ "type": "int", "ver": "0", "data": "0x00000000"},
			"reg_0x0154":{ "type": "int", "ver": "0", "data": "0x0154"},
			"reg_0x0154_val":{ "type": "int", "ver": "0", "data": "0xE0400000"},
			"reg_0x0158":{ "type": "int", "ver": "0", "data": "0x0158"},
			"reg_0x0158_val":{ "type": "int", "ver": "0", "data": "0x00000000"},
			"reg_0x015C":{ "type": "int", "ver": "0", "data": "0x015C"},
			"reg_0x015C_val":{ "type": "int", "ver": "0", "data": "0x000008D2"},
			"reg_0x0160":{ "type": "int", "ver": "0", "data": "0x0160"},
			"reg_0x0160_val":{ "type": "int", "ver": "0", "data": "0x00000000"},
			"reg_0x0164":{ "type": "int", "ver": "0", "data": "0x0164"},
			"reg_0x0164_val":{ "type": "int", "ver": "0", "data": "0x00000000"},
			"reg_0x016C":{ "type": "int", "ver": "0", "data": "0x016C"},
			"reg_0x016C_val":{ "type": "int", "ver": "0", "data": "0x00000000"},
			"reg_0x0170":{ "type": "int", "ver": "0", "data": "0x0170"},
			"reg_0x0170_val":{ "type": "int", "ver": "0", "data": "0x00000000"},
			"reg_0x0174":{ "type": "int", "ver": "0", "data": "0x0174"},
			"reg_0x0174_val":{ "type": "int", "ver": "0", "data": "0x00000000"},
			"reg_0x0178":{ "type": "int", "ver": "0", "data": "0x0178"},
			"reg_0x0178_val":{ "type": "int", "ver": "0", "data": "0x00000000"},
			"reg_0x017C":{ "type": "int", "ver": "0", "data": "0x017C"},
			"reg_0x017C_val":{ "type": "int", "ver": "0", "data": "0x00000000"},
			"reg_0x0180":{ "type": "int", "ver": "0", "data": "0x0180"},
			"reg_0x0180_val":{ "type": "int", "ver": "0", "data": "0x00000000"},
			"reg_0x0184":{ "type": "int", "ver": "0", "data": "0x0184"},
			"reg_0x0184_val":{ "type": "int", "ver": "0", "data": "0x00000000"},
			"reg_0x0188":{ "type": "int", "ver": "0", "data": "0x0188"},
			"reg_0x0188_val":{ "type": "int", "ver": "0", "data": "0x00000000"},
			"reg_0x018C":{ "type": "int", "ver": "0", "data": "0x018C"},
			"reg_0x018C_val":{ "type": "int", "ver": "0", "data": "0x00000000"},
			"reg_0x0190":{ "type": "int", "ver": "0", "data": "0x0190"},
			"reg_0x0190_val":{ "type": "int", "ver": "0", "data": "0xE0400000"},
			"reg_0x0194":{ "type": "int", "ver": "0", "data": "0x0194"},
			"reg_0x0194_val":{ "type": "int", "ver": "0", "data": "0x00000000"},
			"reg_0x0198":{ "type": "int", "ver": "0", "data": "0x0198"},
			"reg_0x0198_val":{ "type": "int", "ver": "0", "data": "0x000008D2"},
			"reg_0x019C":{ "type": "int", "ver": "0", "data": "0x019C"},
			"reg_0x019C_val":{ "type": "int", "ver": "0", "data": "0x00000000"},
			"reg_0x01A0":{ "type": "int", "ver": "0", "data": "0x01A0"},
			"reg_0x01A0_val":{ "type": "int", "ver": "0", "data": "0x00000000"},
			"reg_0x01A8":{ "type": "int", "ver": "0", "data": "0x01A8"},
			"reg_0x01A8_val":{ "type": "int", "ver": "0", "data": "0x00000000"},
			"reg_0x01AC":{ "type": "int", "ver": "0", "data": "0x01AC"},
			"reg_0x01AC_val":{ "type": "int", "ver": "0", "data": "0x00000000"},
			"reg_0x01B0":{ "type": "int", "ver": "0", "data": "0x01B0"},
			"reg_0x01B0_val":{ "type": "int", "ver": "0", "data": "0x00000000"},
			"reg_0x01B4":{ "type": "int", "ver": "0", "data": "0x01B4"},
			"reg_0x01B4_val":{ "type": "int", "ver": "0", "data": "0x00000000"},
			"reg_0x01B8":{ "type": "int", "ver": "0", "data": "0x01B8"},
			"reg_0x01B8_val":{ "type": "int", "ver": "0", "data": "0x00000000"},
			"reg_0x01BC":{ "type": "int", "ver": "0", "data": "0x01BC"},
			"reg_0x01BC_val":{ "type": "int", "ver": "0", "data": "0x00000000"},
			"reg_0x01C0":{ "type": "int", "ver": "0", "data": "0x01C0"},
			"reg_0x01C0_val":{ "type": "int", "ver": "0", "data": "0x00000000"},
			"reg_0x01C4":{ "type": "int", "ver": "0", "data": "0x01C4"},
			"reg_0x01C4_val":{ "type": "int", "ver": "0", "data": "0x00000000"},
			"reg_0x01C8":{ "type": "int", "ver": "0", "data": "0x01C8"},
			"reg_0x01C8_val":{ "type": "int", "ver": "0", "data": "0x00000000"},
			"reg_0x01CC":{ "type": "int", "ver": "0", "data": "0x01CC"},
			"reg_0x01CC_val":{ "type": "int", "ver": "0", "data": "0xE0400000"},
			"reg_0x01D0":{ "type": "int", "ver": "0", "data": "0x01D0"},
			"reg_0x01D0_val":{ "type": "int", "ver": "0", "data": "0x00000000"},
			"reg_0x01D4":{ "type": "int", "ver": "0", "data": "0x01D4"},
			"reg_0x01D4_val":{ "type": "int", "ver": "0", "data": "0x000008D2"},
			"reg_0x01D8":{ "type": "int", "ver": "0", "data": "0x01D8"},
			"reg_0x01D8_val":{ "type": "int", "ver": "0", "data": "0x00000000"},
			"reg_0x01DC":{ "type": "int", "ver": "0", "data": "0x01DC"},
			"reg_0x01DC_val":{ "type": "int", "ver": "0", "data": "0x00000000"},
			"reg_0x01E4":{ "type": "int", "ver": "0", "data": "0x01E4"},
			"reg_0x01E4_val":{ "type": "int", "ver": "0", "data": "0x00000000"},
			"reg_0x01E8":{ "type": "int", "ver": "0", "data": "0x01E8"},
			"reg_0x01E8_val":{ "type": "int", "ver": "0", "data": "0x00000000"},
			"reg_0x01EC":{ "type": "int", "ver": "0", "data": "0x01EC"},
			"reg_0x01EC_val":{ "type": "int", "ver": "0", "data": "0x00000000"},
			"reg_0x01F0":{ "type": "int", "ver": "0", "data": "0x01F0"},
			"reg_0x01F0_val":{ "type": "int", "ver": "0", "data": "0x00000000"},
			"reg_0x01F4":{ "type": "int", "ver": "0", "data": "0x01F4"},
			"reg_0x01F4_val":{ "type": "int", "ver": "0", "data": "0x00000000"},
			"reg_0x01F8":{ "type": "int", "ver": "0", "data": "0x01F8"},
			"reg_0x01F8_val":{ "type": "int", "ver": "0", "data": "0x00000000"},
			"reg_0x01FC":{ "type": "int", "ver": "0", "data": "0x01FC"},
			"reg_0x01FC_val":{ "type": "int", "ver": "0", "data": "0x00000000"},
			"reg_0x0200":{ "type": "int", "ver": "0", "data": "0x0200"},
			"reg_0x0200_val":{ "type": "int", "ver": "0", "data": "0x00000000"},
			"reg_0x0204":{ "type": "int", "ver": "0", "data": "0x0204"},
			"reg_0x0204_val":{ "type": "int", "ver": "0", "data": "0x00000000"},
			"reg_0x0208":{ "type": "int", "ver": "0", "data": "0x0208"},
			"reg_0x0208_val":{ "type": "int", "ver": "0", "data": "0x04000009"},
			"reg_0x020C":{ "type": "int", "ver": "0", "data": "0x020C"},
			"reg_0x020C_val":{ "type": "int", "ver": "0", "data": "0x00000005"}
		}
	}
}