{
	"centerX" : 0.2,
	"centerY" : 0.5,
	"angle" : 0,
	"scale" : 1,
	"width" : 110,
	"height" : 50,
	"contents" : [
        {
			"type" : "image",
			"resource":{
                "type":"dynamic",
                "resKey":"{WEATHER_ICON}",
                "resources":[
                    {
                        "key":"unknown",
                        "path":"res/unknown.png"
                    },
                    {
                        "key":"sunny",
                        "path":"res/sunny.png"
                    },{
                        "key":"loudy",
                        "path":"res/loudy.png"
                    },{
                        "key":"mostcloudy",
                        "path":"res/mostcloudy.png"
                    },{
                        "key":"fog",
                        "path":"res/fog.png"
                    },{
                        "key":"showers",
                        "path":"res/showers.png"
                    },{
                        "key":"thunderstorms",
                        "path":"res/thunderstorms.png"
                    },{
                        "key":"rain",
                        "path":"res/rain.png"
                    },{
                        "key":"snow",
                        "path":"res/snow.png"
                    },{
                        "key":"hot",
                        "path":"res/hot.png"
                    },{
                        "key":"cold",
                        "path":"res/cold.png"
                    },{
                        "key":"wind",
                        "path":"res/wind.png"
                    },{
                        "key":"sand",
                        "path":"res/sand.png"
                    },{
                        "key":"haze",
                        "path":"res/haze.png"
                    }
                ]
            },
			"centerX" : 0.3,
			"centerY" : 0.5,
			"width" : 60,
			"height" : 60,
			"angle" : 0,
			"zorder" : 1
        },
		{
            "type": "text",
            "centerX": 0.7,
            "centerY" : 0.4,
            "width": 25,
            "height": 25,
            "angle": 0,
            "color": "#ffffffff",
            "isVertical": 0,
			"alignment": 0,
            "text": "{TEMPERATURE}",
            "zorder": 2
        },
		{
			"type" : "image",
			"resource":{
                "type":"dynamic",
                "resKey":"{TEMPERATURE_UNIT}",
                "resources":[
                    {
                        "key":"du",
                        "path":"res/du.png"
                    },
                    {
                        "key":"du_en",
                        "path":"res/du_en.png"
                    },{
                        "key":"du_arabic",
                        "path":"res/du_arabic.png"
                    }
                ]
            },
			"centerX" : 0.9,
			"centerY" : 0.42,
			"width" : 20,
			"height" : 20,
            "angle" : 0,
			"zorder" : 1
        },
		{
            "type": "text",
            "centerX": 0.8,
            "centerY": 0.8,
            "width": 40,
            "height": 20,
            "angle": 0,
            "color": "#ffffffff",
            "isVertical": 0,
            "alignment": 0,
            "font":"roboto",
			"text": "{WEATHER}",
            "zorder": 2
		}
	]
}
