﻿{
	"centerX" : 0.5,
	"centerY" : 0.5,
	"angle" : 0,
	"scale" : 1,
	"width" : 164,
	"height" : 46,
	"contents" : [{
			"type" : "image",
			"resource":{
                "type":"dynamic",
                "resKey":"{aa}",
                "resources":[
                    {
                        "key":"凌晨",
                        "path":"res/breakfast.png"
                    },
                    {
                        "key":"傍晚",
                        "path":"res/dinner.png"
					},
					{
                        "key":"晚上",
                        "path":"res/dinner.png"
                    },
                    {
                        "key":"上午",
                        "path":"res/breakfast.png"
                    },{
                        "key":"中午",
                        "path":"res/lunch.png"
                    },
                    {
                        "key":"下午",
                        "path":"res/lunch.png"
                    }
                ]
            },
			"centerX" : 0.5,
			"centerY" : 0.5,
			"width" : 164,
			"height" : 46,
			"angle" : 0,
			"zorder" : 1
		}
	]
}
