{
  "config":{
    "hw_platform": ["IDP"],
    "soc_id": ["518"]
  },
  "tsl2591":{
    "owner": "sns_tsl2591",
    ".als":{
      "owner": "sns_tsl2591",
      ".config":{
        "owner": "sns_tsl2591",
        "is_dri":{ "type": "int", "ver": "0",
          "data": "0"
        },
        "hw_id":{ "type": "int", "ver": "0",
          "data": "0"
        },
        "res_idx":{ "type": "int", "ver": "0",
          "data": "0"
        },
        "sync_stream":{ "type": "int", "ver": "0",
          "data": "0"
        }
      }
    }
  },
  "tsl2591_platform":{
    "owner": "sns_tsl2591",
    ".config":{
      "owner": "sns_tsl2591",
      "bus_type":{ "type": "int", "ver": "0",
        "data": "0"
      },
      "bus_instance":{ "type": "int", "ver": "1",
        "data": "1"
      },
      "slave_config":{ "type": "int", "ver": "1",
        "data": "0x39"
      },
      "min_bus_speed_khz":{ "type": "int", "ver": "0",
        "data": "400"
      },
      "max_bus_speed_khz":{ "type": "int", "ver": "0",
        "data": "400"
      },
      "reg_addr_type":{ "type": "int", "ver": "0",
        "data": "0"
      },
      "dri_irq_num":{ "type": "int", "ver": "0",
        "data": "142"
      },
      "irq_pull_type":{ "type": "int", "ver": "0",
        "data": "3"
      },
      "irq_is_chip_pin":{ "type": "int", "ver": "0",
        "data": "1"
      },
      "irq_drive_strength":{ "type": "int", "ver": "0",
        "data": "0"
      },
      "irq_trigger_type":{ "type": "int", "ver": "0",
        "data": "1"
      },
      "num_rail":{ "type": "int", "ver": "0",
        "data": "2"
      },
      "rail_on_state":{ "type": "int", "ver": "0",
        "data": "2"
      },
      "vdd_rail":{ "type": "str", "ver": "0",
        "data": "/pmic/client/sensor_vdd"
      },
      "vddio_rail":{ "type": "str", "ver": "0",
        "data": "/pmic/client/sensor_vddio"
      },
      "rigid_body_type":{ "type": "int", "ver": "0",
      "data": "0"
      }
    },
    ".als":{
      "owner": "sns_tsl2591",
      ".fac_cal":{
        "owner": "sns_tsl2591",
        "scale":{ "type": "flt", "ver": "0",
          "data": "1.0"
        },
        "bias":{ "type": "flt", "ver": "0",
          "data": "0.0"
        }
      }
    },
    ".coefficient":{
      "owner": "sns_tsl2591",
      "0":{ "type": "flt", "ver": "3",
        "data": "110486.486"
      },
      "1":{ "type": "flt", "ver": "3",
        "data": "1.500"
      },
      "2":{ "type": "flt", "ver": "3",
        "data": "2.925"
      },
      "3":{ "type": "flt", "ver": "3",
        "data": "5.266"
      },
      "4":{ "type": "flt", "ver": "5",
        "data": "2.925"
      },
      "5":{ "type": "flt", "ver": "3",
        "data": "5.266"
      },
      "6":{ "type": "flt", "ver": "2",
        "data": "6.5"
      },
      "7":{ "type": "flt", "ver": "2",
        "data": "0.25"
      },
      "8":{ "type": "flt", "ver": "2",
        "data": "0.4"
      },
      "9":{ "type": "flt", "ver": "1",
        "data": "1.0"
      },
      "10":{ "type": "flt", "ver": "2",
        "data": "1628.5"
      },
      "11":{ "type": "flt", "ver": "2",
        "data": "1.0"
      },
      "12":{ "type": "flt", "ver": "1",
        "data": "6.0"
      },
      "13":{ "type": "flt", "ver": "1",
        "data": "0.5"
      }
    }
  }
}
