#,aft_version,
4,1,8
#,aft_filter_param,
195, 15, 15, 1440, 3120, 34, 16, 43, 50931, 1, 10280, 15480, 0, 772, 879, 1331, 1407, 0, 0, 0, 0, 0, 0, 0, 0, 0, 0, 0, 0, 13332, 33030, 25630, 76, 21576, 0, 0, 17596, 25514,
