{
	"centerX" : 0.5,
	"centerY" : 0.5,
	"angle" : 0,
	"scale" : 1,
	"width" : 200,
	"height" : 74,
	"contents" : [
        {
			"type" : "image",
			"resource" : {
				"type" : "static",
				"path" : "res/altitude_1_ic_height.png"
			},
			"centerX" : 0.154,
			"centerY" : 0.5,
			"width" : 43,
			"height" : 43,
			"zorder" : 1
		},
        {
            "type": "text",
            "centerX": 0.35,
            "centerY": 0.5,
            "width": 35,
            "height": 30,
            "angle": 0,
            "color": "#ffffffff",
            "isVertical": 0,
			"alignment": 2,
			"editable":true,
            "text": "{ALTITUDE}",
            "zorder": 2
        },
        {
            "type": "text",
            "centerX": 0.5,
            "centerY": 0.5,
            "width": 30,
            "height": 30,
            "angle": 0,
            "color": "#ffffffff",
            "isVertical": 0,
			"alignment": 0,
            "text": "M",
            "zorder": 2
        },
        {
			"type" : "image",
			"resource" : {
				"type" : "static",
				"path" : "res/altitude_1_div.png"
			},
			"centerX" : 0.59,
			"centerY" : 0.59,
			"width" : 2,
			"height" : 40,
			"zorder" : 1
        },
        {
            "type": "text",
            "centerX": 0.80,
            "centerY": 0.37,
            "width": 70,
            "height": 20,
            "angle": 0,
            "color": "#ffffffff",
            "isVertical": 0,
			"alignment": 0,
            "text": "{LOCATION}",
            "editable":true,
            "zorder": 2
        },
        {
            "type": "text",
            "centerX": 0.80,
            "centerY": 0.65,
            "width": 70,
            "height": 20,
            "angle": 0,
            "color": "#ffffffff",
            "isVertical": 0,
			"alignment": 0,
            "text": "{yyyy.MM.dd HH:mm}",
            "zorder": 2
        }
	]
}
