{
    "color":[
        {
            "name":"container_background",
            "value":"#202224"
        },
        {
            "name":"car_container_background",
            "value":"#99303030"
        }
    ]
}