耀=yao
老=lao
考=kao
耄=mao
者=zhe
耆=qi
耋=die
而=e,er
耍=shua
耐=nai
耒=lei
耔=zi
耕=geng
耖=chao
耗=hao
耘=yun
耙=ba
耜=si
耠=huo
耢=lao
耥=tang
耦=ou,o
耧=lou
耨=nou
耩=jiang
耪=pang
耱=mo
耳=e,er
耵=ding
耶=ye
耷=da
耸=song
耻=chi
耽=dan
耿=geng
聂=nie
聃=dan
聆=ling
聊=liao
聋=long
职=zhi
聍=ning
聒=guo
联=lian
聘=pin
聚=ju
聩=kui
聪=cong
聱=ao
聿=yu
肃=su
肄=yi
肆=si
肇=zhao
肉=rou
肋=lei,le
肌=ji
肓=huang
肖=xiao
肘=zhou
肚=du
肛=gang
肜=rong
肝=gan
肟=wo
肠=chang
股=gu
肢=zhi
肤=fu
肥=fei
肩=jian
肪=fang
肫=zhun
肭=na
肮=ang
肯=ken
肱=gong
育=yu
肴=yao
肷=qian
肺=fei
肼=jing
肽=tai
肾=shen
肿=zhong
胀=zhang
胁=xie
胂=shen
胃=wei
胄=zhou
胆=dan
背=bei
胍=gua
胎=tai
胖=pan,pang
胗=zhen
胙=zuo
胚=pei
胛=jia
胜=sheng
胝=zhi
胞=bao
胡=hu
胤=yin
胥=xu
胧=long
胨=dong
胩=ka
胪=lu
胫=jing
胬=nu
胭=yan
胯=kua
胰=yi
胱=guang
胲=hai
胳=ge
胴=dong
胶=jiao
胸=xiong
胺=an
胼=pian
能=neng
脂=zhi
脆=cui
脉=mo,mai
脊=ji
脍=kuai
脎=sa
脏=zang
脐=qi
脑=nao
脒=mi
脓=nong
脔=luan
脖=bo
脘=wan
脚=jiao
脞=cuo
脬=pao
脯=fu
脱=tuo
脲=niao
脶=luo
脸=lian
脾=pi
腆=tian
腈=jing
腊=la
腋=ye
腌=a
腐=fu
腑=fu
腓=fei
腔=qiang
腕=wan
腙=zong
腚=ding
腠=cou
腥=xing
腧=shu
腩=nan
腭=e
腮=sai
腰=yao
腱=jian
腴=yu
腹=fu
腺=xian
腻=ni
腼=mian
腽=wa
腾=teng
腿=tui
膀=bang,pang
膂=lu
膈=ge
膊=bo
膏=gao
膑=bin
膘=biao
膛=tang
膜=mo
膝=xi
膣=zhi
膦=lin
膨=peng
膪=chuai
膳=shan
膺=ying
膻=shan
臀=tun
臁=lian
臂=bi
臃=yong
臆=yi
臊=sao
臌=gu
臣=chen
臧=zang
自=zi
臬=nie
臭=chou
臯=gao
至=zhi
致=zhi
臻=zhen
臼=jiu
臾=yu
舀=yao
舁=yu
舂=chong
舄=xi
舅=jiu
舆=yu
舌=she
舍=she
舐=shi
舒=shu
舔=tian
舛=chuan
舜=shun
舞=wu
舟=zhou
舡=chuan
舢=shan
舣=yi
舨=ban
航=hang
舫=fang
般=ban
舭=bi
舯=zhong
舰=jian
舱=cang
舳=zhu
舴=ze
舵=duo
舶=bo
舷=xian
舸=ge
船=chuan
舻=lu
舾=xi
艄=shao
艇=ting
艉=wei
艋=meng
艏=shou
艘=sou
艚=cao
艟=chong
艨=meng
艮=gen
良=liang
艰=jian
色=se
艳=yan
艴=fu
艺=yi
艽=jiao
艾=yi,ai
艿=nai
节=jie
芄=wan
芈=mi
芊=qian
芋=yu
芍=shao
芎=xiong
芏=du
芑=qi
芒=mang
芗=xiang
芘=pi
芙=fu
芜=wu
芝=zhi
芟=shan
芡=qian
芤=kou
芥=jie
芦=lu
芨=ji
芩=qin
芪=qi
芫=yuan
芬=fen
芭=ba
芮=rui
芯=xin
芰=ji
花=hua
芳=fang
芴=wu
芷=zhi
芸=yun
芹=qin
芽=ya
芾=fei
苁=cong
苄=bian
苇=wei
苈=li
苊=e
苋=xian
苌=chang
苍=cang
苎=ning
苏=su
苑=yuan
苒=ran
苓=ling
苔=tai
苕=shao
苗=miao
苘=qing
苛=ke
苜=mu
苞=bao
苟=gou
苠=min
苡=yi
苣=ju
苤=pie
若=ruo
苦=ku
苫=shan
苯=ben
英=ying
苴=ju
苷=gan
苹=pin,ping
苻=fu
茁=zhuo
茂=mao
范=fan
茄=qie
茅=mao
茆=mao
茇=ba
茈=ci
茉=mo
茌=chi
茎=jing
茏=long
茑=niao
茔=ying
茕=qiong
茗=ming
茚=yin
茛=gen
茜=qian
茧=jian
茨=ci
茫=mang
茬=cha
茭=jiao
茯=fu
茱=zhu
茳=jiang
茴=hui
茵=yin
茶=cha
茸=rong
茹=ru
茺=chong
茼=tong
荀=xun
荃=quan
荆=jing
荇=xing
草=cao
荏=ren
荐=jian
荑=yi
荒=huang
荔=li
荚=jia
荛=rao
荜=bi
荞=qiao
荟=hui
荠=ji
荡=dang
荣=rong
荤=hun
荥=xing
荦=luo
荧=ying
荨=qian
荩=jin
荪=sun
荫=yin
荬=mai
荭=hong
荮=zhou
药=yao
荷=he
荸=bi
荻=di
荼=tu
荽=sui
莅=li
莆=pu
莉=li
莎=sha
莒=ju
莓=mei
莘=shen
莛=ting
莜=you
莞=guan
莠=you
莨=lang
莩=fu
莪=e
莫=mo
莰=kan
莱=lai
莲=lian
莳=shi
莴=wo
莶=xian
获=huo
莸=you
莹=ying
莺=ying
莼=chun
莽=mang
菀=wan
菁=jing
菅=jian
菇=gu
菊=ju
菌=jun
菏=he
菔=fu
菖=chang
菘=song
菜=cai
菝=ba
菟=tu
菠=bo
菡=han
菥=xi
菩=pu
菪=dang
菰=gu
菱=ling
菲=fei
菸=yan
菹=zu
菽=shu
萁=qi
萃=cui
萄=tao
萆=bei
萋=qi
萌=meng
萍=ping
萎=wei
萏=dan
萑=huan
萘=nai
萜=tie
萝=luo
萤=ying
营=ying
萦=ying
萧=xiao
萨=sa
萱=xuan
萸=yu
萼=e
落=la,luo,lao
葆=bao
葑=feng
著=zhu
葙=xiang
葚=ren
葛=ge
葜=qia
葡=pu
董=dong
葩=pa
葫=hu
葬=zang
葭=jia
葱=cong
葳=wei
葵=kui
葶=ting
葸=xi
葺=qi
蒂=di
蒇=chan
蒈=kai
蒉=kui
蒋=jiang
蒌=lou
蒎=pai
蒗=lang
蒙=meng
蒜=suan
蒡=bang
蒯=kuai
蒲=pu
蒴=shuo
蒸=zheng
蒹=jian
蒺=ji
蒽=en
蒿=hao
蓁=zhen
蓄=chu,xu
蓉=rong
蓊=weng
蓍=shi
蓐=ru
蓑=suo
蓓=bei
蓖=bi
蓝=la,lan
蓟=ji
蓠=li
蓣=yu
蓥=ying
蓦=mo
蓬=peng
蓰=xi
蓼=liao
蓿=xu
蔌=su
蔑=mie
蔓=wan,man
蔗=zhe
蔚=wei
蔟=cu
蔡=cai
蔫=nian
蔬=shu
蔷=qiang
蔸=dou
蔹=lian
蔺=lin
蔻=kou
蔼=ai
蔽=bi
蕃=fan
蕈=xun
蕉=qiao
蕊=rui
蕖=qu
蕙=hui
蕞=zui
蕤=rui
蕨=jue
蕲=qi
蕴=yun
蕹=weng
蕺=ji
蕻=hong
蕾=lei
薄=bao,bo
薅=hao
薇=wei
薏=yi
薛=xue
薜=bi
薤=xie
薨=hong
薪=xin
薮=sou
薯=shu
薰=xun
薷=ru
薹=tai
藁=gao
藉=jie,ji
藏=zang,cang
藐=miao
藓=xian
藕=ou,o
藜=li
藤=teng
藩=fan
藳=gao
藻=zao
藿=huo
蘅=heng
蘑=mo
蘖=nie
蘧=qu
蘩=fan
蘸=zhan
蘼=mi
虎=hu
虏=lu
虐=nue
虑=lu
虔=qian
虚=xu
虞=yu
虢=guo
虫=chong
虬=qiu
虮=ji
虱=shi
虹=hong
虺=hui
虻=meng
虼=ge
虽=sui
虾=xia
虿=chai
蚀=shi
蚁=yi
蚂=ma
蚊=wen
蚋=rui
蚌=bang
蚍=pi
蚓=yin
蚕=can
蚜=ya
蚝=hao
蚣=gong
蚤=zao
蚧=jie
蚨=fu
蚩=chi
蚪=dou
蚬=xian
蚯=qiu
蚰=you
蚱=zha
蚴=you
蚵=he
蚶=han
蚺=ran
蛀=zhu
蛄=gu
蛆=qu
蛇=she
蛉=ling
蛊=gu
蛋=dan
蛎=li
蛏=cheng
蛐=qu
蛑=mou
蛔=hui
蛘=yang
蛙=wa
蛛=zhu
蛞=kuo
蛟=jiao
蛤=ge
蛩=qiong
蛭=zhi
蛮=man
蛰=zhe
蛱=jia
蛲=nao
蛳=si
蛴=qi
蛸=shao
蛹=yong
蛾=e
蜀=shu
蜂=feng
蜃=shen
蜇=zhe
蜈=wu
蜉=fu
蜊=li
蜍=chu
蜒=yan
蜓=ting
蜕=tui
蜗=wo
蜘=zhi
蜚=fei
蜜=mi
蜞=qi
蜡=la
蜢=meng
蜣=qiang
蜥=xi
蜩=tiao
蜮=yu
蜱=pi
蜴=yi
蜷=quan
蜻=qing
蜾=guo
蜿=wan
蝇=ying
蝈=guo
蝉=chan
蝌=ke
蝎=xie
蝓=yu
蝗=huang
蝙=bian
蝠=fu
蝣=you
蝤=qiu
蝥=mou
蝮=fu
蝰=kui
蝴=hu
蝶=die
蝻=nan
蝼=lou
蝽=chun
蝾=rong
螂=lang
螃=pang
螅=xi
螈=yuan
螋=sou
融=rong
螓=qin
螗=tang
螟=ming
螨=man
螫=shi
螬=cao
螭=chi
螯=ao
螳=tang
螵=piao
螺=luo
螽=zhong
蟀=shuai
蟆=ma
蟊=mao
蟋=xi
蟑=zhang
蟒=mang
蟓=xiang
蟛=peng
蟠=pan
蟥=huang
蟪=hui
蟮=shan
蟹=xie
蟾=chan
蠃=luo
蠊=lian
蠓=meng
蠕=ru
蠖=huo
蠛=mie
蠡=li
蠢=chun
蠲=juan
蠹=du
蠼=qu
血=xie,xue
衄=nv
衅=xin
行=xing
衍=yan
衔=xian
街=jie
衙=ya
衡=heng
衢=qu
衣=yi
补=bu
表=biao
衩=cha
衫=shan
衬=chen
衮=gun
衰=shuai
衲=na
衷=zhong
衽=ren
衾=qin
衿=jin
袁=yuan
袂=mei
袄=ao
袅=niao
袈=jia
袋=dai
袍=pao
袒=tan
袖=xiu
袜=wa
袢=pan
袤=mao
被=bei
袭=xi
袱=fu
袷=jia
袼=ge
裁=cai
裂=lie
装=zhuang
裆=dang
裉=ken
裎=cheng
裒=pou
裔=yi
裕=yu
裘=qiu
裙=qun
裟=sha
裢=lian
裣=lian
裤=ku
裥=jian
裨=bi
裰=duo
裱=biao
裳=shang
裴=pei
裸=luo
裹=guo
裼=ti
裾=ju
褂=gua
褊=bian
褐=he
褒=bao
褓=bao
褙=bei
褚=chu
褛=lu
褡=da
褥=ru
褪=tui
褫=chi
褰=qian
褴=lan
褶=zhe
襁=qiang
襄=xiang
襞=bi
襟=jin
襦=ru
襻=pan
西=xi
要=yao
覃=qin
覆=fu
见=jian
观=guan
规=gui
觅=mi
视=shi
觇=chan
览=lan
觉=jue,jiao
觊=ji
觋=xi
觌=di
觎=yu
觏=gou
觐=jin
觑=qu
角=jue,jiao
觖=jue
觚=gu
觜=zi
觞=shang
解=xie,jie
觥=gong
触=chu
觫=su
觯=zhi
觳=hu
言=yan
訇=hong
訾=zi
詈=li
詹=zhan
誉=yu
誊=teng
誓=shi
謇=jian
謦=qing
警=jing
譬=pi
计=ji
订=ding
讣=fu
认=ren
讥=ji
讦=jie
讧=hong
讨=tao
让=rang
讪=shan
讫=qi
训=xun
议=yi
讯=xun
记=ji
讲=jiang
讳=hui
讴=ou,o
讵=ju
讶=ya
讷=ne
许=xu
讹=e
论=lun
讼=song
讽=feng
设=she
访=fang
诀=jue
证=zheng
诂=gu
诃=he
评=ping
诅=zu
识=shi
诈=zha
诉=su
诊=zhen
诋=di
诌=zhou
词=ci
诎=qu
诏=zhao
译=yi
诒=yi
诓=kuang
诔=lei
试=shi
诖=gua
诗=shi
诘=ji
诙=hui
诚=cheng
诛=zhu
诜=shen
话=hua
诞=dan
诟=gou
诠=quan
诡=gui
询=xun
诣=yi
诤=zheng
该=gai
详=xiang
诧=cha
诨=hun
诩=xu
诫=jie
诬=wu
语=yu
诮=qiao
误=wu
诰=gao
诱=you
诲=hui
诳=kuang
说=shuo
诵=song
诶=ei
请=qing
诸=zhu
诹=zou
诺=nuo
读=du
诼=zhuo
诽=fei
课=ke
诿=wei
谀=yu
谁=shui
谂=shen
调=tiao,diao
谄=chan
谅=liang
谆=zhun
谇=sui
谈=tan
谊=yi
谋=mou
谌=chen
谍=die
谎=huang
谏=jian
谐=xie
谑=xue
谒=ye
谓=wei
谔=e
谕=yu
谖=xuan
谗=chan
谘=zi
谙=an
谚=yan
谛=di
谜=mi
谝=pian
谟=mo
谠=dang
谡=su
谢=xie
谣=yao
谤=bang
谥=shi
谦=qian
谧=mi
谨=jin
谩=man
谪=zhe
谫=jian
谬=miu
谭=tan
谮=zen
谯=qiao
谰=lan
谱=pu
谲=jue
谳=yan
谴=qian
谵=zhan
谶=chen
谷=gu
豁=huo
豆=dou
豇=jiang
豉=chi
豌=wan
豕=shi
豚=tun
象=xiang
豢=huan
豪=hao
豫=yu
豳=bin
豸=zhi
豹=bao
豺=chai
貂=diao
貅=xiu
貉=he
貊=mo
貌=mao
貔=pi
貘=mo
贝=bei
贞=zhen
负=fu
贡=gong
财=cai
责=ze
贤=xian
败=bai
账=zhang
货=huo
质=zhi
贩=fan
贪=tan
贫=pin
贬=bian
购=gou
贮=zhu
贯=guan
贰=er
贱=jian
贲=ben
贳=shi
贴=tie
贵=gui
贶=kuang
贷=dai
贸=mao
费=fei
贺=he
贻=yi
贼=zei
贽=zhi
贾=jia
贿=hui
赀=zi
赁=lin
赂=lu
赃=zang
资=zi
赅=gai
赆=jin
赇=qiu
赈=zhen
赉=lai
赊=she
赋=fu
赌=du
赍=ji
赎=shu
赏=shang
赐=ci
赓=geng
赔=pei
赕=dan
赖=lai
赘=zhui
赙=fu
赚=zhuan
赛=sai
赜=ze
赝=yan
赞=zan
赠=zeng
赡=shan
赢=ying
赣=gan
赤=chi
赦=she
赧=nan
赫=he
赭=zhe
走=zou
赳=jiu
赴=fu
赵=zhao
赶=gan
起=qi
趁=chen
趄=ju
超=chao
越=yue
趋=qu
趑=zi
趔=lie
趟=tang
趣=qu
趱=zan
足=zu
趴=pa
趵=bao
趸=dun
趺=fu
趼=jian
趾=zhi
趿=ta
跃=yue
跄=qiang
跆=tai
跋=ba
跌=die
跎=tuo
跏=jia
跑=pao
跖=zhi
跗=fu
跚=shan
跛=bo
距=ju
跞=li
跟=gen
跣=xian
跤=jiao
跨=kua
跪=gui
跫=qiong
跬=kui
路=lu
跳=tiao
践=jian
跷=qiao
跸=bi
跹=xian
跺=duo
跻=ji
跽=ji
一=yi
丁=ding
七=qi
踅=xue
万=wan
丈=zhang
踉=liang
三=san
上=shang
踊=yong
下=xia
踌=chou
丌=ji
不=bu
与=yu
踏=ta
丐=gai
丑=chou
专=zhuan
踔=chuo
且=qie
丕=pi
世=shi
丘=qiu
丙=bing
业=ye
丛=cong
东=dong
踝=huai
丝=si
丞=cheng
踞=ju
踟=chi
丢=diu
踢=ti
踣=bo
两=liang
严=yan
丧=sang
丨=shu
踩=cai
个=ge
踪=zong
丫=ya
踬=zhi
中=zhong
踮=dian
踯=zhi
丰=feng
踱=duo
串=chuan
临=lin
踵=zhong
丸=wan
踹=chuai
丹=dan
踺=jian
为=wei
主=zhu
踽=ju
丽=li
举=ju
丿=pie
蹀=die
蹁=pian
蹂=rou
乃=nai
蹄=ti
久=jiu
蹇=jian
乇=tuo
蹈=dao
么=me
蹉=cuo
义=yi
蹊=qi
蹋=ta
之=zhi
乌=wu
乍=zha
乎=hu
乏=fa
乐=yue,le
蹑=nie
蹒=pan
乒=ping
乓=pang
乔=qiao
乖=guai
乘=cheng
蹙=cu
乙=yi
乜=nie
九=jiu
乞=qi
也=ye
习=xi
乡=xiang
蹦=beng
书=shu
蹩=bie
乩=ji
蹬=deng
蹭=ceng
蹯=fan
蹰=chu
买=mai
乱=luan
蹲=dun
乳=ru
蹴=cu
蹶=jue
蹼=pu
乾=qian
蹿=cuan
躁=zao
躅=zhu
了=le
躇=chu
予=yu
争=zheng
事=shi
二=e,er
亍=chu
于=yu
亏=kui
躏=lin
躐=lie
云=yun
互=hu
亓=qi
躔=chan
五=wu
井=jing
亘=gen
亚=ya
些=xie
躜=zuan
躞=xie
亟=ji
亡=wang
亢=kang
交=jiao
亥=hai
亦=yi
产=chan
亨=heng
亩=mu
身=shen
享=xiang
躬=gong
京=jing
亭=ting
亮=liang
躯=qu
躲=duo
亲=qing,qin
亳=bo
亵=xie
人=ren
躺=tang
亿=yi
什=shi,shen
仁=ren
仂=le
仃=ding
仄=ze
仅=jin
仆=pu
仇=chou
仉=zhang
今=jin
介=jie
仍=reng
从=cong
軎=wei
仑=lun
仓=cang
仔=zi
仕=shi
他=ta
仗=zhang
付=fu
仙=xian
仝=tong
仞=ren
仟=qian
仡=ge
代=dai
令=ling
以=yi
仨=sa
仪=yi
仫=mu
们=men
仰=yang
仲=zhong
仳=pi
仵=wu
件=jian
价=jia
任=ren
份=fen
仿=fang
企=qi
伉=kang
伊=yi
伍=wu
伎=ji
伏=fu
伐=fa
休=xiu
众=zhong
优=you
伙=huo
会=kuai,hui
伛=yu
伞=san
伟=wei
传=chuan,zhuan
伢=ya
伤=shang
伥=chang
伦=lun
伧=chen
伪=wei
伫=zhu
伯=bo
估=gu
伲=ni
伴=ban
伶=ling
伸=shen
伺=si
似=shi,si
伽=jia
佃=dian
但=dan
位=wei
低=di
住=zhu
佐=zuo
佑=you
体=ti
何=he
佗=tuo
佘=she
余=yu
佚=yi
佛=fo,fu
作=zuo
佝=gou
佞=ning
佟=tong
你=ni
佣=yong
佤=wa
佥=qian
车=che
佧=ka
轧=zha
轨=gui
佩=pei
轩=xuan
轫=ren
佬=lao
转=zhuan
轭=e
轮=lun
软=ruan
佯=yang
佰=bai
轰=hong
轱=gu
轲=ke
佳=jia
轳=lu
佴=er
轴=zhou
轵=zhi
佶=ji
轶=yi
轷=hu
轸=zhen
轹=li
轺=yao
轻=qing
佻=tiao
佼=jiao
轼=shi
载=zai
佾=yi
轾=zhi
轿=jiao
使=shi
辁=quan
辂=lu
较=jiao
侃=kan
辄=zhe
侄=zhi
辅=fu
辆=liang
辇=nian
辈=bei
侈=chi
辉=hui
侉=kua
辊=gun
例=li
辋=wang
辍=chuo
侍=shi
辎=zi
辏=cou
侏=zhu
辐=fu
辑=ji
侑=you
输=shu
侔=mou
辔=pei
辕=yuan
辖=xia
侗=dong
辗=zhan
辘=lu
辙=zhe
辚=lin
供=gong
辛=xin
辜=gu
依=yi
辞=ci
辟=bi
侠=xia
辣=la
侣=lu
侥=jiao
侦=zhen
侧=ce
辨=bian
侨=qiao
辩=bian
侩=kuai
侪=chai
辫=bian
侬=nong
侮=wu
侯=hou
辰=chen
辱=ru
侵=qin
边=bian
辽=liao
达=da
便=pian,bian
迁=qian
迂=yu
促=cu
俄=e
迄=qi
俅=qiu
迅=xun
过=guo
迈=mai
俊=jun
迎=ying
俎=zu
俏=qiao
俐=li
运=yun
近=jin
俑=yong
迓=ya
返=fan
迕=wu
俗=su
俘=fu
还=hai,huan
这=zhe
俚=li
进=jin
俜=ping
远=yuan
保=bao
违=wei
连=lian
俞=yu
迟=chi
俟=qi
信=xin
迢=tiao
俣=yu
迤=yi
迥=jiong
俦=chou
迦=jia
迨=dai
俨=yan
迩=er
俩=lia
迪=di
俪=li
迫=po
迭=die
俭=jian
修=xiu
迮=ze
俯=fu
述=shu
俱=ju
迳=jing
俳=pai
迷=mi
迸=beng
俸=feng
迹=ji
俺=an
追=zhui
俾=bi
退=tui
送=song
适=shi
逃=tao
逄=pang
逅=hou
逆=ni
选=xuan
逊=xun
逋=bu
倌=guan
倍=bei
逍=xiao
倏=shu
透=tou
逐=zhu
逑=qiu
倒=dao
递=di
倔=jue
途=tu
逖=ti
逗=dou
倘=tang
候=hou
通=tong
倚=yi
逛=guang
倜=ti
逝=shi
逞=cheng
借=jie
速=su
造=zao
倡=chang
逡=qun
逢=feng
倥=kong
倦=juan
逦=li
倨=ju
倩=qian
倪=ni
倬=zhuo
逭=huan
倭=wo
逮=dai
倮=luo
逯=lu
逵=kui
逶=wei
逸=yi
债=zhai
逻=luo
逼=bi
值=zhi
倾=qing
逾=yu
遁=dun
遂=sui
偃=yan
遄=chuan
假=jia
遇=yu
偈=ji
偌=ruo
遍=bian
偎=wei
遏=e
偏=pian
遐=xia
遑=huang
遒=qiu
道=dao
偕=xie
遗=yi
遘=gou
做=zuo
遛=liu
停=ting
遢=ta
遣=qian
健=jian
遥=yao
遨=ao
偬=zong
遭=zao
遮=zhe
遴=lin
遵=zun
偶=ou,o
偷=tou
偻=lou
遽=ju
偾=fen
避=bi
偿=chang
傀=kui
邀=yao
邂=xie
邃=sui
傅=fu
傈=li
邈=miao
邋=la
傍=bang
邑=yi
邓=deng
邕=yong
邗=han
邙=mang
邛=qiong
邝=kuang
邡=fang
邢=xing
傣=dai
那=na
傥=tang
邦=bang
傧=bin
储=chu
傩=nuo
邪=xie
催=cui
邬=wu
邮=you
邯=han
邰=tai
邱=qiu
傲=ao
邳=pi
邴=bing
邵=shao
邶=bei
邸=di
邹=zou
傺=chi
邺=ye
邻=lin
傻=sha
邾=zhu
郁=yu
郄=qie
郅=zhi
郇=huan
郊=jiao
郎=lang
郏=jia
像=xiang
郐=kuai
郑=zheng
郓=yun
僖=xi
郗=xi
僚=liao
郛=fu
郜=gao
郝=hao
郡=jun
郢=ying
僦=jiu
郦=li
僧=seng
郧=yun
部=bu
郫=pi
僬=jiao
郭=guo
僭=jian
僮=zhuang
郯=tan
僳=su
郴=chen
僵=jiang
郸=dan
僻=pi
都=du,dou
郾=yan
鄂=e
鄄=juan
儆=jing
儇=xuan
儋=dan
儒=ru
鄙=bi
鄞=yin
儡=lei
鄢=yan
鄣=zhang
鄯=shan
鄱=po
鄹=zou
儿=e,er
兀=wu
允=yun
酃=ling
元=yuan
兄=xiong
充=chong
酆=feng
兆=zhao
先=xian
光=guang
酉=you
酊=ding
克=ke
酋=qiu
酌=zhuo
免=mian
配=pei
酎=zhou
酏=yi
酐=gan
兑=dui
酒=jiu
兔=tu
兕=si
兖=yan
酗=xu
党=dang
酚=fen
兜=dou
酝=yun
酞=tai
酡=tuo
酢=cu
兢=jing
酣=han
酤=gu
入=ru
酥=su
全=quan
酩=ming
酪=lao
八=ba
酬=chou
公=gong
六=liu
酮=tong
兮=xi
酯=zhi
兰=lan
酰=xian
共=gong
酱=jiang
酲=cheng
关=guan
酴=tu
兴=xing
兵=bing
酵=jiao
酶=mei
其=qi
具=ju
酷=ku
典=dian
酸=suan
酹=lei
兹=zi
养=yang
兼=jian
兽=shou
酽=yan
酾=shi
酿=nian
冀=ji
冁=chan
内=nei
醅=pei
醇=chun
冈=gang
冉=ran
醉=zui
醋=cu
册=ce
醌=kun
醍=ti
再=zai
醐=hu
醑=xu
冒=mao
醒=xing
冕=mian
冗=rong
写=xie
醚=mi
军=jun
醛=quan
农=nong
冠=guan
醢=hai
冢=zhong
醣=tang
冤=yuan
冥=ming
醪=lao
冬=dong
醭=bu
醮=jiao
冯=feng
醯=xi
冰=bing
冱=hu
冲=chong
决=jue
醴=li
醵=ju
况=kuang
冶=ye
冷=leng
醺=xun
冻=dong
冼=xian
冽=lie
净=jing
凃=tu
凄=qi
准=zhun
采=cai
凇=song
凉=liang
釉=you
释=shi
凋=diao
里=li
凌=ling
重=zhong,chong
野=ye
减=jian
量=liang
凑=cou
金=jin
凛=lin
釜=fu
凝=ning
几=ji
凡=fan
凤=feng
凫=fu
凭=ping
凯=kai
凰=huang
凳=deng
凶=xiong
凸=tu
凹=ao
出=chu
击=ji
凼=dang
函=han
凿=zuo,zao
刀=dao
刁=diao
刃=ren
分=fen
切=qie
刈=yi
刊=kan
刍=chu
刎=wen
刑=xing
划=hua
刖=yue
列=lie
刘=liu
则=ze
刚=gang
创=chuang
初=chu
删=shan
判=pan
刨=bao,pao
利=li
别=bie
刭=jing
刮=gua
到=dao
刳=ku
制=zhi
刷=shua
券=quan
刹=cha,sha
刺=ci
刻=ke
刽=gui
刿=gui
剀=kai
剁=duo
剂=ji
剃=ti
削=xiao,xue
剌=la
前=qian
剐=gua
剑=jian
剔=ti
剖=pou
剜=wan
剞=ji
剡=shan
剥=bao,bo
剧=ju
剩=sheng
剪=jian
副=fu
割=ge
鉴=jian
剽=piao
剿=jiao
劁=qiao
劂=jue
劈=pi
銎=qiong
劐=huo
劓=yi
力=li
劝=quan
办=ban
功=gong
加=jia
务=wu
劢=mai
劣=lie
动=dong
助=zhu
努=nu
劫=jie
劬=qu
劭=shao
銮=luan
励=li
劲=jing,jin
劳=lao
劵=juan
劾=he
势=shi
勃=bo
勇=yong
鋈=wu
勉=mian
勋=xun
勐=meng
勒=lei,le
勖=xu
勘=kan
募=mu
勤=qin
勰=xie
勺=shao
勾=gou
勿=wu
匀=yun
包=bao
匆=cong
匈=xiong
匍=pu
匏=pao
匐=fu
匕=bi
化=hua
北=bei
匙=chi
匝=za
匠=jiang
匡=kuang
匣=xia
匦=gui
匪=fei
匮=kui
匹=pi
区=qu
医=yi
匾=bian
錾=zan
匿=ni
十=shi
千=qian
卅=sa
升=sheng
午=wu
卉=hui
半=ban
华=hua
鍏=wei
协=xie
卑=bei
卒=zu
卓=zhuo
单=dan,shan,chuan
卖=mai
南=na,nan
博=bo
卜=bu
卞=bian
卟=bu
占=zhan
卡=ka,qia
卢=lu
卣=you
卤=lu
卦=gua
卧=wo
鍪=mou
卫=wei
卮=zhi
卯=mao
印=yin
危=wei
即=ji
却=que
卵=luan
卷=juan
卸=xie
卺=jin
卿=qing
厂=chang
厄=e
厅=ting
历=li
厉=li
压=ya
厌=yan
厍=she
鎏=liu
厕=ce
厘=li
厚=hou
厝=cuo
原=yuan
厢=xiang
厣=yan
厥=jue
厦=xia
厨=chu
厩=jiu
厮=si
厶=si
去=qu
县=xian
叁=san
参=can,shen,cen
又=you
叉=cha
鏊=ao
及=ji
友=you
双=shuang
反=fan
发=fa
叔=shu
鏖=ao
取=qu
受=shou
变=bian
叙=xu
叛=pan
叟=sou
叠=die
口=kou
古=gu
句=ju
另=ling
叨=dao
叩=kou
只=zhi
叫=jiao
召=zhao
叭=ba
叮=ding
可=ke
台=tai
叱=chi
史=shi
右=you
叵=po
叶=ye
号=hao
司=si
叹=tan
叻=le
叼=diao
叽=ji
吁=yu
吃=chi
各=ge
吆=yao
合=he
吉=ji
吊=diao
同=tong
名=ming
后=hou
吏=li
吐=tu
向=xiang
吒=zha
吓=xia,he
吕=lu
吗=ma
君=jun
吝=lin
吞=tun
吟=yin
吠=fei
吡=bi
吣=qin
否=fou
吧=ba
吨=dun
吩=fen
含=han
听=ting
吭=keng
吮=shun
启=qi
吱=zhi
吲=yin
吴=wu
吵=chao
吸=xi
吹=chui
吻=wen
吼=hou
鐾=bei
吾=wu
呀=ya
呃=e
呆=ai,dai
呈=cheng
告=gao
呋=fu
呐=na
呒=m
呓=yi
呔=dai
呕=ou,o
呖=li
呗=bei
员=yuan
呙=guo
呛=qiang
呜=wu
呢=ne
呤=ling
呦=you
周=zhou
鑫=xin
呱=gua
呲=ci
味=wei
呵=he
呶=nao
呷=xia
呸=pei
呻=shen
呼=hu
命=ming
咀=ju
咂=za
咄=duo
钆=ga
咆=pao
钇=yi
针=zhen
钉=ding
钊=zhao
钋=po
咋=za
和=huo,he,hu
钌=liao
钍=tu
咎=jiu
钎=qian
钏=chuan
咏=yong
咐=fu
钐=shan
钒=fan
咒=zhou
钓=diao
咔=ka
钔=men
咕=gu
钕=nv
咖=ka
钗=chai
钙=gai
咙=long
钚=bu
咚=dong
咛=ning
钛=tai
钜=ju
钝=dun
咝=si
钞=chao
钟=zhong
钠=na
钡=bei
钢=gang
钣=ban
咣=guang
钤=qian
咤=zha
钥=yue
钦=qin
咦=yi
钧=jun
咧=lie
钨=wu
咨=zi
钩=gou
咩=mie
钪=kang
咪=mi
钫=fang
咫=zhi
钬=huo
咬=yao
咭=ji
钭=tou
钮=niu
钯=ba
咯=ka
钰=yu
钱=qian
咱=zan,za
钲=zheng
咳=ke
钳=qian
钴=gu
咴=hui
钵=bo
钶=ke
钷=po
钸=bu
咸=xian
钹=bo
钺=yue
咻=xiu
钻=zuan
钼=mu
钽=tan
咽=yan,ye
钾=jia
钿=dian
咿=yi
哀=ai
铀=you
品=pin
铁=tie
铂=bo
哂=shen
铃=ling
哄=hong
铄=shuo
铅=qian
哆=duo
铆=mao
哇=wa
哈=ha
铈=shi
铉=xuan
哉=zai
铊=ta
铋=bi
铌=ni
哌=pai
铍=pi
响=xiang
哎=ai
铎=duo
哏=gen
铐=kao
哐=kuang
铑=lao
哑=ya
哒=da
铒=er
哓=xiao
哔=bi
哕=hui
铕=you
铖=cheng
哗=hua
铗=jia
铘=ye
哙=kuai
铙=nao
哚=duo
铛=cheng
哜=ji
铜=tong
铝=lu
哝=nong
铞=diao
哞=mou
铟=yin
哟=yo
铠=kai
铡=zha
铢=zhu
铣=xi
铤=ting
铥=diu
哥=ge
哦=o
哧=chi
铧=hua
铨=quan
哨=shao
哩=li
铩=sha
铪=ha
哪=na
铫=diao
铬=ge
哭=ku
铭=ming
哮=xiao
铮=zheng
铯=se
铰=jiao
铱=yi
铲=chan
哲=zhe
铳=chong
哳=zha
铴=tang
铵=an
银=yin
铷=ru
铸=zhu
铹=lao
哺=bu
铺=pu
哼=heng
铼=lai
哽=geng
铽=te
链=lian
哿=ge
铿=keng
销=xiao
锁=suo
唁=yan
锂=li
锃=zeng
锄=chu
锅=guo
锆=gao
唆=suo
唇=chun
锇=e
锈=xiu
唉=ai
锉=cuo
锊=lue
锋=feng
锌=xin
锍=liu
锎=kai
锏=jian
唏=xi
锐=rui
唐=tang
锑=ti
唑=zuo
锒=lang
锓=qin
锔=ju
唔=wu
锕=a
锖=qiang
锗=zhe
锘=nuo
错=cuo
锚=mao
锛=ben
唛=ma
锝=de
锞=ke
锟=kun
唠=lao
锡=xi
锢=gu
唢=suo
锣=luo
唣=zao
锤=chui
唤=huan
锥=zhui
锦=jin
唧=ji
锨=xian
锩=juan
唪=feng
锪=huo
锫=pei
唬=hu
锬=tan
锭=ding
键=jian
售=shou
锯=ju
唯=wei
锰=meng
唰=shua
唱=chang
锱=zi
锲=qie
唳=li
锴=kai
锵=qiang
锶=si
锷=e
唷=yo
锸=cha
锹=qiao
锺=zhong
锻=duan
唼=sha
锼=sou
锾=huan
唾=tuo
锿=ai
唿=hu
镀=du
镁=mei
啁=zhou
镂=lou
啃=ken
镄=fei
啄=zhuo
镅=mei
镆=mo
商=shang
镇=zhen
镉=ge
啉=lin
啊=a
镊=nie
镌=juan
镍=nie
镎=na
镏=liu
啐=cui
镐=gao
镑=bang
镒=yi
镓=jia
镔=bin
啕=tao
镖=biao
啖=dan
镗=tang
镘=man
镙=luo
镛=yong
啜=chuai
镜=jing
镝=di
镞=zu
镟=xuan
镡=chan
啡=fei
镢=jue
镣=liao
啤=pi
镤=pu
镥=lu
啥=sha
镦=dun
啦=la
镧=lan
啧=ze
镨=pu
镩=cuan
啪=pa
镪=qiang
镫=deng
镬=huo
啬=se
镭=lei
啭=zhuan
啮=nie
镯=zhuo
镰=lian
啰=luo
镱=yi
镲=cha
镳=biao
啵=bo
啶=ding
镶=xiang
啷=lang
啸=xiao
啻=chi
啼=ti
啾=jiu
长=chang,zhang
喀=ka
喁=yong
喂=wei
喃=nan
善=shan
喇=la
喈=jie
喉=hou
喊=han
喋=die
喏=nuo
喑=yin
喔=wo
喘=chuan
喙=hui
喜=xi
喝=he
喟=kui
喧=xuan
喱=li
喳=zha
喵=miao
喷=pen
喹=kui
喻=yu
喽=lou
喾=ku
嗄=a
嗅=xiu
嗉=su
嗌=ai
嗍=suo
嗑=ke
嗒=da
嗓=sang
嗔=chen
嗖=sou
嗜=shi
嗝=ge
嗟=jie
嗡=weng
嗣=si
嗤=chi
嗥=hao
嗦=suo
嗨=hai
门=men
闩=shuan
嗪=qin
闪=shan
嗫=nie
闫=yan
嗬=he
闭=bi
问=wen
闯=chuang
嗯=n
闰=run
闱=wei
嗲=dia
闲=xian
嗳=ai
闳=hong
间=jian
闵=min
嗵=tong
闶=kang
嗷=ao
闷=men
闸=zha
闹=nao
闺=gui
闻=wen
闼=ta
闽=min
嗽=sou
闾=lu
嗾=sou
嘀=di
阀=fa
阁=ge
嘁=qi
阂=he
阃=kun
阄=jiu
阅=yue
阆=lang
嘈=cao
阈=yu
嘉=jia
阉=yan
阊=chang
阋=xi
嘌=piao
阌=wen
阍=hun
嘎=ga
阎=yan
嘏=gu
阏=yan
阐=chan
阑=lan
阒=qu
阔=kuo
阕=que
阖=he
阗=tian
嘘=xu
阙=que
阚=han
嘛=ma
阜=fu
嘞=lei
嘟=du
队=dui
阡=qian
阢=wu
嘣=beng
嘤=ying
嘧=mi
阪=ban
嘬=zuo
嘭=peng
阮=ruan
阱=jing
嘱=zhu
嘲=chao
防=fang
阳=yang
阴=yin
嘴=zui
阵=zhen
阶=jie
嘶=si
嘹=liao
嘻=xi
阻=zu
阼=zuo
阽=dian
阿=a
嘿=hei
陀=tuo
陂=bei
附=fu
际=ji
陆=lu
陇=long
陈=chen
陉=xing
陋=lou
噌=cheng
陌=mo
降=xiang,jiang
噍=jiao
噎=ye
限=xian
噔=deng
陔=gai
陕=shan
噗=pu
噘=jue
噙=qin
陛=bi
噜=lu
陟=zhi
陡=dou
噢=o
院=yuan
除=chu
噤=jin
陧=nie
器=qi
陨=yun
噩=e
险=xian
陪=pei
噪=zao
噫=yi
噬=shi
陬=zou
噱=jue
陲=chui
陴=pi
陵=ling
噶=ga
陶=tao
陷=xian
噻=sai
噼=pi
嚅=ru
隅=yu
嚆=hao
隆=long
隈=wei
隋=sui
隍=huang
嚎=hao
随=sui
嚏=ti
隐=yin
嚓=ca
隔=ge
隗=kui
隘=ai
隙=xi
障=zhang
嚣=xiao
隧=sui
嚯=huo
隰=xi
隳=hui
隶=li
嚷=rang
隹=cui
嚼=jue,jiao
隼=sun
隽=juan
难=nan
雀=que
雁=yan
雄=xiong
雅=ya
集=ji
雇=gu
雉=zhi
囊=nang
雌=ci
雍=yong
雎=ju
雏=chu
雒=luo
囔=nang
雕=diao
囗=wei
囚=qiu
四=si
囝=nan
回=hui
囟=xin
雠=chou
因=yin
囡=nan
团=tuan
囤=dun
雨=yu
雩=yu
雪=xue
囫=hu
园=yuan
雯=wen
困=kun
囱=cong
雳=li
围=wei
囵=lun
零=ling
雷=lei
雹=bao
囹=ling
固=gu
国=guo
图=tu
雾=wu
囿=you
需=xu
霁=ji
圃=pu
霄=xiao
圄=yu
霆=ting
圆=yuan
震=zhen
霈=pei
圈=quan
霉=mei
圉=yu
圊=qing
霍=huo
霎=sha
霏=fei
霓=ni
霖=lin
圜=huan
霜=shuang
霞=xia
土=tu
圣=sheng
在=zai
圩=xu
圪=ge
霪=yin
圬=wu
霭=ai
圭=gui
圮=pi
圯=yi
地=de,di
霰=xian
露=lou,lu
圳=zhen
霸=ba
圹=kuang
霹=pi
场=chang
圻=qi
圾=ji
霾=mai
址=zhi
坂=ban
均=jun
坊=fang
坌=ben
坍=tan
坎=kan
坏=huai
坐=zuo
坑=keng
青=qing
靓=liang
靖=jing
块=kuai
静=jing
坚=jian
靛=dian
坛=tan
坜=li
坝=ba
非=fei
坞=wu
坟=fen
靠=kao
坠=zhui
靡=mi
坡=po
面=mian
坤=kun
靥=ye
坦=tan
坨=tuo
坩=gan
革=ge
坪=ping
坫=dian
坭=ni
坯=pi
坳=ao
靳=jin
靴=xue
靶=ba
坶=mu
坷=ke
坻=chi
坼=che
靼=da
垂=chui
垃=la
垄=long
垅=long
鞅=yang
垆=lu
鞋=xie
型=xing
垌=dong
鞍=an
鞑=da
垒=lei
鞒=qiao
垓=gai
鞔=man
鞘=qiao
垛=duo
鞠=ju
垠=yin
垡=fa
垢=gou
鞣=rou
垣=yuan
垤=die
垦=ken
垧=shang
垩=e
垫=dian
鞫=ju
鞭=bian
垭=ya
垮=kua
鞯=jian
鞲=gou
垲=kai
鞴=bei
垴=nao
垸=yuan
埂=geng
埃=ai
埇=yong
埋=mai,man
城=cheng
埏=shan
埒=lie
埔=pu
埕=cheng
埗=bu
埘=shi
埙=xun
埚=guo
埝=nian
域=yu
埠=bu
埤=bei
韦=wei
韧=ren
韩=han
韪=wei
韫=yun
韬=tao
埭=dai
韭=jiu
埯=an
音=yin
埴=zhi
韵=yun
韶=shao
埸=yi
培=pei
基=ji
埽=sao
堀=ku
堂=tang
堃=kun
堆=dui
堇=jin
堋=peng
堍=tu
堑=qian
堕=duo
堙=yin
堞=die
堠=hou
堡=bao
堤=di
堪=kan
堰=yan
堵=du
塄=leng
塌=ta
塍=cheng
塑=su
塔=ta
塘=tang
塞=se,sai
塥=ge
填=tian
塬=yuan
页=ye
顶=ding
顷=qing
顸=han
项=xiang
顺=shun
须=xu
顼=xu
顽=wan
顾=gu
塾=shu
顿=du,dun
墀=chi
颀=qi
颁=ban
墁=man
颂=song
颃=hang
境=jing
预=yu
颅=lu
墅=shu
领=ling
颇=po
颈=geng
颉=jie
墉=yong
颊=jia
颌=he
颍=ying
颏=ke
颐=yi
频=pin
墒=shang
墓=mu
颓=tui
颔=han
颖=ying
颗=ke
题=ti
墙=qiang
颚=e
墚=liang
颛=zhuan
颜=yan
额=e
颞=nie
增=zeng
颟=man
墟=xu
颠=dian
颡=sang
颢=hao
颤=shan,chan
颥=ru
颦=pin
颧=quan
墨=mo
墩=dun
墼=ji
壁=bi
壅=yong
风=feng
飑=biao
壑=he
飒=sa
飓=ju
壕=hao
飕=sou
飘=piao
飙=biao
飚=bian
飞=fei
食=shi
壤=rang
飧=sun
飨=xiang
士=shi
壬=ren
壮=zhuang
声=sheng
壳=qiao,ke
壶=hu
壹=yi
处=chu
备=bei
复=fu
餍=yan
夏=xia
餐=can
夔=kui
夕=xi
外=wai
夙=su
多=duo
夜=ye
够=gou
夤=yin
夥=huo
大=da,dai
天=tian
太=tai
夫=fu
夭=yao
餮=tie
央=yang
夯=hang
失=shi
头=tou
夷=yi
夸=kua
夹=jia,ga
夺=duo
夼=kuang
奁=lian
奂=huan
奄=yan
奇=qi,ji
奈=nai
奉=feng
奋=fen
奎=kui
奏=zou
契=qi
奔=ben
饔=yong
饕=tao
奕=yi
奖=jiang
套=tao
奘=zang
奚=xi
奠=dian
奢=she
奥=ao
饥=ji
饧=xing
饨=tun
饩=xi
饪=ren
饫=yu
饬=chi
饭=fan
饮=yin
饯=jian
饰=shi
饱=bao
饲=si
女=nv
奴=nu
饴=yi
饵=e,er
奶=nai
饶=rao
饷=xiang
奸=jian
她=ta
饺=jiao
饼=bing
饽=bo
好=hao
饿=e
馀=yu
馁=nei
妁=shuo
如=ru
妃=fei
馄=hun
妄=wang
馅=xian
馆=guan
妆=zhuang
馇=cha
妇=fu
馈=kui
妈=ma
妊=ren
馊=sou
馋=chan
馍=mo
妍=yan
馏=liu
馐=xiu
馑=jin
妒=du
馒=man
妓=ji
馓=san
馔=zhuan
馕=nang
首=shou
妖=yao
妗=jin
馗=kui
馘=guo
妙=miao
香=xiang
妞=niu
妣=bi
妤=yu
馥=fu
妥=tuo
妨=fang
馨=xin
妩=wu
妪=yu
妫=gui
妮=ni
妯=zhou
妲=da
妹=mei
妻=qi
妾=qie
姆=mu
姊=zi
始=shi
姐=jie
姑=gu
姒=si
姓=xing
委=wei
姗=shan
姘=pin
姚=yao
姜=jiang
姝=shu
姣=jiao
姥=lao
姨=yi
姬=ji
姹=cha
姻=yin
姿=zi
威=wei
娃=wa
娄=lou
娅=ya
娆=rao
娇=jiao
娈=luan
娉=ping
娌=li
娑=suo
娓=wei
娘=niang
娜=na
娟=juan
娠=shen
娣=di
娥=e
娩=mian
娱=yu
娲=wa
娴=xian
娶=qu
娼=chang
婀=e
婆=po
婉=wan
婊=biao
婕=jie
婚=hun
婢=bi
婧=jing
婪=lan
马=ma
驭=yu
驮=tuo
驯=xun
驰=chi
驱=qu
驳=bo
驴=lu
婴=ying
婵=chan
驵=zang
婶=shen
驶=shi
驷=si
婷=ting
驸=fu
驹=ju
婺=wu
驺=zou
驻=zhu
驼=tuo
驽=nu
驾=jia
婿=xu
驿=yi
骀=dai
骁=xiao
骂=ma
骄=jiao
骅=hua
骆=luo
骇=hai
骈=pian
骊=li
骋=cheng
验=yan
骏=jun
骐=qi
骑=qi
骒=ke
媒=mei
骓=zhui
骖=can
骗=pian
骘=zhi
媚=mei
骚=sao
骛=wu
媛=yuan
骜=ao
骝=liu
骞=qian
骟=shan
骠=biao
骡=luo
骢=cong
骣=chan
骤=zhou
骥=ji
骧=xiang
骨=gu
媪=ao
骰=tou
骱=jie
媲=pi
媳=xi
媵=ying
骶=di
骷=ku
媸=chi
骸=hai
骺=hou
骼=ge
媾=gou
髀=bi
嫁=jia
髁=ke
髂=qia
嫂=sao
髅=lou
嫉=ji
髋=kuan
髌=bin
嫌=xian
髑=du
嫒=ai
髓=sui
嫔=pin
嫖=piao
高=gao
嫘=lei
嫜=zhang
髟=biao
嫠=li
嫡=di
髡=kun
嫣=yan
嫦=chang
髦=mao
嫩=nen
嫫=mo
髫=tiao
髭=zi
髯=ran
嫱=qiang
髹=xiu
髻=ji
鬃=zong
鬈=quan
嬉=xi
鬏=jiu
鬓=bin
嬖=bi
嬗=shan
鬟=huan
鬣=lie
鬯=chang
鬲=ge
嬲=niao
嬴=ying
嬷=ma
鬻=yu
鬼=gui
孀=shuang
魁=kui
魂=hun
魃=ba
魄=po
魅=mei
魇=yan
魈=xiao
魉=liang
魍=wang
魏=wei
子=zi
魑=chi
孑=jie
孓=jue
孔=kong
魔=mo
孕=yun
字=zi
存=cun
孙=sun
孚=fu
孛=bei
孜=zi
孝=xiao
孟=meng
孢=bao
季=ji
孤=gu
孥=nu
学=xue
孩=hai
孪=luan
孬=nao
孰=shu
孱=can
孳=zi
孵=fu
孺=ru
孽=nie
宁=ning
它=ta
宄=gui
宅=zhai
宇=yu
守=shou
安=an
宋=song
完=wan
宏=hong
宓=mi
宕=dang
宗=zong
官=guan
宙=zhou
定=ding
宛=wan
宜=yi
宝=bao
实=shi
宠=chong
审=shen
客=ke
宣=xuan
室=shi
宥=you
宦=huan
宪=xian
宫=gong
宰=zai
害=hai
宴=yan
宵=xiao
家=jia
宸=chen
容=rong
宽=kuan
宾=bin
宿=su,xiu
寂=ji
寄=ji
寅=yin
密=mi
寇=kou
富=fu
寐=mei
寒=han
寓=yu
寝=qin
寞=mo
察=cha
寡=gua
寤=wu
寥=liao
寨=zhai
寮=liao
寰=huan
寸=cun
对=dui
寺=si
寻=xun
导=dao
寿=shou
封=feng
射=she
将=jiang
尉=wei
尊=zun
小=xiao
少=shao
尔=e,er
尕=ga
尖=jian
尘=chen
尚=shang
尜=ga
尝=chang
尢=wang
尤=you
尥=liao
尧=yao
尬=ga
就=jiu
尴=gan
尸=shi
尹=yin
尺=chi
尻=kao
尼=ni
尽=jin
尾=wei
尿=niao,ni
局=ju
屁=pi
层=ceng
居=ju
屈=qu
屉=ti
届=jie
屋=wu
屎=shi
屏=ping,bing
屐=ji
屑=xie
展=zhan
屙=e
屛=bing
属=shu
屠=tu
屡=lu
屣=xi
履=lu
屦=ju
屯=tun
山=shan
屹=yi
屺=qi
鱼=yu
鱿=you
屿=yu
鲁=lu
岁=sui
鲂=fang
岂=qi
鲅=ba
鲆=ping
鲇=nian
鲈=lu
岈=ya
鲋=fu
岌=ji
鲍=bao
岍=qian
鲎=hou
岐=qi
鲐=tai
岑=cen
鲑=gui
鲒=jie
岔=cha
鲔=wei
鲕=er
岖=qu
岗=gang
岘=xian
岙=ao
鲚=ji
岚=lan
岛=dao
鲛=jiao
岜=ba
鲜=xian
鲞=xiang
鲟=xun
鲠=geng
鲡=li
岢=ke
鲢=lian
岣=gou
鲣=jian
鲤=li
鲥=shi
鲦=tiao
鲧=gun
鲨=sha
鲩=huan
岩=yan
鲫=ji
岫=xiu
岬=jia
岭=ling
鲭=qing
鲮=ling
鲰=zou
岱=dai
鲱=fei
鲲=kun
鲳=chang
岳=yue
鲴=gu
岵=hu
鲵=ni
鲶=nian
鲷=diao
岷=min
岸=an
鲸=jing
鲺=shi
鲻=zi
鲼=fen
鲽=die
岽=dong
岿=kui
峁=mao
鳃=sai
鳄=e
峄=yi
鳅=qiu
鳆=fu
鳇=huang
鳊=bian
鳋=sao
峋=xun
鳌=ao
鳍=qi
鳎=ta
鳏=guan
鳐=yao
峒=dong
鳓=le
鳔=biao
鳕=xue
鳖=bie
鳗=man
鳘=min
鳙=yong
峙=zhi
鳜=gui
鳝=shan
鳞=lin
鳟=zun
峡=xia
鳢=li
峤=jiao
峥=zheng
峦=luan
峨=e
峪=yu
峭=qiao
峰=feng
峻=jun
崂=lao
崃=lai
崆=kong
崇=chong
崎=qi
崔=cui
崖=ya
崛=jue
崞=guo
崤=xiao
崦=yan
崧=song
崩=beng
崭=zhan
崮=gu
崴=wei
崽=zai
崾=yao
嵇=ji
嵊=sheng
嵋=mei
嵌=qian
嵘=rong
嵛=yu
嵝=lou
嵩=song
嵫=zi
嵬=wei
嵯=cuo
嵴=ji
嶂=zhang
嶙=lin
嶝=deng
嶷=yi
巅=dian
巍=wei
巛=chuan
川=chuan
州=zhou
巡=xun
巢=chao
工=gong
左=zuo
巧=qiao
巨=ju
巩=gong
巫=wu
差=chai,cha
巯=qiu
己=ji
已=yi
巳=si
巴=ba
巷=xiang
巽=xun
巾=jin
币=bi
市=shi
布=bu
帅=shuai
帆=fan
师=shi
希=xi
帏=wei
帐=zhang
帑=tang
帔=pei
帕=pa
帖=tie
帘=lian
帙=zhi
帚=zhou
帛=bo
帜=zhi
帝=di
鸟=niao
鸠=jiu
鸡=ji
鸢=yuan
鸣=ming
鸥=ou,o
带=dai
鸦=ya
帧=zheng
鸨=bao
鸩=zhen
鸪=gu
鸫=dong
鸬=lu
席=xi
鸭=ya
帮=bang
鸯=yang
鸱=chi
帱=chou
鸲=qu
鸳=yuan
鸵=tuo
鸶=si
帷=wei
鸷=zhi
常=chang
鸸=er
鸹=gua
鸺=xiu
帻=ze
帼=guo
鸽=ge
帽=mao
鸾=luan
鸿=hong
鹁=bo
鹂=li
幂=mi
鹃=juan
鹄=hu
幄=wo
鹅=e
幅=fu
鹆=yu
鹇=xian
鹈=ti
鹉=wu
鹊=que
鹋=miao
鹌=an
幌=huang
鹎=bei
鹏=peng
鹑=chun
幔=man
鹕=hu
幕=mu
鹗=e
鹘=gu
鹚=ci
鹛=mei
幛=zhang
鹜=wu
幞=fu
鹞=yao
幡=fan
幢=chuang
鹣=jian
鹤=he
鹦=ying
鹧=zhe
鹨=liu
鹩=liao
鹪=jiao
鹫=jiu
鹬=yu
鹭=lu
鹰=ying
鹱=hu
干=gan
鹳=guan
平=ping
年=nian
并=bing
幸=xing
幺=yao
幻=huan
幼=you
幽=you
鹾=cuo
广=guang
鹿=lu
庀=pi
麂=ji
庄=zhuang
庆=qing
庇=bi
麇=jun
麈=zhu
床=chuang
庋=gui
麋=mi
序=xu
庐=lu
庑=wu
麒=qi
库=ku
麓=lu
应=ying
底=di
庖=pao
店=dian
庙=miao
庚=geng
府=fu
麝=she
庞=pang
废=fei
麟=lin
庠=xiang
庥=xiu
度=du,duo
麦=mai
座=zuo
庭=ting
庳=bi
麴=qu
庵=an
庶=shu
康=kang
麸=fu
庸=yong
庹=tuo
麻=ma
麽=me
麾=hui
庾=yu
黄=huang
黉=hong
廉=lian
廊=lang
黍=shu
黎=li
黏=nian
黑=hei
廑=jin
廒=ao
廓=kuo
黔=qian
廖=liao
默=mo
廛=chan
黛=dai
黜=chu
黝=you
黟=yi
黠=xia
黢=qu
黥=qing
黧=li
廨=xie
黩=du
黪=can
廪=lin
黯=an
延=yan
廷=ting
黹=zhi
建=jian
黻=fu
黼=fu
黾=min
廿=nian
开=kai
弁=bian
异=yi
弃=qi
弄=nong
弈=yi
弊=bi
弋=yi
鼋=yuan
鼍=tuo
鼎=ding
式=shi
鼐=nai
弑=shi
弓=gong
鼓=gu
引=yin
弗=fu
鼗=tao
弘=hong
鼙=pi
弛=chi
弟=di
鼠=shu
张=zhang
鼢=fen
弥=mi
弦=xian
弧=hu
弩=nu
弪=jing
鼬=you
弭=mi
弯=wan
鼯=wu
弱=ruo
鼷=xi
弹=dan,tan
鼹=yan
强=qiang
鼻=bi
弼=bi
鼽=qiu
鼾=han
彀=gou
齄=zha
齐=qi
齑=ji
归=gui
当=dang
录=lu
彖=tuan
彗=hui
彘=zhi
彝=yi
形=xing
彤=tong
彦=yan
彩=cai
彪=biao
彬=bin
彭=peng
彰=zhang
影=ying
彳=chi
彷=pang
役=yi
彻=che
彼=bi
齿=chi
龀=chen
往=wang
征=zheng
徂=cu
龃=ju
径=jing
龄=ling
龅=bao
待=dai
龆=tiao
徇=xun
龇=zi
很=hen
龈=yin
徉=yang
龉=yu
龊=chuo
徊=huai
律=lu
龋=qu
後=hou
龌=wo
徐=xu
徒=tu
徕=lai
得=de
徘=pai
龙=long
徙=xi
龚=gong
龛=kan
徜=chang
龟=gui
龠=yue
御=yu
徨=huang
循=xun
徭=yao
微=wei
徵=zheng
德=de
徼=jiao
徽=hui
心=xin
必=bi
忆=yi
忉=dao
忌=ji
忍=ren
忏=chan
忐=tan
忑=te
忒=te
忖=cun
志=zhi
忘=wang
忙=mang
忝=tian
忠=zhong
忡=chong
忤=wu
忧=you
忪=song
快=kuai
忭=bian
忮=zhi
忱=chen
念=nian
忸=niu
忻=xin
忽=hu
忾=kai
忿=fen
怀=huai
态=tai
怂=song
怃=wu
怄=ou,o
怅=chang
怆=chuang
怊=chao
怍=zuo
怎=zen
怏=yang
怒=nu
怔=zheng
怕=pa
怖=bu
怙=hu
怛=da
怜=lian
思=si
怠=dai
怡=yi
急=ji
怦=peng
性=xing
怨=yuan
怩=ni
怪=guai
怫=fu
怯=qie
怵=chu
总=zong
怼=dui
怿=yi
恁=nen
恂=xun
恃=shi
恋=lian
恍=huang
恐=kong
恒=heng
恕=shu
恙=yang
恚=hui
恝=jia
恢=hui
恣=zi
恤=xu
恧=nv
恨=hen
恩=e,en
恪=ke
恫=dong
恬=tian
恭=gong
息=xi
恰=qia
恳=ken
恶=e,wu
恸=tong
恹=yan
恺=kai
恻=ce
恼=nao
恽=yun
恿=yong
悃=kun
悄=qiao
悉=xi
悌=ti
悍=han
悒=yi
悔=hui
悖=bei
悚=song
悛=quan
悝=kui
悟=wu
悠=you
患=huan
悦=yue
您=nin
悫=que
悬=xuan
悭=qian
悯=min
悱=fei
悲=bei
悴=cui
悸=ji
悻=xing
悼=dao
情=qing
惆=chou
惊=jing
惋=wan
惑=huo
惕=ti
惘=wang
惚=hu
惜=xi
惝=chang
惟=wei
惠=hui
惦=dian
惧=ju
惨=can
惩=cheng
惫=bei
惬=qie
惭=can
惮=dan
惯=guan
惰=duo
想=xiang
惴=zhui
惶=huang
惹=re
惺=xing
愀=qiao
愁=chou
愆=qian
愈=yu
愉=yu
愍=min
愎=bi
意=yi
愕=e
愚=yu
感=gan
愠=yun
愣=leng
愤=fen
愦=kui
愧=kui
愫=su
愿=yuan
慈=ci
慊=qian
慌=huang
慎=shen
慑=she
慕=mu
慝=ni
慢=man
慧=hui
慨=kai
慰=wei
慵=yong
慷=kang
憋=bie
憎=zeng
憔=qiao
憝=dui
憧=chong
憨=han
憩=qi
憬=jing
憷=chu
憾=han
懂=dong
懈=xie
懊=ao
懋=mao
懑=men
懒=lan
懔=lin
懦=nuo
懵=meng
懿=yi
戆=gang
戈=ge
戊=wu
戋=jian
戌=xu
戍=shu
戎=rong
戏=xi
成=cheng
我=wo
戒=jie
戕=qiang
或=huo
戗=qiang
战=zhan
戚=qi
戛=jia
戟=ji
戡=kan
戢=ji
戤=gai
戥=deng
截=jie
戬=jian
戮=lu
戳=chuo
戴=dai
户=hu
戽=hu
戾=li
房=fang
所=suo
扁=bian
扃=jiong
扇=shan
扈=hu
扉=fei
手=shou
才=cai
扎=zha,za
扑=pu
扒=pa,ba
打=da
扔=reng
托=tuo
扛=kang
扣=kou
扦=qian
执=zhi
扩=kuo
扪=men
扫=sao
扬=yang
扭=niu
扮=ban
扯=che
扰=rao
扳=ban
扶=fu
批=pi
扼=e
找=zhao
承=cheng
技=ji
抄=chao
抉=jue
把=ba
抑=yi
抒=shu
抓=zhua
投=tou
抖=dou
抗=kang
折=she,zhe
抚=fu
抛=pao
抟=tuan
抠=kou
抡=lun
抢=qiang
护=hu
报=bao
抨=peng
披=pi
抬=tai
抱=bao
抵=di
抹=mo,ma
抻=chen
押=ya
抽=chou
抿=min
拂=fu
拄=zhu
担=dan
拆=chai
拇=mu
拈=nian
拉=la
拊=fu
拌=ban
拍=pai
拎=ling
拐=guai
拒=ju
拓=tuo
拔=ba
拖=tuo
拗=ao
拘=ju
拙=zhuo
拚=pin
招=zhao
拜=bai
拟=ni
拢=long
拣=jian
拥=yong
拦=lan
拧=ning
拨=bo
择=zhe,ze,zhai
括=kuo
拭=shi
拮=jie
拯=zheng
拱=gong
拳=quan
拴=shuan
拶=zan
拷=kao
拼=pin
拽=zhuai
拾=shi
拿=na
持=chi
挂=gua
指=zhi
挈=qie
按=an
挎=kua
挑=tiao
挖=wa
挚=zhi
挛=luan
挝=wo
挞=ta
挟=xie
挠=nao
挡=dang
挢=jiao
挣=zheng
挤=ji
挥=hui
挨=ai
挪=nuo
挫=cuo
振=zhen
挲=sa
挹=yi
挺=ting
挽=wan
捂=wu
捃=jun
捅=tong
捆=kun
捉=zhuo
捋=luo
捌=ba
捍=han
捎=shao
捏=nie
捐=juan
捕=bu
捞=lao
损=sun
捡=jian
换=huan
捣=dao
捧=peng
捩=lie
捭=bai
据=ju
捱=ai
捶=chui
捷=jie
捺=na
捻=nian
掀=xian
掂=dian
掇=duo
授=shou
掉=diao
掊=pou
掌=zhang
掎=ji
掏=tao
掐=qia
排=pai
掖=ye
掘=jue
掠=lue
探=tan
掣=che
接=jie
控=kong
推=tui
掩=yan
措=cuo
掬=ju
掭=tian
掮=qian
掰=bai
掳=lu
掴=guo
掷=zhi
掸=dan
掺=chan
掼=guan
掾=yuan
揄=yu
揆=kui
揉=rou
揍=zou
揎=xuan
描=miao
提=di,ti
插=cha
揖=yi
揞=an
揠=ya
握=wo
揣=chuai
揩=kai
揪=jiu
揭=jie
揲=die
援=yuan
揶=ye
揸=zha
揽=lan
揿=qin
搀=chan
搁=ge
搂=lou
搅=jiao
搋=chuai
搌=zhan
搏=bo
搐=chu
搓=cuo
搔=sao
搛=jian
搜=sou
搞=gao
搠=shuo
搡=sang
搦=nuo
搪=tang
搬=ban
搭=da
搴=qian
携=xie
搽=cha
搿=ge
摁=en
摄=she
摅=shu
摆=bai
摇=yao
摈=bin
摊=tan
摒=bing
摔=shuai
摘=zhai
摞=luo
摧=cui
摩=mo,ma
摭=zhi
摸=mo
摹=mo
摺=zhe
撂=liao
撄=ying
撅=jue
撇=pie
撑=cheng
撒=sa
撕=si
撖=han
撙=zun
撞=zhuang
撤=che
撩=liao
撬=qiao
播=bo
撮=cuo
撰=zhuan
撵=nian
撷=xie
撸=lu
撺=cuan
撼=han
擀=gan
擂=lei
擅=shan
操=cao
擎=qing
擐=huan
擒=qin
擗=pi
擘=bo
擞=sou
擢=zhuo
擤=xing
擦=ca
攀=pan
攉=huo
攒=zan
攘=rang
攥=zuan
攫=jue
攮=nang
支=zhi
攴=po
收=shou
攸=you
改=gai
攻=gong
放=fang
政=zheng
故=gu
效=xiao
敉=mi
敌=di
敏=min
救=jiu
敕=chi
敖=ao
教=jiao
敛=lian
敝=bi
敞=chang
敢=gan
散=san
敦=dun
敫=jiao
敬=jing
敭=yang
数=shu
敲=qiao
整=zheng
敷=fu
文=wen
斋=zhai
斌=bin
斐=fei
斑=ban
斓=lan
斗=dou
料=liao
斛=hu
斜=xie
斟=zhen
斡=wo
斤=jin
斥=chi
斧=fu
斩=zhan
斫=zhuo
断=duan
斯=si
新=xin
方=fang
於=yu
施=shi
旁=pang
旃=zhan
旄=mao
旅=lu
旆=pei
旋=xuan
旌=jing
旎=ni
族=zu
旒=liu
旖=yi
旗=qi
无=wu
既=ji
日=ri
旦=dan
旧=jiu
旨=zhi
早=zao
旬=xun
旭=xu
旮=ga
旯=la
旰=gan
旱=han
时=shi
旷=kuang
旺=wang
昀=yun
昂=ang
昃=ze
昆=kun
昊=hao
昌=chang
明=ming
昏=hun
易=yi
昔=xi
昕=xin
昙=tan
昝=zan
星=xing
映=ying
春=chun
昧=mei
昨=zuo
昭=zhao
是=shi
昱=yu
昴=mao
昵=ni
昶=chang
昼=zhou
显=xian
晁=chao
晃=huang
晋=jin
晌=shang
晏=yan
晒=shai
晓=xiao
晔=ye
晕=yun
晖=hui
晗=han
晚=wan
晛=xian
晟=sheng
晡=bu
晤=wu
晦=hui
晨=chen
普=pu
景=jing
晰=xi
晴=qing
晶=jing
晷=gui
智=zhi
晾=liang
暂=zan
暄=xuan
暇=xia
暌=kui
暑=shu
暖=nuan
暗=an
暝=ming
暧=ai
暨=ji
暮=mu
暴=bao,pu
暹=xian
暾=tun
曙=shu
曛=xun
曜=yao
曝=bao,pu
曦=xi
曩=nang
曰=yue
曲=qu
曳=ye
更=geng
曷=he
曹=cao
曼=man
曾=ceng,zeng
替=ti
最=zui
月=yue
有=you
朊=ruan
朋=peng
服=fu
朐=qu
朔=shuo
朕=zhen
朗=lang
望=wang
朝=zhao,chao
期=qi
朦=meng
木=mu
未=wei
末=mo
本=ben
札=zha
术=shu
朱=zhu
朴=piao,pu,po
朵=duo
机=ji
朽=xiu
杀=sha
杂=za
权=quan
杆=gan
杈=cha
杉=shan,sha
杌=wu
李=li
杏=xing
材=cai
村=cun
杓=biao
杖=zhang
杜=du
杞=qi
束=shu
杠=gang
条=tiao
来=lai
杨=yang
杩=ma
杪=miao
杭=hang
杯=bei
杰=jie
杲=gao
杳=yao
杵=chu
杷=pa
杼=zhu
松=song
板=ban
极=ji
构=gou
枇=pi
枉=wang
枋=fang
析=xi
枕=zhen
林=lin
枘=rui
枚=mei
果=guo
枝=zhi
枞=zong
枢=shu
枣=zao
枥=li
枧=jian
枨=cheng
枪=qiang
枫=feng
枭=xiao
枯=ku
枰=ping
枳=zhi
枵=xiao
架=jia
枷=jia
枸=gou
柁=duo
柃=ling
柄=bing
柏=bai
某=mou
柑=gan
柒=qi
染=ran
柔=rou
柘=zhe
柙=xia
柚=you
柜=gui
柝=tuo
柞=zuo
柠=ning
柢=di
查=cha
柩=jiu
柬=jian
柯=ke
柰=nai
柱=zhu
柳=liu
柴=chai
柽=cheng
柿=shi
栀=zhi
栅=zha
标=biao
栈=zhan
栉=zhi
栊=long
栋=dong
栌=lu
栎=li
栏=lan
树=shu
栓=shuan
栖=qi
栗=li
栝=gua
校=xiao
栩=xu
株=zhu
栲=kao
栳=lao
样=yang
核=he
根=gen
格=ge
栽=zai
栾=luan
桀=jie
桁=heng
桂=gui
桃=tao
桄=guang
桅=wei
框=kuang
案=an
桉=an
桊=juan
桌=zhuo
桎=zhi
桐=tong
桑=sang
桓=huan
桔=jie
桕=jiu
桠=ya
桡=rao
桢=zhen
档=dang
桤=qi
桥=qiao
桦=hua
桧=gui
桨=jiang
桩=zhuang
桫=suo
桴=fu
桶=tong
桷=jue
梁=liang
梃=ting
梅=mei
梆=bang
梏=gu
梓=zi
梗=geng
梢=shao
梦=meng
梧=wu
梨=li
梭=suo
梯=ti
械=xie
梳=shu
梵=fan
检=jian
棂=ling
棉=mian
棋=qi
棍=gun
棒=bang
棕=zong
棘=ji
棚=peng
棠=tang
棣=di
森=sen
棰=chui
棱=leng
棵=ke
棹=zhao
棺=guan
棼=fen
椁=guo
椅=yi
椋=liang
植=zhi
椎=zhui
椐=ju
椒=jiao
椟=du
椠=qian
椤=luo
椭=tuo
椰=ye
椴=duan
椹=shen
椽=chuan
椿=chun
楂=cha
楔=xie
楗=jian
楚=chu
楝=lian
楞=leng
楠=nan
楣=mei
楦=xuan
楫=ji
楮=chu
楱=cou
楷=kai
楸=qiu
楹=ying
楼=lou
榀=pin
概=gai
榄=lan
榆=yu
榇=chen
榈=lu
榉=ju
榍=xie
榔=lang
榕=rong
榘=ju
榛=zhen
榜=bang
榧=fei
榨=zha
榫=sun
榭=xie
榱=cui
榴=liu
榷=que
榻=ta
槁=gao
槊=shuo
槌=chui
槎=cha
槐=huai
槔=gao
槛=jian
槟=bin
槠=zhu
槭=qi
槲=hu
槽=cao
槿=jin
樊=fan
樗=chu
樘=tang
樟=zhang
模=mo,mu
樨=xi
横=heng
樯=qiang
樱=ying
樵=qiao
樽=zun
樾=yue
橄=gan
橇=qiao
橐=tuo
橘=ju
橙=cheng
橛=jue
橡=xiang
橥=zhu
橱=chu
橹=lu
橼=yuan
檀=tan
檄=xi
檎=qin
檐=yan
檑=lei
檗=bo
檠=qing
檩=lin
檫=cha
檬=meng
欠=qian
次=ci
欢=huan
欣=xin
欤=yu
欧=ou,o
欲=yu
欷=xi
欹=qi
欺=qi
款=kuan
歃=sha
歆=xin
歇=xie
歉=qian
歌=ge
歙=she
止=zhi
正=zheng
此=ci
步=bu
武=wu
歧=qi
歪=wai
歹=dai
死=si
歼=jian
殁=mo
殂=cu
殃=yang
殄=tian
殆=dai
殇=shang
殉=xun
殊=shu
残=can
殍=piao
殒=yun
殓=lian
殖=zhi
殚=dan
殛=ji
殡=bin
殪=yi
殳=shu
殴=ou,o
段=duan
殷=yin
殿=dian
毁=hui
毂=gu
毅=yi
毋=wu
母=mu
每=mei
毒=du
毓=yu
比=bi
毕=bi
毖=bi
毗=pi
毙=bi
毛=mao
毡=zhan
毪=mu
毫=hao
毯=tan
毳=cui
毵=san
毹=shu
毽=jian
氅=chang
氆=pu
氇=lu
氍=qu
氏=shi
氐=di
民=min
氓=mang
气=qi
氕=pie
氖=nai
氘=dao
氙=xian
氚=chuan
氛=fen
氟=fu
氡=dong
氢=qing
氤=yin
氦=hai
氧=yang
氨=an
氩=ya
氪=ke
氮=dan
氯=lu
氰=qing
氲=yun
水=shui
永=yong
氽=tun
汀=ting
汁=zhi
求=qiu
汆=cuan
汇=hui
汉=han
汊=cha
汐=xi
汔=qi
汕=shan
汗=han
汛=xun
汜=si
汝=ru
汞=gong
江=jiang
池=chi
污=wu
汤=tang
汨=mi
汩=gu
汪=wang
汰=tai
汲=ji
汴=bian
汶=wen
汹=xiong
汽=qi
汾=fen
沁=qin
沂=yi
沃=wo
沅=yuan
沆=hang
沈=shen
沉=chen
沌=dun
沏=qi
沐=mu
沓=ta
沔=mian
沙=sha
沛=pei
沟=gou
没=mei
沣=feng
沤=ou,o
沥=li
沦=lun
沧=cang
沩=wei
沪=hu
沫=mo
沭=shu
沮=ju
沱=tuo
沲=duo
河=he
沸=fei
油=you
治=zhi
沼=zhao
沽=gu
沾=zhan
沿=yan
泄=xie
泅=qiu
泉=quan
泊=bo,po
泌=mi
泐=le
泓=hong
泔=gan
法=fa
泖=mao
泗=si
泛=fan
泞=ning
泠=ling
泡=pao
波=bo
泣=qi
泥=ni
注=zhu
泪=lei
泫=xuan
泮=pan
泯=min
泰=tai
泱=yang
泳=yong
泵=beng
泶=xue
泷=long
泸=lu
泺=luo
泻=xie
泼=po
泽=ze
泾=jing
洁=jie
洄=hui
洇=yin
洋=yang
洌=lie
洎=ji
洒=sa
洗=xi
洙=zhu
洚=jiang
洛=luo
洞=dong
津=jin
洧=wei
洪=hong
洫=xu
洮=tao
洱=er
洲=zhou
洳=ru
洵=xun
洸=guang
洹=huan
活=huo
洼=wa
洽=qia
派=pa,pai
流=liu
浃=jia
浅=qian
浆=jiang
浇=jiao
浈=zhen
浉=shi
浊=zhuo
测=ce
浍=hui
济=ji
浏=liu
浑=hun
浒=hu
浓=nong
浔=xun
浙=zhe
浚=jun
浜=bang
浞=zhuo
浠=xi
浣=huan
浦=pu
浩=hao
浪=lang
浮=fu
浯=wu
浴=yu
海=hai
浸=jin
浼=mei
涂=tu
涅=nie
消=xiao
涉=she
涌=yong
涎=xian
涑=su
涓=juan
涔=cen
涕=ti
涛=tao
涝=lao
涞=lai
涟=lian
涠=wei
涡=wo
涣=huan
涤=di
润=run
涧=jian
涨=zhang
涩=se
涪=fu
涫=guan
涮=shuan
涯=ya
液=ye
涵=han
涸=he
涿=zhuo
淀=dian
淄=zi
淅=xi
淆=xiao
淇=qi
淋=lin
淌=tang
淑=shu
淖=nao
淘=tao
淙=cong
淝=fei
淞=song
淠=pi
淡=dan
淤=yu
淦=gan
淫=yin
淬=cui
淮=huai
深=shen
淳=chun
混=hun
淹=yan
添=tian
淼=miao
清=qing
渊=yuan
渌=lu
渍=zi
渎=du
渐=jian
渑=mian
渔=yu
渖=shen
渗=shen
渚=zhu
渝=yu
渠=qu
渡=du
渣=zha
渤=bo
渥=wo
温=wen
渫=xie
渭=wei
港=gang
渲=xuan
渴=ke
游=you
渺=miao
湃=pai
湄=mei
湍=tuan
湎=mian
湓=pen
湔=jian
湖=hu
湘=xiang
湛=zhan
湟=huang
湫=qiu
湮=yan
湾=wan
湿=shi
溃=kui
溅=jian
溆=xu
溉=gai
溏=tang
源=yuan
溘=ke
溜=liu
溟=ming
溢=yi
溥=pu
溧=li
溪=xi
溯=su
溱=qin
溲=sou
溴=xiu
溶=rong
溷=hun
溺=ni
溻=ta
溽=ru
滁=chu
滂=pang
滇=dian
滋=zi
滏=fu
滑=hua
滓=zi
滔=tao
滕=teng
滗=bi
滚=gun
滞=zhi
滟=yan
滠=she
满=man
滢=ying
滤=lu
滥=lan
滦=luan
滨=bin
滩=tan
滴=di
滹=hu
漂=piao
漆=qi
漉=lu
漏=lou
漓=li
演=yan
漕=cao
漠=mo
漤=lan
漩=xuan
漪=yi
漫=man
漭=mang
漯=luo
漱=shu
漳=zhang
漶=huan
漾=yang
潆=ying
潇=xiao
潋=lian
潍=wei
潘=pan
潜=qian
潞=lu
潢=huang
潦=liao
潭=tan
潮=chao
潲=shao
潴=zhu
潸=shan
潺=chan
潼=tong
澄=cheng
澈=che
澉=gan
澌=si
澍=shu
澎=peng
澜=lan
澡=zao
澧=li
澳=ao
澶=chan
澹=tan
激=ji
濂=lian
濉=sui
濑=lai
濒=bin
濞=bi
濠=hao
濡=ru
濮=pu
濯=zhuo
瀑=pu
瀚=han
瀛=ying
瀣=xie
瀵=fen
瀹=yue
灌=guan
灏=hao
灞=ba
火=huo
灭=mie
灯=deng
灰=hui
灵=ling
灶=zao
灸=jiu
灼=zhuo
灾=zai
灿=can
炀=yang
炅=gui
炉=lu
炊=chui
炎=yan
炒=chao
炔=que
炕=kang
炖=dun
炙=zhi
炜=wei
炝=qiang
炫=xuan
炬=ju
炭=tan
炮=pao
炯=jiong
炱=tai
炳=bing
炷=zhu
炸=zha
点=dian
炻=shi
炼=lian
炽=chi
烀=hu
烁=shuo
烂=lan
烃=ting
烈=lie
烊=yang
烘=hong
烙=lao
烛=zhu
烟=yan
烤=kao
烦=fan
烧=shao
烨=ye
烩=hui
烫=tang
烬=jin
热=re
烯=xi
烷=wan
烸=hai
烹=peng
烽=feng
焉=yan
焊=han
焐=wu
焓=han
焕=huan
焖=men
焘=tao
焙=bei
焚=fen
焦=jiao
焯=zhuo
焰=yan
焱=yan
然=ran
煅=duan
煊=xuan
煌=huang
煎=jian
煜=yu
煞=sha
煤=mei
煦=xu
照=zhao
煨=wei
煮=zhu
煲=bao
煳=hu
煸=bian
煺=tui
煽=shan
熄=xi
熊=xiong
熏=xun
熔=rong
熘=liu
熙=xi
熟=shu
熠=yi
熨=yun,yu
熬=ao
熳=man
熵=shang
熹=xi
燃=ran
燎=liao
燔=fan
燕=yan
燠=yu
燥=zao
燧=sui
燮=xie
燹=xian
爆=bao
爝=jue
爨=cuan
爪=zhua,zhao
爬=pa
爰=yuan
爱=ai
爵=jue
父=fu
爷=ye
爸=ba
爹=die
爻=yao
爽=shuang
爿=pan
片=pian
版=ban
牌=pai
牍=du
牒=die
牖=you
牙=ya
牛=niu
牝=pin
牟=mou
牡=mu
牢=lao
牦=mao
牧=mu
物=wu
牮=jian
牯=gu
牲=sheng
牵=qian
特=te
牺=xi
牾=wu
牿=gu
犀=xi
犁=li
犄=ji
犇=ben
犊=du
犋=ju
犍=jian
犏=pian
犒=kao
犟=jiang
犬=quan
犯=fan
犰=qiu
犴=an
状=zhuang
犷=guang
犸=ma
犹=you
狁=yun
狂=kuang
狃=niu
狄=di
狈=bei
狍=pao
狎=xia
狐=hu
狒=fei
狗=gou
狙=ju
狞=ning
狠=hen
狡=jiao
狨=rong
狩=shou
独=du
狭=xia
狮=shi
狯=kuai
狰=zheng
狱=yu
狲=sun
狳=yu
狴=bi
狷=juan
狸=li
狺=yin
狻=suan
狼=lang
猁=li
猃=xian
猊=ni
猎=lie
猓=guo
猕=mi
猖=chang
猗=yi
猛=meng
猜=cai
猝=cu
猞=she
猡=luo
猢=hu
猥=wei
猩=xing
猪=zhu
猫=mao
猬=wei
献=xian
猱=nao
猴=hou
猷=you
猸=mei
猹=cha
猾=hua
猿=yuan
獍=jing
獐=zhang
獒=ao
獗=jue
獠=liao
獬=xie
獭=ta
獯=xun
獾=huan
玄=xuan
率=lu,lv,shuai
玉=yu
王=wang
玎=ding
玑=ji
玖=jiu
玛=ma
玟=min
玢=bin
玩=wan
玫=mei
玮=wei
环=huan
现=xian
玲=ling
玳=dai
玷=dian
玺=xi
玻=bo
珀=po
珂=ke
珈=jia
珉=min
珊=shan
珍=zhen
珏=jue
珐=fa
珑=long
珙=gong
珞=luo
珠=zhu
珥=er
珧=yao
珩=hang
班=ban
珲=hui
珺=jun
球=qiu
琅=lang
理=li
琉=liu
琊=ya
琏=lian
琐=suo
琚=ju
琛=chen
琢=zhuo
琥=hu
琦=qi
琨=kun
琪=qi
琬=wan
琮=cong
琰=yan
琳=lin
琴=qin
琵=pi
琶=pa
琼=qiong
瑁=mao
瑕=xia
瑗=yuan
瑙=nao
瑚=hu
瑛=ying
瑜=yu
瑞=rui
瑟=se
瑭=tang
瑰=gui
瑶=yao
瑷=ai
瑾=jin
璀=cui
璁=cong
璃=li
璇=xuan
璋=zhang
璎=ying
璐=lu
璜=huang
璞=pu
璟=jing
璧=bi
璨=can
璩=qu
璺=wen
瓒=zan
瓜=gua
瓞=die
瓠=hu
瓢=piao
瓣=ban
瓤=rang
瓦=wa
﻿吖=a
瓮=weng
瓯=ou,o
瓴=ling
瓶=ping
瓷=ci
瓿=bu
甄=zhen
甍=meng
甏=beng
甑=zeng
甓=pi
甘=gan
甙=dai
甚=shen
甜=tian
生=sheng
甥=sheng
用=yong
甩=shuai
甫=fu
甬=yong
甭=beng
甯=ning
田=tian
由=you
甲=jia
申=shen
电=dian
男=nan
甸=dian
町=ding
画=hua
甾=zai
畀=bi
畅=chang
畈=fan
畋=tian
界=jie
畎=quan
畏=wei
畔=pan
留=liu
畚=ben
畛=zhen
畜=xu
略=lue
畦=qi
番=fan
畲=she
畴=chou
畸=ji
畹=wan
畿=ji
疃=tuan
疆=jiang
疋=pi
疏=shu
疑=yi
疔=ding
疖=jie
疗=liao
疙=ge
疚=jiu
疝=shan
疟=yao
疠=li
疡=yang
疣=you
疤=ba
疥=jie
疫=yi
疬=li
疮=chuang
疯=feng
疰=zhu
疱=pao
疲=pi
疳=gan
疴=ke
疵=ci
疸=dan,da
疹=zhen
疼=teng
疽=ju
疾=ji
痂=jia
痃=xuan
痄=zha
病=bing
症=zheng
痈=yong
痉=jing
痊=quan
痍=yi
痒=yang
痔=zhi
痕=hen
痖=ya
痘=dou
痛=tong
痞=pi
痢=li
痣=zhi
痤=cuo
痦=wu
痧=sha
痨=lao
痪=huan
痫=xian
痰=tan
痱=fei
痴=chi
痹=bi
痼=gu
痿=wei
瘀=yu
瘁=cui
瘃=zhu
瘅=dan
瘊=hou
瘌=la
瘐=yu
瘕=jia
瘗=yi
瘘=lou
瘙=sao
瘛=chi
瘟=wen
瘠=ji
瘢=ban
瘤=liu
瘥=chai
瘦=shou
瘩=da
瘪=bie
瘫=tan
瘭=biao
瘰=luo
瘳=chou
瘴=zhang
瘵=zhai
瘸=que
瘼=mo
瘾=yin
瘿=ying
癀=huang
癃=long
癌=ai
癍=ban
癔=yi
癖=pi
癜=dian
癞=lai
癣=xuan
癫=dian
癯=qu
癸=gui
登=deng
白=bai
百=bai
皂=zao
的=de,di
皆=jie
皇=huang
皈=gui
皋=gao
皎=jiao
皑=ai
皓=hao
皖=wan
皙=xi
皤=po
皮=pi
皱=zhou
皲=jun
皴=cun
皿=min
盂=yu
盅=zhong
盆=pen
盈=ying
益=yi
盍=he
盎=ang
盏=zhan
盐=yan
监=jian
盒=he
盔=kui
盖=gai
盗=dao
盘=pan
盛=cheng,sheng
盟=meng
盥=guan
目=mu
盯=ding
盱=xu
盲=mang
直=zhi
相=xiang
盹=dun
盼=pan
盾=dun
省=xing,sheng
眄=mian
眇=miao
眈=dan
眉=mei
看=kan
眍=kou
眙=yi
眚=sheng
真=zhen
眠=mian
眢=yuan
眦=zi
眨=zha
眩=xuan
眭=sui
眯=mi
眵=chi
眶=kuang
眷=juan
眸=mou
眺=tiao
眼=yan
着=zhuo,zhao,zhe
睁=zheng
睃=suo
睇=di
睐=lai
睑=jian
睚=ya
睛=jing
睡=shui
睢=sui
督=du
睥=pi
睦=mu
睨=ni
睫=jie
睬=cai
睹=du
睽=kui
睾=gao
睿=rui
瞀=mao
瞄=miao
瞅=chou
瞌=ke
瞍=sou
瞎=xia
瞑=ming
瞒=man
瞟=piao
瞠=cheng
瞢=meng
瞥=pie
瞧=qiao
瞩=zhu
瞪=deng
瞬=shun
瞰=kan
瞳=tong
瞵=lin
瞻=zhan
瞽=gu
瞿=qu
矍=jue
矗=chu
矛=mao
矜=guan
矢=shi
矣=yi
知=zhi
矧=shen
矩=ju
矫=jiao
矬=cuo
短=duan
矮=ai
石=shi
矶=ji
矸=gan
矽=xi
矾=fan
矿=kuang
砀=dang
码=ma
砂=sha
砉=hua
砌=qi
砍=kan
砑=ya
砒=pi
研=yan
砖=zhuan
砗=che
砘=dun
砚=yan
砜=feng
砝=fa
砟=zha
砣=tuo
砥=di
砦=zhai
砧=zhen
砩=fu
砬=la
砭=bian
砰=peng
破=po
砷=shen
砸=za
砹=ai
砺=li
砻=long
砼=tong
砾=li
础=chu
硅=gui
硇=nao
硌=ge
硎=xing
硐=dong
硒=xi
硕=shuo
硖=xia
硗=qiao
硝=xiao
硪=wo
硫=liu
硬=ying
硭=mang
确=que
硷=jian
硼=peng
碇=ding
碉=diao
碌=lu
碍=ai
碎=sui
碑=bei
碓=dui
碗=wan
碘=dian
碚=bei
碛=qi
碜=chen
碟=die
碡=zhou
碣=jie
碥=bian
碧=bi
碰=peng
碱=jian
碲=di
碳=tan
碴=cha
碹=xuan
碾=nian
磁=ci
磅=bang
磉=sang
磊=lei
磋=cuo
磐=pan
磔=zhe
磕=ke
磙=gun
磨=mo
磬=qing
磲=qu
磴=deng
磷=lin
磺=huang
礁=jiao
礅=dun
礓=jiang
礞=meng
礤=ca
礴=bo
示=shi
礼=li
社=she
祀=si
祁=qi
祆=xian
祈=qi
祉=zhi
祎=yi
祓=fu
祖=zu
祗=zhi
祚=zuo
祛=qu
祜=hu
祝=zhu
神=shen
祟=sui
祠=ci
祢=mi
祥=xiang
祧=tiao
票=piao
祭=ji
祯=zhen
祷=dao
祸=huo
祺=qi
禀=bing
禁=jin
禄=lu
禅=chan
禊=xi
福=fu
禚=zhuo
禧=xi
禳=rang
禹=yu
禺=yu
离=li
禽=qin
禾=he
秀=xiu
私=si
秃=tu
秆=gan
秉=bing
秋=qiu
种=zhong
科=ke
秒=miao
秕=bi
秘=bi,mi
租=zu
秣=mo
秤=cheng
秦=qin
秧=yang
秩=zhi
秫=shu
秭=zi
积=ji
称=chen,cheng
秸=jie
移=yi
秽=hui
稀=xi
稂=lang
稃=fu
稆=lu
程=cheng
稍=shao
税=shui
稔=ren
稗=bai
稚=zhi
稞=ke
稠=chou
稣=su
稳=wen
稷=ji
稹=zhen
稻=dao
稼=jia
稽=ji
稿=gao
穆=mu
穑=se
穗=sui
穰=rang
穴=xue
究=jiu
穷=qiong
穸=xi
穹=qiong
空=kong
穿=chuan
窀=zhun
突=tu
窃=qie
窄=zhai
窆=bian
窈=yao
窍=qiao
窑=yao
窒=zhi
窕=tiao
窖=jiao
窗=chuang
窘=jiong
窜=cuan
窝=wo
窟=ku
窠=ke
窥=kui
窦=dou
窨=yin
窬=yu
窭=ju
窳=yu
窿=long
立=li
竖=shu
站=zhan
竞=jing
竟=jing
章=zhang
竣=jun
童=tong
竦=song
竭=jie
端=duan
竹=zhu
竺=zhu
竽=yu
竿=gan
笃=du
笄=ji
笆=ba
笈=ji
笊=zhao
笋=sun
笏=hu
笑=xiao
笔=bi
笕=jian
笙=sheng
笛=di
笞=chi
笠=li
笤=tiao
笥=si
符=fu
笨=ben
笪=da
笫=zi
第=di
笮=ze
笱=gou
笳=jia
笸=po
笺=jian
笼=long
笾=bian
筅=xian
筇=qiong
等=deng
筋=jin
筌=quan
筏=fa
筐=kuang
筑=zhu
筒=tong
答=da
策=ce
筘=kou
筚=bi
筛=shai
筝=zheng
筠=jun
筢=pa
筮=shi
筱=xiao
筲=shao
筵=yan
筷=kuai
筹=chou
筻=gang
签=qian
简=jian
箅=bi
箍=gu
箐=qing
箔=bo
箕=ji
算=suan
箜=kong
箝=qian
管=guan
箢=yuan
箦=ze
箧=qie
箨=tuo
箩=luo
箪=dan
箫=xiao
箬=qian
箭=jian
箱=xiang
箴=zhen
箸=zhu
篁=huang
篆=zhuan
篇=pian
篌=hou
篑=kui
篓=lou
篙=gao
篚=fei
篝=gou
篡=cuan
篥=li
篦=bi
篪=chi
篮=lan
篱=li
篷=peng
篼=dou
篾=mie
簇=cu
簋=gui
簌=su
簏=lu
簖=duan
簟=dian
簦=deng
簧=huang
簪=zan
簸=bo
簿=bu
籀=zhou
籁=lai
籍=ji
米=mi
籴=di
类=lei
籼=xian
籽=zi
粉=fen
粑=ba
粒=li
粕=po
粗=cu
粘=zhan,nian
粜=tiao
粝=li
粞=xi
粟=su
粢=zi
粤=yue
粥=zhou
粪=fen
粮=liang
粱=liang
粲=can
粳=jing
粹=cui
粼=lin
粽=zong
精=jing
糁=san
糅=rou
糇=hou
糈=xu
糊=hu
糌=zan
糍=ci
糕=gao
糖=tang
糗=qiu
糙=cao
糜=mi
糟=zao
糠=kang
糨=jiang
糯=nuo
糸=mi
系=xi,ji
紊=wen
素=su
索=suo
紧=jin
紫=zi
累=lei
絮=xu
絷=zhi
綦=qi
綮=qi
縻=mi
繁=fan
繇=yao
纂=zuan
纛=dao
纠=jiu
纡=yu
红=hong
纣=zhou
纤=qian,xian
纥=he
约=yue
级=ji
纨=wan
纩=kuang
纪=ji
纫=ren
纬=wei
纭=yun
纯=chun
纰=pi
纱=sha
纲=gang
纳=na
纵=zong
纶=lun
纷=fen
纸=zhi
纹=wen
纺=fang
纽=niu
纾=shu
线=xian
绀=gan
绁=xie
绂=fu
练=lian
组=zu
绅=shen
细=xi
织=zhi
终=zhong
绉=zhou
绊=ban
绋=fu
绌=chu
绍=shao
绎=yi
经=jing
绐=dai
绑=bang
绒=rong
结=jie
绔=ku
绕=rao
绗=hang
绘=hui
给=gei,ji
绚=xuan
绛=jiang
络=luo
绝=jue
绞=jiao
统=tong
绠=geng
绡=xiao
绢=juan
绣=xiu
绥=sui
绦=tao
继=ji
绨=di
绩=ji
绪=xu
绫=ling
续=xu
绮=qi
绯=fei
绰=chuo
绱=shang
绲=gun
绳=sheng
维=wei
绵=mian
绶=shou
绷=beng
绸=chou
绺=liu
绻=quan
综=zong
绽=zhan
绾=wan
绿=lu,lv
缀=zhui
缁=zi
缂=ke
缃=xiang
缄=jian
缅=mian
缆=lan
缇=ti
缈=miao
缉=ji
缋=hui
缌=si
缍=duo
缎=duan
缏=bian
缑=gou
缒=zhui
缓=huan
缔=di
缕=lu
编=bian
缗=min
缘=yuan
缙=jin
缚=fu
缛=ru
缜=zhen
缝=feng
缟=gao
缠=chan
缡=li
缢=yi
缣=jian
缤=bin
缥=piao
缦=man
缧=lei
缨=ying
缩=su,suo
缪=miao
缫=sao
缬=xie
缭=liao
缮=shan
缯=zeng
缰=jiang
缱=qian
缲=sao
缳=huan
缴=jiao
缵=zuan
缶=fou
缷=xie
缸=gang
缺=que
罂=ying
罄=qing
罅=xia
罐=guan
网=wang
罔=wang
罕=han
罗=luo
罘=fu
罚=fa
罟=gu
罡=gang
罢=ba
罨=yan
罩=zhao
罪=zui
置=zhi
罱=lan
署=shu
罴=pi
罹=li
罾=zeng
羁=ji
羊=yang
羌=qiang
美=mei
羔=gao
羚=ling
羝=di
羞=xiu
羟=qiang
羡=xian
群=qun
羧=suo
羯=jie
羰=tang
羲=xi
羸=lei
羹=geng
羼=chan
羽=yu
羿=yi
翁=weng
翅=chi
翊=yi
翌=yi
翎=ling
翔=xiang
翕=xi
翘=qiao
翟=di
翠=cui
翡=fei
翥=zhu
翦=jian
翩=pian
翮=he
翰=han
翱=ao
翳=yi
翻=fan
翼=yi
