{
    "map1":{"eventid":0,         "type":"all",             "config":"FeatureListForReliability.Json"},
    "map2":{"eventid":901000000, "type":"VmReboot",        "config":"FeatureAnalysisForRebootsys.Json"},
    "map3":{"eventid":901000001, "type":"VmWatchdog",      "config":"FeatureAnalysisForRebootsys.Json"},
    "map4":{"eventid":901000002, "type":"Panic",           "config":"FeatureAnalysisForRebootsys.Json"},
    "map5":{"eventid":901000003, "type":"HwWatchdog",      "config":"FeatureAnalysisForRebootsys.Json"},
    "map6":{"eventid":901000004, "type":"UnknowFault",     "config":"FeatureAnalysisForRebootsys.Json"},
    "map7":{"eventid":901000005, "type":"HardwareFault",   "config":"FeatureAnalysisForRebootsys.Json"},
    "map8":{"eventid":901000006, "type":"BootloaderCrash", "config":"FeatureAnalysisForRebootsys.Json"},
    "map9":{"eventid":901000007, "type":"Lpm3Exception",   "config":"FeatureAnalysisForRebootsys.Json"},
    "map10":{"eventid":901000008, "type":"TzReboot",       "config":"FeatureAnalysisForRebootsys.Json"},
    "map11":{"eventid":901000009, "type":"ModemReboot",    "config":"FeatureAnalysisForRebootsys.Json"},
    "map12":{"eventid":901000010, "type":"Press10",        "config":"FeatureAnalysisForRebootsys.Json"},
    "map13":{"eventid":901001000, "type":"Anr",         "config":"FeatureAnalysisForApp.Json"},
    "map14":{"eventid":901001001, "type":"Crash",       "config":"FeatureAnalysisForApp.Json"},
    "map15":{"eventid":901001002, "type":"Tombstone",   "config":"FeatureAnalysisForApp.Json"},
    "map16":{"eventid":901001014, "type":"JsCrash",   "config":"FeatureAnalysisForApp.Json"},
    "map17":{"eventid":901002000, "type":"ModemCrash",  "config":"FeatureAnalysisForSubsys.Json"},
    "map18":{"eventid":901002001, "type":"HifiCrash",   "config":"FeatureAnalysisForSubsys.Json"},
    "map19":{"eventid":901002002, "type":"SensorhubCrash",  "config":"FeatureAnalysisForSubsys.Json"},
    "map20":{"eventid":901002003, "type":"TeeOsCrash",  "config":"FeatureAnalysisForSubsys.Json"},
    "map21":{"eventid":901002004, "type":"HiseeCrash",  "config":"FeatureAnalysisForSubsys.Json"},
    "map22":{"eventid":901002005, "type":"WcnssCrash",  "config":"FeatureAnalysisForSubsys.Json"},
    "map23":{"eventid":901002006, "type":"IvpCrash",  "config":"FeatureAnalysisForSubsys.Json"},
    "map24":{"eventid":901002007, "type":"IspCrash",  "config":"FeatureAnalysisForSubsys.Json"},
    "map25":{"eventid":901002008, "type":"NpuCrash",  "config":"FeatureAnalysisForSubsys.Json"},
    "map26":{"eventid":901002009, "type":"DssCrash",  "config":"FeatureAnalysisForSubsys.Json"},
    "map27":{"eventid":901005000, "type":"BootFail",    "config":"FeatureAnalysisForBootfail.Json"},
    "map28":{"eventid":901004003, "type":"Xcollie",    "config":"FeatureAnalysisForApp.Json"},
    "map29":{"eventid":901004000, "type":"SystemHungFault",    "config":"FeatureAnalysisForFreeze.Json"},
    "map30":{"eventid":901004004, "type":"SystemHungWarning",    "config":"FeatureAnalysisForFreeze.Json"},
    "map31":{"eventid":901004005, "type":"AppFreeze",    "config":"FeatureAnalysisForFreeze.Json"},
    "map32":{"eventid":901004006, "type":"AppFreezeWarning",    "config":"FeatureAnalysisForFreeze.Json"}
}