{
    "AsrParams":{
        "Enrollment":[false, 0, 240, 2000, 100, 0, 30000, 1, 0, 1, 20000, 20, 0.3, 0.03, -0.1, 0.38, 0.1, 0],
        "Recognition":[false, 0, 240, 2000, 400, 0, 30000, 1, 0, 1, 20000, 20, 0.3, 0.03, -0.5, 0.3, 0.03, -0.5]
    },
    "SensibilityParams":{
        "comment":"array element 0:low, 1:middle, 2:high",
        "AsrUnconfidentPhonesNum":[0, 1, 2],
        "DspSentenceThresholds":{
            "Default":[84, 84, 77, 73, 73, 67],
            "UserDefined":[97, 97, 97, 88, 88, 88]
        }
    },
	"DefaultPhrase":{
        "你好小E":[84, 84, 77, 73, 73, 67],
        "你好小易":[84, 84, 77, 73, 73, 67],
        "你好华为":[84, 84, 77, 73, 73, 67],
        "小艺小艺":[84, 84, 77, 73, 73, 67],
        "你好悠悠":[97, 97, 97, 88, 88, 88],
        "我的荣耀":[84, 84, 77, 73, 73, 67]
	},
	"Features":["conf_upgrade"],
	"ControlParams":["no_prune","half_model","skip_frame"],
	"BufferConf":1280,
	"EnrollSnrThrd":15.0
}