703022001,110000,130000,FS_CAL_RAWDATA
703022002,110000,130000,FS_TEST_RAWDATA
703022003,110000,130000,FS_CAL_RAWDATA_VERIF
703022004,110000,130000,FS_TEST_RAWDATA_VERIF
703022005,300,700,FS_CAL_DIFF
703022006,300,700,FS_TEST_DIFF
703022007,40,60,FS_NORMAL_STRENG
