{
    "priority_install": [
        "Framework-common",
        "Framework-manager",
        "Framework-runtime",
        "Framework-ui",
        "Framework-privacy",
        "Framework-kitstore",
        "Framework-webapp"
    ],
    "kits": [
        {
            "version_code": "61100301",
            "kit_type": "app",
            "kit_name": "attribution",
            "api_level": "1",
            "pkg_name": "com.huawei.hms.agservice.attribution",
            "apk_name": "Attribution.apk",
            "minSdkVersion": "21",
            "kit_lib": "x86_64,x86,armeabi-v7a,arm64-v8a",
            "dependencies": "fwcom-grs,2;fwcom-util,10;fwui,7;hmscore,14;kpms,14;runtime,25;kams,13",
            "main_entry": "com.huawei.hms.attribution.service.MainEntry"
        },
        {
            "version_code": "30700301",
            "kit_type": "app",
            "kit_name": "mlkit",
            "api_level": "1",
            "pkg_name": "com.huawei.hms.mlkit.service",
            "apk_name": "ML.apk",
            "minSdkVersion": "19",
            "dependencies": "fwcom-grs,1;fwcom-util,1;fwui,1;hmscore,1;kpms,1;runtime,1;kams,1",
            "main_entry": "com.huawei.hms.mlkit.service.MainEntry"
        },
        {
            "version_code": "604000320",
            "kit_type": "app",
            "kit_name": "litedrm",
            "api_level": "101",
            "pkg_name": "com.huawei.hms.litedrm",
            "apk_name": "litedrm.apk",
            "minSdkVersion": "23",
            "kit_lib": "armeabi-v7a,arm64-v8a",
            "dependencies": "hmscore,10;runtime,19;measurement,1",
            "main_entry": "com.huawei.hms.litedrm.MainEntry"
        },
        {
            "version_code": "61200301",
            "kit_type": "app;app",
            "kit_name": "kpms;kams",
            "api_level": "19;14",
            "pkg_name": "com.huawei.hms.fwkit",
            "apk_name": "Framework-manager.apk",
            "minSdkVersion": "19",
            "dependencies": "fwcom-util,14;fwcom-grs,2;fwui,6;hmscore,17;runtime,26;measurement,2",
            "main_entry": "com.huawei.hms.fwkit.kpms.MainEntry;"
        },
        {
            "version_code": "30464301",
            "kit_type": "app",
            "kit_name": "adskit",
            "api_level": "1",
            "pkg_name": "com.huawei.hms.ads",
            "apk_name": "adskit-rom.apk",
            "minSdkVersion": "19",
            "dependencies": "huawei_module_networkkit,-1:weak;fwcom-grs,2;fwcom-util,10;fwui,7;hmscore,14;privacykit,3;kpms,14;runtime,25;hwid,16;kams,13",
            "main_entry": "com.huawei.hms.pps.MainEntry"
        },
        {
            "version_code": "100017301",
            "kit_type": "app",
            "kit_name": "drmkitclient",
            "api_level": "1",
            "pkg_name": "com.huawei.hms.drmkitclient",
            "apk_name": "DRM-client.apk",
            "minSdkVersion": "24",
            "dependencies": "huawei_module_quic,-1:weak;fwcom-grs,1;fwcom-util,1;fwui,1;hmscore,10;huawei_module_dynamicloader,10;runtime,20;kpms,11;measurement,1;kams,11;apptouch,3;huawei_module_quic_pro,-1:weak",
            "main_entry": ""
        },
        {
            "version_code": "61200301",
            "kit_type": "app",
            "kit_name": "fwui",
            "api_level": "8",
            "pkg_name": "com.huawei.hms.fwui",
            "apk_name": "Framework-ui.apk",
            "minSdkVersion": "19",
            "dependencies": "kitstore,10;fwcom-util,10;fwcom-grs,2;webapp-runtime,4;fwui,7;hmscore,14;kpms,19;runtime,25;privacykit,2;kams,13;measurement,2",
            "main_entry": ""
        },
        {
            "version_code": "61100301",
            "kit_type": "app",
            "kit_name": "hihealth",
            "api_level": "19",
            "pkg_name": "com.huawei.hms.hihealth",
            "apk_name": "Health.apk",
            "minSdkVersion": "24",
            "kit_lib": "armeabi-v7a,arm64-v8a",
            "dependencies": "hihealth,19;hmscore,10;runtime,25;measurement,4;kams,13;huawei_module_networkkit,11;fwcom-grs,2;fwcom-util,10;fwui,7;huawei_module_dynamicloader,10;kpms,14;hwid,1;account,13",
            "main_entry": "com.huawei.hms.hihealth.service.api.MainEntry"
        },
        {
            "version_code": "61200301",
            "kit_type": "app;app",
            "kit_name": "hwid;account",
            "api_level": "22;15",
            "pkg_name": "com.huawei.hms.account",
            "apk_name": "AccountKit-base.apk",
            "minSdkVersion": "19",
            "kit_lib": "armeabi-v7a,arm64-v8a",
            "dependencies": "hmscore,16;huawei_module_scankit,1:weak;runtime,28;pay,4;measurement,4;kams,13;huawei_module_networkkit,-1:weak;fwcom-util,13;fwcom-grs,2;webapp-runtime,1;fwui,7;huawei_module_dynamicloader,9:weak;kpms,14;iap,4",
            "main_entry": "com.huawei.hms.hwid.MainEntry:com.huawei.hms.account.core;com.huawei.hms.hwid.MainEntry:com.huawei.hms.account.core",
            "split_name": "HwID_Features",
            "split_file_name": "AccountKit-feature.apk"
        },
        {
            "version_code": "60011300",
            "kit_type": "sdk",
            "kit_name": "huawei_module_networkkit",
            "api_level": "11",
            "pkg_name": "com.huawei.hms.networkkit",
            "apk_name": "networkkit.apk",
            "minSdkVersion": "19",
            "dependencies": "huawei_module_quic,-1:weak;huawei_module_dynamicloader,8;huawei_module_quic_pro,-1:weak",
            "main_entry": ""
        },
        {
            "version_code": "10000300",
            "kit_type": "app",
            "kit_name": "network-baseservice",
            "api_level": "0",
            "pkg_name": "com.huawei.hms.network.baseservice",
            "apk_name": "networkbaseservice.apk",
            "minSdkVersion": "19",
            "main_entry": ""
        },
        {
            "version_code": "10025300",
            "kit_type": "loader",
            "kit_name": "huawei_module_dynamicloader",
            "api_level": "11",
            "pkg_name": "com.huawei.hms.dynamicloader",
            "apk_name": "DynamicLoader.apk",
            "minSdkVersion": "19",
            "main_entry": ""
        },
        {
            "version_code": "61200301",
            "kit_type": "app;app",
            "kit_name": "im;sns",
            "api_level": "10;6",
            "pkg_name": "com.huawei.hms.sns",
            "apk_name": "snskit.apk",
            "minSdkVersion": "19",
            "kit_lib": "armeabi-v7a,arm64-v8a",
            "dependencies": "huawei_module_quic,-1:weak;hmscore,8;huawei_module_scankit,1:weak;runtime,25;pay,4;kams,13;fwcom-grs,2;fwcom-util,10;fwui,7;huawei_module_dynamicloader,10:weak;qoes,1:weak;kpms,14;iap,4;hwid,16;huawei_module_quic_pro,-1:weak",
            "main_entry": "com.huawei.hms.sns.MainEntry;com.huawei.hms.sns.MainEntry"
        },
        {
            "version_code": "61200301",
            "kit_type": "app",
            "kit_name": "privacykit",
            "api_level": "3",
            "pkg_name": "com.huawei.hms.privacy",
            "apk_name": "Framework-privacy.apk",
            "minSdkVersion": "19",
            "dependencies": "fwcom-grs,2;fwcom-util,10;webapp-runtime,4;fwui,7;hmscore,14;runtime,22;kpms,14;kams,13;measurement,2",
            "main_entry": ""
        },
        {
            "version_code": "21200300",
            "kit_type": "sdk",
            "kit_name": "huawei_module_scankit",
            "api_level": "1",
            "pkg_name": "com.huawei.hms.scankit",
            "apk_name": "Scan.apk",
            "minSdkVersion": "19",
            "kit_lib": "armeabi-v7a,arm64-v8a",
            "dependencies": "huawei_module_dynamicloader,10",
            "main_entry": ""
        },
        {
            "version_code": "61200300",
            "kit_type": "app;app;app;app;app;app",
            "kit_name": "core;game;payjos;hwidjos;iapjos;jos",
            "api_level": "3;8;99;99;99;15",
            "pkg_name": "com.huawei.hms.game",
            "apk_name": "GameServiceKit.apk",
            "minSdkVersion": "19",
            "dependencies": "fwcom-grs,1;fwcom-util,1;fwui,1;hmscore,10;runtime,20;kpms,3;iap,4;pay,4;hwid,16;measurement,1;kams,3;apptouch,5",
            "main_entry": "com.huawei.hms.game.entry.CoreMainEntry;com.huawei.hms.game.entry.GameMainEntry;com.huawei.hms.game.entry.PayJosMainEntry;com.huawei.hms.game.entry.HwidJosMainEntry;com.huawei.hms.game.entry.IapJosMainEntry;com.huawei.hms.game.entry.JosMainEntry"
        },
        {
            "version_code": "61200301",
            "kit_type": "app",
            "kit_name": "permissionservice",
            "api_level": "1",
            "pkg_name": "com.huawei.hms.permissionservice",
            "apk_name": "Framework-permissionservice.apk",
            "minSdkVersion": "19",
            "dependencies": "fwcom-util,13;fwcom-grs,2;fwui,7;hmscore,13;runtime,26;kpms,14;measurement,3;kams,13",
            "main_entry": "com.huawei.hms.permissionservice.MainEntry"
        },
        {
            "version_code": "61200301",
            "kit_type": "app",
            "kit_name": "kitstore",
            "api_level": "10",
            "pkg_name": "com.huawei.hms.kitstore",
            "apk_name": "Framework-kitstore.apk",
            "minSdkVersion": "19",
            "kit_lib": "armeabi-v7a,arm64-v8a",
            "dependencies": "fwcom-util,13;fwcom-grs,2;fwui,8;hmscore,17;kpms,17;runtime,22;measurement,2",
            "main_entry": "com.huawei.hms.kitstore.MainEntry"
        },
        {
            "version_code": "60501302",
            "kit_type": "app",
            "kit_name": "site",
            "api_level": "14",
            "pkg_name": "com.huawei.hms.kit.site",
            "apk_name": "Site.apk",
            "minSdkVersion": "19",
            "dependencies": "fwcom-util,13;fwcom-grs,1;fwui,7;hmscore,13;runtime,25;kpms,14;measurement,1;kams,13",
            "main_entry": "com.huawei.hms.kit.site.request.MainEntry"
        },
        {
            "version_code": "61300352",
            "kit_type": "sdk",
            "kit_name": "huawei_module_iapcashierview",
            "api_level": "4",
            "pkg_name": "com.huawei.hms.iap.cashierview",
            "apk_name": "IAP-IapCashierView.apk",
            "minSdkVersion": "19",
            "kit_loader": "huawei_module_iapcashierview:huawei_module_dynamicloader",
            "dependencies": "huawei_module_dynamicloader,10;hmscore,1;iap,11",
            "main_entry": ""
        },
        {
            "version_code": "61200301",
            "kit_type": "app",
            "kit_name": "oobe",
            "api_level": "1",
            "pkg_name": "com.huawei.hms.oobe",
            "apk_name": "Framework-oobe.apk",
            "minSdkVersion": "19",
            "dependencies": "qoes,1:weak",
            "main_entry": ""
        },
        {
            "version_code": "61300352",
            "kit_type": "app;app",
            "kit_name": "iap;pay",
            "api_level": "11;5",
            "pkg_name": "com.huawei.hms.iap",
            "apk_name": "IAP-base.apk",
            "minSdkVersion": "19",
            "kit_lib": "armeabi-v7a,arm64-v8a",
            "dependencies": "huawei_module_quic,-1:weak;kitstore,6;hmscore,14;huawei_module_scankit,1:weak;runtime,25;measurement,4;kams,13;huawei_module_networkkit,-1:weak;fwcom-grs,2;fwcom-util,10;fwui,7;huawei_module_dynamicloader,10:weak;kpms,14;hwid,16;huawei_module_quic_pro,-1:weak;apptouch,5",
            "main_entry": "com.huawei.hms.iap.MainEntry;com.huawei.hms.pay.MainEntry",
            "split_name": "MyBill;FamilyShare;HWPoints;ScanCard;PaymentSettings;WithholdSettings;CardCoupon;Faq;PetalBindCard",
            "split_file_name": "IAP-MyBill-feature.apk;IAP-FamilyShare-feature.apk;IAP-HWPoints-feature.apk;IAP-ScanCard-feature.apk;IAP-PaymentSettings-feature.apk;IAP-WithholdSettings-feature.apk;IAP-CardCoupon-feature.apk;IAP-Faq-feature.apk;IAP-PetalBindCard-feature.apk"
        },
        {
            "version_code": "61000300",
            "kit_type": "app",
            "kit_name": "account-supplement",
            "api_level": "15",
            "pkg_name": "com.huawei.hms.account.supplement",
            "apk_name": "AccountSupplementKit.apk",
            "minSdkVersion": "26",
            "dependencies": "fwcom-util,13;fwcom-grs,1;fwui,7;hmscore,19;kpms,14;runtime,25;hwid,18;measurement,4;kams,13",
            "main_entry": "com.huawei.hms.account.supplement.MainEntry"
        },
        {
            "version_code": "61200301",
            "kit_type": "app;app;app;app",
            "kit_name": "fwcom-grs;fwcom-util;measurement;apptouch",
            "api_level": "2;14;4;5",
            "pkg_name": "com.huawei.hms.commonkit",
            "apk_name": "Framework-common.apk",
            "minSdkVersion": "19",
            "dependencies": "huawei_module_quic,-1:weak;fwcom-grs,2;fwcom-util,1;huawei_module_dynamicloader,10:weak;hmscore,18;runtime,27;measurement,2;huawei_module_quic_pro,-1:weak",
            "main_entry": ";;;com.huawei.hms.apptouch.MainEntry"
        },
        {
            "version_code": "61001303",
            "kit_type": "app",
            "kit_name": "hianalytics",
            "api_level": "1",
            "pkg_name": "com.huawei.hms.analytics",
            "apk_name": "Analytics.apk",
            "minSdkVersion": "19",
            "dependencies": "fwcom-grs,2;fwcom-util,10;fwui,7;hmscore,14;privacykit,3;qoes,1:weak;kpms,14;runtime,25;kams,13",
            "main_entry": "com.huawei.hms.analytics.request.MainEntry"
        },
        {
            "version_code": "61200301",
            "kit_type": "app",
            "kit_name": "runtime",
            "api_level": "29",
            "pkg_name": "com.huawei.hms.runtimekit",
            "apk_name": "Framework-runtime.apk",
            "minSdkVersion": "19",
            "dependencies": "fwcom-util,14;fwcom-grs,2;hmscore,16;kpms,18;runtime,22;kams,12;measurement,2",
            "main_entry": ""
        },
        {
            "version_code": "61200300",
            "kit_type": "app",
            "kit_name": "push",
            "api_level": "6",
            "pkg_name": "com.huawei.hms.push",
            "apk_name": "Push-base.apk",
            "minSdkVersion": "19",
            "dependencies": "fwcom-util,12;fwcom-grs,2;fwui,7;hmscore,10;runtime,25;kpms,14;measurement,3;kams,13",
            "main_entry": "com.huawei.hms.push.MainEntry",
            "split_name": "pushnc",
            "split_file_name": "Push-ncfeature.apk"
        },
        {
            "version_code": "50002300",
            "kit_type": "sdk",
            "kit_name": "huawei_module_locationNavi",
            "api_level": "1",
            "pkg_name": "com.huawei.hms.location.navi",
            "apk_name": "LocationNavi.apk",
            "minSdkVersion": "19",
            "dependencies": "huawei_module_dynamicloader,4",
            "main_entry": ""
        },
        {
            "version_code": "61200301",
            "kit_type": "app",
            "kit_name": "ekr",
            "api_level": "1",
            "pkg_name": "com.huawei.hms.ekr",
            "apk_name": "Framework-ekr.apk",
            "minSdkVersion": "19",
            "dependencies": "fwcom-util,5;fwcom-grs,2;hmscore,7;runtime,22;kams,4;measurement,2",
            "main_entry": "com.huawei.hms.ekr.MainEntry"
        },
        {
            "version_code": "61100301",
            "kit_type": "app",
            "kit_name": "fido",
            "api_level": "610",
            "pkg_name": "com.huawei.hms.fido",
            "apk_name": "FIDO.apk",
            "minSdkVersion": "23",
            "dependencies": "fwcom-grs,2;fwcom-util,10;fwui,7;hmscore,14;safetydetect,1;kpms,14;runtime,25;kams,13",
            "main_entry": "com.huawei.hms.fido.MainEntry"
        },
        {
            "version_code": "10000302",
            "kit_type": "app",
            "kit_name": "iapcps",
            "api_level": "1",
            "pkg_name": "com.huawei.hms.purchasemarker",
            "apk_name": "PurchaseMarker.apk",
            "minSdkVersion": "19",
            "dependencies": "fwcom-grs,1;fwcom-util,1;fwui,1;hmscore,9;kpms,11;runtime,20;iap,4;pay,4;kams,11;apptouch,3",
            "main_entry": "com.huawei.hms.purchasemarker.entry.PurchaseMarkerMainEntry"
        },
        {
            "version_code": "61002301",
            "kit_type": "sdk",
            "kit_name": "huawei_module_jsb",
            "api_level": "13",
            "pkg_name": "com.huawei.hms.jsb",
            "apk_name": "Framework-jsb.apk",
            "minSdkVersion": "19",
            "dependencies": "hmscore,1;huawei_module_dynamicloader,11",
            "main_entry": ""
        },
        {
            "version_code": "61200301",
            "kit_type": "app",
            "kit_name": "webapp-runtime",
            "api_level": "6",
            "pkg_name": "com.huawei.hms.webapp",
            "apk_name": "Framework-webapp.apk",
            "minSdkVersion": "19",
            "dependencies": "fwcom-util,13;fwcom-grs,2;hmscore,14;runtime,22;measurement,2",
            "main_entry": ""
        },
        {
            "version_code": "61300300",
            "kit_type": "app",
            "kit_name": "location",
            "api_level": "10",
            "pkg_name": "com.huawei.hms.location",
            "apk_name": "LocationROM.apk",
            "minSdkVersion": "19",
            "dependencies": "fwcom-util,12;fwcom-grs,2;fwui,7;hmscore,10;runtime,26;privacykit,3;kpms,14;hwid,16;measurement,1;kams,13",
            "main_entry": "com.huawei.hms.location.MainEntry"
        },
        {
            "version_code": "60900331",
            "kit_type": "app;app",
            "kit_name": "tss;safetydetect",
            "api_level": "3;60100005",
            "pkg_name": "com.huawei.hms.safetydetect",
            "apk_name": "SafetyDetect-base.apk",
            "minSdkVersion": "19",
            "kit_lib": "armeabi-v7a,arm64-v8a",
            "dependencies": "kitstore,6;fwcom-util,13;fwcom-grs,2;fwui,7;hmscore,21;runtime,26;kpms,14;hwid,16;measurement,1;kams,13",
            "main_entry": "com.huawei.hms.tss.MainEntry;com.huawei.hms.safetydetect.MainEntry",
            "split_name": "safetydetectfeature;tsskmsfeature;tssq888tafile;tsskirinv2tafile;tsskirin64tafile;tsskirinv3tafile;tsshonortafile",
            "split_file_name": "SafetyDetect-feature.apk;SafetyDetect-tsskmsfeature.apk;SafetyDetect-tssq888tafile.apk;SafetyDetect-tsskirinv2tafile.apk;SafetyDetect-tsskirin64tafile.apk;SafetyDetect-tsskirinv3tafile.apk;SafetyDetect-tsshonortafile.apk"
        },
        {
            "version_code": "61200301",
            "kit_type": "app",
            "kit_name": "opendevice",
            "api_level": "2",
            "pkg_name": "com.huawei.hms.opendevice",
            "apk_name": "Framework-opendevice.apk",
            "minSdkVersion": "19",
            "dependencies": "fwcom-grs,2;fwcom-util,10;fwui,7;hmscore,6;kpms,14;runtime,25;kams,13",
            "main_entry": "com.huawei.hms.opendevice.MainEntry"
        }
    ]
}