{
  "config":{
    "hw_platform": ["QRD", "HDK"],
    "soc_id": ["552", "540", "456", "502", "501"]
  },
  "icm206xx_0_platform":{
    "owner": "sns_icm206xx",
    ".orient":{
      "owner": "sns_icm206xx",
      "x":{ "type": "str", "ver": "0",
        "data": "+y"
      },
      "y":{ "type": "str", "ver": "0",
        "data": "-x"
      },
      "z":{ "type": "str", "ver": "0",
        "data": "+z"
      }
    }
  }
}
