{
  "ambient_brightness_scale": 0.70000004768371582,
  "ambient_saturation_scale": 0.85000002384185791,
  "ambient_shadow_brightness_scale": 1,
  "ambient_shadow_saturation_scale": 1,
  "bg_color_temp": 7500,
  "bg_grayscale": false,
  "cameras": [
    {
      "ext_rot": [
        0,
        0,
        0
      ],
      "eye": [
        0,
        0,
        10000
      ],
      "fov": 45,
      "look_at": [
        0,
        0,
        0
      ],
      "name": "Primary",
      "ortho_scale": 1,
      "perspective": false,
      "up": [
        0,
        1,
        0
      ]
    },
    {
      "ext_rot": [
        0,
        0,
        0
      ],
      "eye": [
        0,
        0,
        10000
      ],
      "fov": 45,
      "look_at": [
        0,
        0,
        0
      ],
      "name": "Secondary",
      "ortho_scale": 1,
      "perspective": true,
      "up": [
        0,
        1,
        0
      ]
    }
  ],
  "eye_alpha_threshold": 0.11999999731779099,
  "eyeball_radius_scale": 2.5,
  "ignore_pupil_normal": true,
  "is_huawei_depth": false,
  "light_filenames": [
    ".\/lights\/light-booth.json"
  ],
  "mtl_filenames": [
    ".\/materials\/face-type-b.dat"
  ],
  "n_max_faces": -1,
  "overwrite_bg_normal": true,
  "overwrite_eyeball_normal": true,
  "post_bg_blur_width": 0,
  "post_bg_color": [
    9.9999999747524271e-07,
    9.9998999303352321e-07,
    9.9998999303352321e-07
  ],
  "post_bg_color2": [
    9.9999999747524271e-07,
    9.9998999303352321e-07,
    9.9998999303352321e-07
  ],
  "post_bg_inpaint": false,
  "post_bg_mode": "ORIGINAL",
  "post_bg_org_alpha": 1,
  "post_bg_projshadow_blend_mode": "SCREEN",
  "post_bg_projshadow_enable_alpha_channel": true,
  "post_bg_projshadow_indep_blend": false,
  "post_bg_projshadow_intensity": 1,
  "post_bg_projshadow_onoff": false,
  "post_bg_projshadow_scale": [
    1,
    1
  ],
  "post_bg_projshadow_scale_by_face": false,
  "post_bg_s_tone_scale": 10,
  "post_bg_tex_alpha": 1,
  "post_bg_tex_blend_mode": "SCREEN",
  "post_bg_tex_scale": 1,
  "post_bg_tex_trans": [
    0,
    0
  ],
  "post_bg_texname": "",
  "post_bg_z_offset": 200,
  "post_dropshadow_blur_width": 0.0099999997764825821,
  "post_dropshadow_color": [
    0,
    0,
    0
  ],
  "post_dropshadow_intensity": 0.5,
  "post_exposure": 1,
  "post_exposure_offset": 0,
  "post_fg_tex_alpha": 1,
  "post_fg_tex_blend_mode": "NORMAL",
  "post_fg_tex_scale": 1,
  "post_fg_tex_trans": [
    0,
    0
  ],
  "post_fg_texname": "textures\/StudioLight_Overlay_Portrait.png",
  "post_grayscale": false,
  "post_tonemap_mode": "LINEAR",
  "post_use_dropshadow": false,
  "projshadow_blend_mode": "NORMAL",
  "projshadow_buffer_range": 1,
  "projshadow_color": [
    0.5,
    0.49999499320983887,
    0.49999499320983887
  ],
  "projshadow_enable_alpha_channel": false,
  "projshadow_ext_scale": 1,
  "projshadow_ext_trans_mode": false,
  "projshadow_fit_to_image": false,
  "projshadow_ignore_ext_move": false,
  "projshadow_intensity": 1,
  "projshadow_mono_inversion": false,
  "projshadow_repeat": false,
  "projshadow_repeat_flip": false,
  "projshadow_scale": [
    1,
    1
  ],
  "projshadow_scale_by_face": false,
  "projshadow_shadow_mode": false,
  "projshadow_texname": "",
  "projshadow_trans": [
    0,
    0,
    0
  ],
  "projshadow_two_sided": false,
  "projshadow_yaw_pitch_roll": [
    0,
    0,
    0
  ],
  "pupil_radius_scale": 2.5999999046325684,
  "relative_light": true,
  "rigid_eyeball_normal": true,
  "screen_width": 1024,
  "shading_grayscale": false,
  "shading_region_thld": 0.004999999888241291,
  "softshadow_blur_width": 0.11000000685453415,
  "softshadow_buffer_range": 0.5,
  "softshadow_intensity": 0.25,
  "softshadow_ray_offset": 0.10000000149011612,
  "ssss_quality": 0,
  "ssss_width": 0.059999998658895493,
  "use_ambient": true,
  "use_bg_color_temp": false,
  "use_bg_s_tone": false,
  "use_foreground": false,
  "use_projshadow": false,
  "use_softshadow": true,
  "use_ssss": false
}
