{
"rollie/net_predict.xml":"20230220213100",
"simollie/uicc_config.xml":"20210607215501",
"rollie/metro_map.xml":"20230511143510",
"rollie/cellular_map_config.xml":"20220719112616",
"rollie/high_temperature.xml":"20220725090400",
"rollie/scene_map_cell_info_crowdsourcing.xml":"20220809151521",
"rollie/highSpeedParameters.xml":"20230511143510",
"dollie/HcConfig.xml":"20220914102140",
"dollie/SmartRxConfig.xml":"20221029142235",
"dollie/CommunicateApp.xml":"20230104222655",
"dollie/SwitchApp.xml":"20230112160355",
"dollie/VpnApp.xml":"20230301155155",
"dollie/CardDropCureConfig.xml":"20230331114008",
"dollie/SmartLLMConfig.xml":"20230413165721"
}
