{
  "support": 1,
  "antennaAngle": [[-30,-26],[-30,-26]],
  "batteryValue": {
    "warningValue": 5,
    "unavailableValue": 0
  },
  "satelliteCfg": {
    "searchTimer": 20,
    "acqTimer": 6,
    "receShortAcqTimer": 9,
    "receLongAcqTimer": 28,
    "foldTips": 0
  },
  "capabilityParam": {
    "obtainParamChanType": 1,
    "txToRxPolicy": 2,
    "txToRxDelayTime": 800,
	"ppsHoldBaseTime": 3500
  },
  "testConfig": {
    "searchMode": 0,
    "txFreqOffset": 0,
    "maxPwrLevelSend": 0,
    "supportAuth": 0,
    "encrypIndication": 0,
    "periodSendTest": {
    "sendCnt": 0,
    "interval": 2000
    }
  }
}