#,version,,,,,,,,,,,,,,,,,,,,,,,,,,,,,,,,,,,,,,,,,,,,,,,,,,,,,,,,
2023,3,6,1,,,,,,,,,,,,,,,,,,,,,,,,,,,,,,,,,,,,,,,,,,,,,,,,,,,,,,
#,row_col_num,,,,,,,,,,,,,,,,,,,,,,,,,,,,,,,,,,,,,,,,,,,,,,,,,,,,,,,,
40,18,,,,,,,,,,,,,,,,,,,,,,,,,,,,,,,,,,,,,,,,,,,,,,,,,,,,,,,,
#,noise,,,,,,,,,,,,,,,,,,,,,,,,,,,,,,,,,,,,,,,,,,,,,,,,,,,,,,,,
-500,500,,,,,,,,,,,,,,,,,,,,,,,,,,,,,,,,,,,,,,,,,,,,,,,,,,,,,,,,
#,raw_max,,,,,,,,,,,,,,,,,,,,,,,,,,,,,,,,,,,,,,,,,,,,,,,,,,,,,,,,
24136,24409,24312,24580,24237,24465,23895,24427,24404,24480,24147,24490,24180,24355,24283,24247,24090,24257,,,,,,,,,,,,,,,,,,,,,,,,,,,,,,,,,,,,,,,,
23423,24113,23775,24097,24131,23803,23778,24176,23397,23456,24074,23869,23776,23911,23992,23841,23803,23504,,,,,,,,,,,,,,,,,,,,,,,,,,,,,,,,,,,,,,,,
24093,23936,23944,23983,23926,23928,23945,23929,24086,23943,23917,23942,23948,23946,23951,23947,23926,23899,,,,,,,,,,,,,,,,,,,,,,,,,,,,,,,,,,,,,,,,
24149,24145,24034,24057,24048,24080,24114,24101,24080,24034,23997,24015,24030,24025,24027,24017,24015,24012,,,,,,,,,,,,,,,,,,,,,,,,,,,,,,,,,,,,,,,,
24132,24005,24028,23996,24013,24004,24028,24004,24017,24024,23993,24005,24018,24012,24009,24010,24017,24013,,,,,,,,,,,,,,,,,,,,,,,,,,,,,,,,,,,,,,,,
24214,24091,24113,24073,24096,24086,24108,24082,24094,24100,24076,24086,24096,24090,24081,24087,24089,24100,,,,,,,,,,,,,,,,,,,,,,,,,,,,,,,,,,,,,,,,
24223,24105,24121,24101,24118,24113,24130,24108,24114,24121,24094,24104,24121,24108,24108,24116,24107,24121,,,,,,,,,,,,,,,,,,,,,,,,,,,,,,,,,,,,,,,,
24203,24098,24120,24092,24107,24098,24113,24089,24099,24109,24082,24095,24105,24098,24105,24103,24099,24102,,,,,,,,,,,,,,,,,,,,,,,,,,,,,,,,,,,,,,,,
24207,24108,24126,24095,24119,24110,24129,24103,24108,24114,24090,24107,24114,24101,24102,24101,24115,24107,,,,,,,,,,,,,,,,,,,,,,,,,,,,,,,,,,,,,,,,
24248,24154,24175,24149,24160,24162,24182,24156,24167,24164,24136,24143,24157,24154,24149,24141,24150,24172,,,,,,,,,,,,,,,,,,,,,,,,,,,,,,,,,,,,,,,,
24132,24046,24064,24046,24062,24057,24069,24047,24060,24058,24028,24045,24051,24043,24039,24036,24045,24061,,,,,,,,,,,,,,,,,,,,,,,,,,,,,,,,,,,,,,,,
24115,24044,24066,24038,24048,24046,24065,24036,24071,24044,24019,24038,24043,24033,24029,24037,24047,24063,,,,,,,,,,,,,,,,,,,,,,,,,,,,,,,,,,,,,,,,
24148,24100,24109,24087,24094,24098,24118,24084,24094,24088,24070,24082,24084,24081,24081,24085,24094,24124,,,,,,,,,,,,,,,,,,,,,,,,,,,,,,,,,,,,,,,,
24065,24004,24031,24003,24016,24019,24033,24003,24015,24022,23998,24007,24013,24003,24017,24018,24020,24052,,,,,,,,,,,,,,,,,,,,,,,,,,,,,,,,,,,,,,,,
24065,24009,24033,24016,24026,24022,24044,24012,24028,24023,23997,24010,24020,24006,24020,24025,24031,24050,,,,,,,,,,,,,,,,,,,,,,,,,,,,,,,,,,,,,,,,
24030,23967,23989,23975,23989,23982,24006,23985,23994,24000,23980,23988,23995,23993,23997,24000,24006,24023,,,,,,,,,,,,,,,,,,,,,,,,,,,,,,,,,,,,,,,,
23992,23944,23960,23937,23960,23960,23983,23957,23965,23968,23951,23956,23967,23970,23973,23974,23984,23994,,,,,,,,,,,,,,,,,,,,,,,,,,,,,,,,,,,,,,,,
23965,23932,23935,23948,23933,23936,23942,23929,24005,23942,23925,23932,23951,23937,23944,23949,23949,23971,,,,,,,,,,,,,,,,,,,,,,,,,,,,,,,,,,,,,,,,
24022,23988,24000,23977,23999,23989,24007,23984,23996,23996,23975,23994,24003,23998,23997,23998,24012,24018,,,,,,,,,,,,,,,,,,,,,,,,,,,,,,,,,,,,,,,,
24076,24049,24060,24042,24053,24063,24070,24048,24058,24065,24045,24051,24071,24062,24059,24052,24068,24080,,,,,,,,,,,,,,,,,,,,,,,,,,,,,,,,,,,,,,,,
24009,23988,23997,23981,23997,23997,24009,23990,24002,24008,23988,24002,24018,24013,24006,23994,24014,24037,,,,,,,,,,,,,,,,,,,,,,,,,,,,,,,,,,,,,,,,
23899,23880,23887,23954,23882,23886,23928,23869,23991,23900,23873,23880,23897,23886,23885,23885,23905,23932,,,,,,,,,,,,,,,,,,,,,,,,,,,,,,,,,,,,,,,,
23984,23970,23978,23958,23977,23979,23986,23960,23980,23989,23973,23981,23989,23974,23984,23989,24009,24040,,,,,,,,,,,,,,,,,,,,,,,,,,,,,,,,,,,,,,,,
23907,23889,23895,23886,23898,23898,23907,23884,23898,23903,23886,23891,23903,23904,23915,23914,23926,23949,,,,,,,,,,,,,,,,,,,,,,,,,,,,,,,,,,,,,,,,
23881,23868,23880,23856,23865,23871,23882,23858,23865,23874,23857,23870,23878,23873,23882,23882,23900,23926,,,,,,,,,,,,,,,,,,,,,,,,,,,,,,,,,,,,,,,,
23970,23959,23975,23956,23966,23972,23979,23958,23965,23983,23959,23979,23991,23980,23989,23994,24003,24028,,,,,,,,,,,,,,,,,,,,,,,,,,,,,,,,,,,,,,,,
23891,23889,23901,23876,23889,23886,23910,23883,23891,23902,23878,23898,23916,23907,23911,23912,23931,23954,,,,,,,,,,,,,,,,,,,,,,,,,,,,,,,,,,,,,,,,
23922,23910,23922,23899,23921,23921,23933,23907,23921,23925,23904,23925,23929,23930,23931,23936,23966,23985,,,,,,,,,,,,,,,,,,,,,,,,,,,,,,,,,,,,,,,,
23784,23771,23784,23760,23779,23778,23790,23764,23785,23785,23764,23778,23789,23788,23794,23805,23823,23839,,,,,,,,,,,,,,,,,,,,,,,,,,,,,,,,,,,,,,,,
23816,23818,23827,23804,23820,23820,23828,23810,23823,23827,23808,23819,23843,23836,23842,23849,23855,23881,,,,,,,,,,,,,,,,,,,,,,,,,,,,,,,,,,,,,,,,
23929,23940,23942,23925,23933,23931,23948,23925,23946,23944,23929,23945,23955,23955,23956,23960,23971,23996,,,,,,,,,,,,,,,,,,,,,,,,,,,,,,,,,,,,,,,,
23890,23899,23904,23886,23892,23890,23904,23885,23896,23899,23883,23894,23908,23903,23908,23905,23911,23941,,,,,,,,,,,,,,,,,,,,,,,,,,,,,,,,,,,,,,,,
23864,23864,23873,23850,23863,23866,23882,23851,23870,23876,23922,23868,23886,23873,23880,23869,23881,23924,,,,,,,,,,,,,,,,,,,,,,,,,,,,,,,,,,,,,,,,
23778,23780,23781,23771,23784,23782,23790,23767,23781,23799,23775,23787,23797,23786,23789,23790,23810,23849,,,,,,,,,,,,,,,,,,,,,,,,,,,,,,,,,,,,,,,,
23793,23809,23799,23786,23803,23800,23805,23789,23813,23817,23798,23812,23814,23794,23803,23813,23825,23871,,,,,,,,,,,,,,,,,,,,,,,,,,,,,,,,,,,,,,,,
23716,23723,23723,23706,23714,23720,23725,23713,23739,23746,23725,23726,23732,23715,23718,23731,23747,23789,,,,,,,,,,,,,,,,,,,,,,,,,,,,,,,,,,,,,,,,
23807,23816,23818,23797,23815,23813,23825,23811,23829,23829,23900,23876,23922,23892,23827,23828,23840,23894,,,,,,,,,,,,,,,,,,,,,,,,,,,,,,,,,,,,,,,,
23684,23722,23718,23699,23717,23728,23745,23722,23735,23745,23726,23726,23734,23726,23734,23730,23756,23774,,,,,,,,,,,,,,,,,,,,,,,,,,,,,,,,,,,,,,,,
23483,23867,23859,23842,23863,23875,23894,23870,23887,23892,23949,23872,23875,23857,23869,23881,23887,23437,,,,,,,,,,,,,,,,,,,,,,,,,,,,,,,,,,,,,,,,
23673,23781,23851,23832,23827,23870,23875,23846,23845,23852,24218,23801,23785,23765,23745,23894,23698,23510,,,,,,,,,,,,,,,,,,,,,,,,,,,,,,,,,,,,,,,,
#,raw_min,,,,,,,,,,,,,,,,,,,,,,,,,,,,,,,,,,,,,,,,,,,,,,,,,,,,,,,,
14136,14409,14312,14580,14237,14465,13895,14427,14404,14480,14147,14490,14180,14355,14283,14247,14090,14257,,,,,,,,,,,,,,,,,,,,,,,,,,,,,,,,,,,,,,,,
13423,14113,13775,14097,14131,13803,13778,14176,13397,13456,14074,13869,13776,13911,13992,13841,13803,13504,,,,,,,,,,,,,,,,,,,,,,,,,,,,,,,,,,,,,,,,
14093,13936,13944,13983,13926,13928,13945,13929,14086,13943,13917,13942,13948,13946,13951,13947,13926,13899,,,,,,,,,,,,,,,,,,,,,,,,,,,,,,,,,,,,,,,,
14149,14145,14034,14057,14048,14080,14114,14101,14080,14034,13997,14015,14030,14025,14027,14017,14015,14012,,,,,,,,,,,,,,,,,,,,,,,,,,,,,,,,,,,,,,,,
14132,14005,14028,13996,14013,14004,14028,14004,14017,14024,13993,14005,14018,14012,14009,14010,14017,14013,,,,,,,,,,,,,,,,,,,,,,,,,,,,,,,,,,,,,,,,
14214,14091,14113,14073,14096,14086,14108,14082,14094,14100,14076,14086,14096,14090,14081,14087,14089,14100,,,,,,,,,,,,,,,,,,,,,,,,,,,,,,,,,,,,,,,,
14223,14105,14121,14101,14118,14113,14130,14108,14114,14121,14094,14104,14121,14108,14108,14116,14107,14121,,,,,,,,,,,,,,,,,,,,,,,,,,,,,,,,,,,,,,,,
14203,14098,14120,14092,14107,14098,14113,14089,14099,14109,14082,14095,14105,14098,14105,14103,14099,14102,,,,,,,,,,,,,,,,,,,,,,,,,,,,,,,,,,,,,,,,
14207,14108,14126,14095,14119,14110,14129,14103,14108,14114,14090,14107,14114,14101,14102,14101,14115,14107,,,,,,,,,,,,,,,,,,,,,,,,,,,,,,,,,,,,,,,,
14248,14154,14175,14149,14160,14162,14182,14156,14167,14164,14136,14143,14157,14154,14149,14141,14150,14172,,,,,,,,,,,,,,,,,,,,,,,,,,,,,,,,,,,,,,,,
14132,14046,14064,14046,14062,14057,14069,14047,14060,14058,14028,14045,14051,14043,14039,14036,14045,14061,,,,,,,,,,,,,,,,,,,,,,,,,,,,,,,,,,,,,,,,
14115,14044,14066,14038,14048,14046,14065,14036,14071,14044,14019,14038,14043,14033,14029,14037,14047,14063,,,,,,,,,,,,,,,,,,,,,,,,,,,,,,,,,,,,,,,,
14148,14100,14109,14087,14094,14098,14118,14084,14094,14088,14070,14082,14084,14081,14081,14085,14094,14124,,,,,,,,,,,,,,,,,,,,,,,,,,,,,,,,,,,,,,,,
14065,14004,14031,14003,14016,14019,14033,14003,14015,14022,13998,14007,14013,14003,14017,14018,14020,14052,,,,,,,,,,,,,,,,,,,,,,,,,,,,,,,,,,,,,,,,
14065,14009,14033,14016,14026,14022,14044,14012,14028,14023,13997,14010,14020,14006,14020,14025,14031,14050,,,,,,,,,,,,,,,,,,,,,,,,,,,,,,,,,,,,,,,,
14030,13967,13989,13975,13989,13982,14006,13985,13994,14000,13980,13988,13995,13993,13997,14000,14006,14023,,,,,,,,,,,,,,,,,,,,,,,,,,,,,,,,,,,,,,,,
13992,13944,13960,13937,13960,13960,13983,13957,13965,13968,13951,13956,13967,13970,13973,13974,13984,13994,,,,,,,,,,,,,,,,,,,,,,,,,,,,,,,,,,,,,,,,
13965,13932,13935,13948,13933,13936,13942,13929,14005,13942,13925,13932,13951,13937,13944,13949,13949,13971,,,,,,,,,,,,,,,,,,,,,,,,,,,,,,,,,,,,,,,,
14022,13988,14000,13977,13999,13989,14007,13984,13996,13996,13975,13994,14003,13998,13997,13998,14012,14018,,,,,,,,,,,,,,,,,,,,,,,,,,,,,,,,,,,,,,,,
14076,14049,14060,14042,14053,14063,14070,14048,14058,14065,14045,14051,14071,14062,14059,14052,14068,14080,,,,,,,,,,,,,,,,,,,,,,,,,,,,,,,,,,,,,,,,
14009,13988,13997,13981,13997,13997,14009,13990,14002,14008,13988,14002,14018,14013,14006,13994,14014,14037,,,,,,,,,,,,,,,,,,,,,,,,,,,,,,,,,,,,,,,,
13899,13880,13887,13954,13882,13886,13928,13869,13991,13900,13873,13880,13897,13886,13885,13885,13905,13932,,,,,,,,,,,,,,,,,,,,,,,,,,,,,,,,,,,,,,,,
13984,13970,13978,13958,13977,13979,13986,13960,13980,13989,13973,13981,13989,13974,13984,13989,14009,14040,,,,,,,,,,,,,,,,,,,,,,,,,,,,,,,,,,,,,,,,
13907,13889,13895,13886,13898,13898,13907,13884,13898,13903,13886,13891,13903,13904,13915,13914,13926,13949,,,,,,,,,,,,,,,,,,,,,,,,,,,,,,,,,,,,,,,,
13881,13868,13880,13856,13865,13871,13882,13858,13865,13874,13857,13870,13878,13873,13882,13882,13900,13926,,,,,,,,,,,,,,,,,,,,,,,,,,,,,,,,,,,,,,,,
13970,13959,13975,13956,13966,13972,13979,13958,13965,13983,13959,13979,13991,13980,13989,13994,14003,14028,,,,,,,,,,,,,,,,,,,,,,,,,,,,,,,,,,,,,,,,
13891,13889,13901,13876,13889,13886,13910,13883,13891,13902,13878,13898,13916,13907,13911,13912,13931,13954,,,,,,,,,,,,,,,,,,,,,,,,,,,,,,,,,,,,,,,,
13922,13910,13922,13899,13921,13921,13933,13907,13921,13925,13904,13925,13929,13930,13931,13936,13966,13985,,,,,,,,,,,,,,,,,,,,,,,,,,,,,,,,,,,,,,,,
13784,13771,13784,13760,13779,13778,13790,13764,13785,13785,13764,13778,13789,13788,13794,13805,13823,13839,,,,,,,,,,,,,,,,,,,,,,,,,,,,,,,,,,,,,,,,
13816,13818,13827,13804,13820,13820,13828,13810,13823,13827,13808,13819,13843,13836,13842,13849,13855,13881,,,,,,,,,,,,,,,,,,,,,,,,,,,,,,,,,,,,,,,,
13929,13940,13942,13925,13933,13931,13948,13925,13946,13944,13929,13945,13955,13955,13956,13960,13971,13996,,,,,,,,,,,,,,,,,,,,,,,,,,,,,,,,,,,,,,,,
13890,13899,13904,13886,13892,13890,13904,13885,13896,13899,13883,13894,13908,13903,13908,13905,13911,13941,,,,,,,,,,,,,,,,,,,,,,,,,,,,,,,,,,,,,,,,
13864,13864,13873,13850,13863,13866,13882,13851,13870,13876,13922,13868,13886,13873,13880,13869,13881,13924,,,,,,,,,,,,,,,,,,,,,,,,,,,,,,,,,,,,,,,,
13778,13780,13781,13771,13784,13782,13790,13767,13781,13799,13775,13787,13797,13786,13789,13790,13810,13849,,,,,,,,,,,,,,,,,,,,,,,,,,,,,,,,,,,,,,,,
13793,13809,13799,13786,13803,13800,13805,13789,13813,13817,13798,13812,13814,13794,13803,13813,13825,13871,,,,,,,,,,,,,,,,,,,,,,,,,,,,,,,,,,,,,,,,
13716,13723,13723,13706,13714,13720,13725,13713,13739,13746,13725,13726,13732,13715,13718,13731,13747,13789,,,,,,,,,,,,,,,,,,,,,,,,,,,,,,,,,,,,,,,,
13807,13816,13818,13797,13815,13813,13825,13811,13829,13829,13900,13876,13922,13892,13827,13828,13840,13894,,,,,,,,,,,,,,,,,,,,,,,,,,,,,,,,,,,,,,,,
13684,13722,13718,13699,13717,13728,13745,13722,13735,13745,13726,13726,13734,13726,13734,13730,13756,13774,,,,,,,,,,,,,,,,,,,,,,,,,,,,,,,,,,,,,,,,
13483,13867,13859,13842,13863,13875,13894,13870,13887,13892,13949,13872,13875,13857,13869,13881,13887,13437,,,,,,,,,,,,,,,,,,,,,,,,,,,,,,,,,,,,,,,,
13673,13781,13851,13832,13827,13870,13875,13846,13845,13852,14218,13801,13785,13765,13745,13894,13698,13510,,,,,,,,,,,,,,,,,,,,,,,,,,,,,,,,,,,,,,,,
#,raw_row_delta_max,,,,,,,,,,,,,,,,,,,,,,,,,,,,,,,,,,,,,,,,,,,,,,,,,,,,,,,,
5000,1500,1000,1000,1000,1000,1000,1000,1300,1300,1000,1000,1000,1000,1000,1000,1500,5000,,,,,,,,,,,,,,,,,,,,,,,,,,,,,,,,,,,,,,,,
2500,500,550,500,500,500,550,500,1500,1500,500,500,550,500,500,500,500,2500,,,,,,,,,,,,,,,,,,,,,,,,,,,,,,,,,,,,,,,,
500,1000,500,500,500,500,500,500,500,500,500,500,500,500,500,500,500,500,,,,,,,,,,,,,,,,,,,,,,,,,,,,,,,,,,,,,,,,
500,500,500,500,500,500,500,500,500,500,500,500,500,500,500,500,500,500,,,,,,,,,,,,,,,,,,,,,,,,,,,,,,,,,,,,,,,,
500,500,500,500,500,500,500,500,500,500,500,500,500,500,500,500,500,500,,,,,,,,,,,,,,,,,,,,,,,,,,,,,,,,,,,,,,,,
500,500,500,500,500,500,500,500,500,500,500,500,500,500,500,500,500,500,,,,,,,,,,,,,,,,,,,,,,,,,,,,,,,,,,,,,,,,
500,500,500,500,500,500,500,500,500,500,500,500,500,500,500,500,500,500,,,,,,,,,,,,,,,,,,,,,,,,,,,,,,,,,,,,,,,,
500,500,500,500,500,500,500,500,500,500,500,500,500,500,500,500,500,500,,,,,,,,,,,,,,,,,,,,,,,,,,,,,,,,,,,,,,,,
500,500,500,500,500,500,500,500,500,500,500,500,500,500,500,500,500,500,,,,,,,,,,,,,,,,,,,,,,,,,,,,,,,,,,,,,,,,
500,500,500,500,500,500,500,500,500,500,500,500,500,500,500,500,500,500,,,,,,,,,,,,,,,,,,,,,,,,,,,,,,,,,,,,,,,,
500,500,500,500,500,500,500,500,500,500,500,500,500,500,500,500,500,500,,,,,,,,,,,,,,,,,,,,,,,,,,,,,,,,,,,,,,,,
500,500,500,500,500,500,500,500,500,500,500,500,500,500,500,500,500,500,,,,,,,,,,,,,,,,,,,,,,,,,,,,,,,,,,,,,,,,
500,500,500,500,500,500,500,500,500,500,500,500,500,500,500,500,500,500,,,,,,,,,,,,,,,,,,,,,,,,,,,,,,,,,,,,,,,,
500,500,500,500,500,500,500,500,500,500,500,500,500,500,500,500,500,500,,,,,,,,,,,,,,,,,,,,,,,,,,,,,,,,,,,,,,,,
500,500,500,500,500,500,500,500,500,500,500,500,500,500,500,500,500,500,,,,,,,,,,,,,,,,,,,,,,,,,,,,,,,,,,,,,,,,
500,500,500,500,500,500,500,500,500,500,500,500,500,500,500,500,500,500,,,,,,,,,,,,,,,,,,,,,,,,,,,,,,,,,,,,,,,,
500,500,500,500,500,500,500,500,500,500,500,500,500,500,500,500,500,500,,,,,,,,,,,,,,,,,,,,,,,,,,,,,,,,,,,,,,,,
500,500,500,500,500,500,500,500,500,500,500,500,500,500,500,500,500,500,,,,,,,,,,,,,,,,,,,,,,,,,,,,,,,,,,,,,,,,
500,500,500,500,500,500,500,500,500,500,500,500,500,500,500,500,500,500,,,,,,,,,,,,,,,,,,,,,,,,,,,,,,,,,,,,,,,,
500,500,500,500,500,500,500,500,500,500,500,500,500,500,500,500,500,500,,,,,,,,,,,,,,,,,,,,,,,,,,,,,,,,,,,,,,,,
500,500,500,500,500,500,500,500,500,500,500,500,500,500,500,500,500,500,,,,,,,,,,,,,,,,,,,,,,,,,,,,,,,,,,,,,,,,
500,500,500,500,500,500,500,500,500,500,500,500,500,500,500,500,500,500,,,,,,,,,,,,,,,,,,,,,,,,,,,,,,,,,,,,,,,,
500,500,500,500,500,500,500,500,500,500,500,500,500,500,500,500,500,500,,,,,,,,,,,,,,,,,,,,,,,,,,,,,,,,,,,,,,,,
500,500,500,500,500,500,500,500,500,500,500,500,500,500,500,500,500,500,,,,,,,,,,,,,,,,,,,,,,,,,,,,,,,,,,,,,,,,
500,500,500,500,500,500,500,500,500,500,500,500,500,500,500,500,500,500,,,,,,,,,,,,,,,,,,,,,,,,,,,,,,,,,,,,,,,,
500,500,500,500,500,500,500,500,500,500,500,500,500,500,500,500,500,500,,,,,,,,,,,,,,,,,,,,,,,,,,,,,,,,,,,,,,,,
500,500,500,500,500,500,500,500,500,500,500,500,500,500,500,500,500,500,,,,,,,,,,,,,,,,,,,,,,,,,,,,,,,,,,,,,,,,
500,500,500,500,500,500,500,500,500,500,500,500,500,500,500,500,500,500,,,,,,,,,,,,,,,,,,,,,,,,,,,,,,,,,,,,,,,,
500,500,500,500,500,500,500,500,500,500,500,500,500,500,500,500,500,500,,,,,,,,,,,,,,,,,,,,,,,,,,,,,,,,,,,,,,,,
500,500,500,500,500,500,500,500,500,500,500,500,500,500,500,500,500,500,,,,,,,,,,,,,,,,,,,,,,,,,,,,,,,,,,,,,,,,
500,500,500,500,500,500,500,500,500,500,500,500,500,500,500,500,500,500,,,,,,,,,,,,,,,,,,,,,,,,,,,,,,,,,,,,,,,,
500,500,500,500,500,500,500,500,500,500,500,500,500,500,500,500,500,500,,,,,,,,,,,,,,,,,,,,,,,,,,,,,,,,,,,,,,,,
500,500,500,500,500,500,500,500,500,500,500,500,500,500,500,500,500,500,,,,,,,,,,,,,,,,,,,,,,,,,,,,,,,,,,,,,,,,
500,500,500,500,500,500,500,500,500,500,500,500,500,500,500,500,500,500,,,,,,,,,,,,,,,,,,,,,,,,,,,,,,,,,,,,,,,,
500,500,500,500,500,500,500,500,500,500,500,500,500,500,500,500,500,500,,,,,,,,,,,,,,,,,,,,,,,,,,,,,,,,,,,,,,,,
500,500,500,500,500,500,500,500,500,500,500,500,500,500,500,500,500,500,,,,,,,,,,,,,,,,,,,,,,,,,,,,,,,,,,,,,,,,
500,500,500,500,500,500,500,500,500,500,500,500,500,500,500,500,500,500,,,,,,,,,,,,,,,,,,,,,,,,,,,,,,,,,,,,,,,,
2500,500,500,500,500,500,500,500,500,500,1000,500,500,500,500,500,500,2500,,,,,,,,,,,,,,,,,,,,,,,,,,,,,,,,,,,,,,,,
5000,800,800,800,800,800,800,800,800,800,1000,800,800,800,800,800,800,5000,,,,,,,,,,,,,,,,,,,,,,,,,,,,,,,,,,,,,,,,
#,raw_row_delta_min,,,,,,,,,,,,,,,,,,,,,,,,,,,,,,,,,,,,,,,,,,,,,,,,,,,,,,,,
-5000,-1500,-1500,-1500,-1000,-1500,-1000,-1000,-3000,-3000,-1000,-1500,-1500,-1500,-1500,-1500,-1500,-5000,,,,,,,,,,,,,,,,,,,,,,,,,,,,,,,,,,,,,,,,
-2500,-500,-500,-500,-500,-500,-500,-500,-1300,-1300,-500,-500,-500,-500,-500,-500,-500,-2500,,,,,,,,,,,,,,,,,,,,,,,,,,,,,,,,,,,,,,,,
-500,-500,-500,-500,-500,-500,-500,-500,-500,-500,-500,-500,-500,-500,-500,-500,-500,-500,,,,,,,,,,,,,,,,,,,,,,,,,,,,,,,,,,,,,,,,
-500,-500,-500,-500,-500,-500,-500,-500,-500,-500,-500,-500,-500,-500,-500,-500,-500,-500,,,,,,,,,,,,,,,,,,,,,,,,,,,,,,,,,,,,,,,,
-500,-500,-500,-500,-500,-500,-500,-500,-500,-500,-500,-500,-500,-500,-500,-500,-500,-500,,,,,,,,,,,,,,,,,,,,,,,,,,,,,,,,,,,,,,,,
-500,-500,-500,-500,-500,-500,-500,-500,-500,-500,-500,-500,-500,-500,-500,-500,-500,-500,,,,,,,,,,,,,,,,,,,,,,,,,,,,,,,,,,,,,,,,
-500,-500,-500,-500,-500,-500,-500,-500,-500,-500,-500,-500,-500,-500,-500,-500,-500,-500,,,,,,,,,,,,,,,,,,,,,,,,,,,,,,,,,,,,,,,,
-500,-500,-500,-500,-500,-500,-500,-500,-500,-500,-500,-500,-500,-500,-500,-500,-500,-500,,,,,,,,,,,,,,,,,,,,,,,,,,,,,,,,,,,,,,,,
-500,-500,-500,-500,-500,-500,-500,-500,-500,-500,-500,-500,-500,-500,-500,-500,-500,-500,,,,,,,,,,,,,,,,,,,,,,,,,,,,,,,,,,,,,,,,
-500,-500,-500,-500,-500,-500,-500,-500,-500,-500,-500,-500,-500,-500,-500,-500,-500,-500,,,,,,,,,,,,,,,,,,,,,,,,,,,,,,,,,,,,,,,,
-500,-500,-500,-500,-500,-500,-500,-500,-500,-500,-500,-500,-500,-500,-500,-500,-500,-500,,,,,,,,,,,,,,,,,,,,,,,,,,,,,,,,,,,,,,,,
-500,-500,-500,-500,-500,-500,-500,-500,-500,-500,-500,-500,-500,-500,-500,-500,-500,-500,,,,,,,,,,,,,,,,,,,,,,,,,,,,,,,,,,,,,,,,
-500,-500,-500,-500,-500,-500,-500,-500,-500,-500,-500,-500,-500,-500,-500,-500,-500,-500,,,,,,,,,,,,,,,,,,,,,,,,,,,,,,,,,,,,,,,,
-500,-500,-500,-500,-500,-500,-500,-500,-500,-500,-500,-500,-500,-500,-500,-500,-500,-500,,,,,,,,,,,,,,,,,,,,,,,,,,,,,,,,,,,,,,,,
-500,-500,-500,-500,-500,-500,-500,-500,-500,-500,-500,-500,-500,-500,-500,-500,-500,-500,,,,,,,,,,,,,,,,,,,,,,,,,,,,,,,,,,,,,,,,
-500,-500,-500,-500,-500,-500,-500,-500,-500,-500,-500,-500,-500,-500,-500,-500,-500,-500,,,,,,,,,,,,,,,,,,,,,,,,,,,,,,,,,,,,,,,,
-500,-500,-500,-500,-500,-500,-500,-500,-500,-500,-500,-500,-500,-500,-500,-500,-500,-500,,,,,,,,,,,,,,,,,,,,,,,,,,,,,,,,,,,,,,,,
-500,-500,-500,-500,-500,-500,-500,-500,-500,-500,-500,-500,-500,-500,-500,-500,-500,-500,,,,,,,,,,,,,,,,,,,,,,,,,,,,,,,,,,,,,,,,
-500,-500,-500,-500,-500,-500,-500,-500,-500,-500,-500,-500,-500,-500,-500,-500,-500,-500,,,,,,,,,,,,,,,,,,,,,,,,,,,,,,,,,,,,,,,,
-500,-500,-500,-500,-500,-500,-500,-500,-500,-500,-500,-500,-500,-500,-500,-500,-500,-500,,,,,,,,,,,,,,,,,,,,,,,,,,,,,,,,,,,,,,,,
-500,-500,-500,-500,-500,-500,-500,-500,-500,-500,-500,-500,-500,-500,-500,-500,-500,-500,,,,,,,,,,,,,,,,,,,,,,,,,,,,,,,,,,,,,,,,
-500,-500,-500,-500,-500,-500,-500,-500,-500,-500,-500,-500,-500,-500,-500,-500,-500,-500,,,,,,,,,,,,,,,,,,,,,,,,,,,,,,,,,,,,,,,,
-500,-500,-500,-500,-500,-500,-500,-500,-500,-500,-500,-500,-500,-500,-500,-500,-500,-500,,,,,,,,,,,,,,,,,,,,,,,,,,,,,,,,,,,,,,,,
-500,-500,-500,-500,-500,-500,-500,-500,-500,-500,-500,-500,-500,-500,-500,-500,-500,-500,,,,,,,,,,,,,,,,,,,,,,,,,,,,,,,,,,,,,,,,
-500,-500,-500,-500,-500,-500,-500,-500,-500,-500,-500,-500,-500,-500,-500,-500,-500,-500,,,,,,,,,,,,,,,,,,,,,,,,,,,,,,,,,,,,,,,,
-500,-500,-500,-500,-500,-500,-500,-500,-500,-500,-500,-500,-500,-500,-500,-500,-500,-500,,,,,,,,,,,,,,,,,,,,,,,,,,,,,,,,,,,,,,,,
-500,-500,-500,-500,-500,-500,-500,-500,-500,-500,-500,-500,-500,-500,-500,-500,-500,-500,,,,,,,,,,,,,,,,,,,,,,,,,,,,,,,,,,,,,,,,
-500,-500,-500,-500,-500,-500,-500,-500,-500,-500,-500,-500,-500,-500,-500,-500,-500,-500,,,,,,,,,,,,,,,,,,,,,,,,,,,,,,,,,,,,,,,,
-500,-500,-500,-500,-500,-500,-500,-500,-500,-500,-500,-500,-500,-500,-500,-500,-500,-500,,,,,,,,,,,,,,,,,,,,,,,,,,,,,,,,,,,,,,,,
-500,-500,-500,-500,-500,-500,-500,-500,-500,-500,-500,-500,-500,-500,-500,-500,-500,-500,,,,,,,,,,,,,,,,,,,,,,,,,,,,,,,,,,,,,,,,
-500,-500,-500,-500,-500,-500,-500,-500,-500,-500,-500,-500,-500,-500,-500,-500,-500,-500,,,,,,,,,,,,,,,,,,,,,,,,,,,,,,,,,,,,,,,,
-500,-500,-500,-500,-500,-500,-500,-500,-500,-500,-500,-500,-500,-500,-500,-500,-500,-500,,,,,,,,,,,,,,,,,,,,,,,,,,,,,,,,,,,,,,,,
-500,-500,-500,-500,-500,-500,-500,-500,-500,-500,-500,-500,-500,-500,-500,-500,-500,-500,,,,,,,,,,,,,,,,,,,,,,,,,,,,,,,,,,,,,,,,
-500,-500,-500,-500,-500,-500,-500,-500,-500,-500,-500,-500,-500,-500,-500,-500,-500,-500,,,,,,,,,,,,,,,,,,,,,,,,,,,,,,,,,,,,,,,,
-500,-500,-500,-500,-500,-500,-500,-500,-500,-500,-500,-500,-500,-500,-500,-500,-500,-500,,,,,,,,,,,,,,,,,,,,,,,,,,,,,,,,,,,,,,,,
-500,-500,-500,-500,-500,-500,-500,-500,-500,-500,-500,-500,-500,-500,-500,-500,-500,-500,,,,,,,,,,,,,,,,,,,,,,,,,,,,,,,,,,,,,,,,
-500,-500,-500,-500,-500,-500,-500,-500,-500,-500,-500,-500,-500,-500,-500,-500,-500,-500,,,,,,,,,,,,,,,,,,,,,,,,,,,,,,,,,,,,,,,,
-2500,-500,-500,-500,-500,-500,-500,-500,-500,-500,-500,-500,-500,-500,-500,-500,-500,-2500,,,,,,,,,,,,,,,,,,,,,,,,,,,,,,,,,,,,,,,,
-5000,-1500,-800,-800,-800,-800,-800,-800,-800,-800,-800,-800,-800,-800,-800,-800,-1500,-5000,,,,,,,,,,,,,,,,,,,,,,,,,,,,,,,,,,,,,,,,
#,raw_col_delta_max,,,,,,,,,,,,,,,,,,,,,,,,,,,,,,,,,,,,,,,,,,,,,,,,,,,,,,,,
5000,1000,1000,500,1000,500,2000,500,500,1300,1000,500,500,500,500,500,5000,,,,,,,,,,,,,,,,,,,,,,,,,,,,,,,,,,,,,,,,,
2500,500,1000,500,500,500,1500,500,500,2000,500,500,500,500,500,500,1000,,,,,,,,,,,,,,,,,,,,,,,,,,,,,,,,,,,,,,,,,
500,500,500,500,500,500,500,500,500,500,500,500,500,500,500,500,800,,,,,,,,,,,,,,,,,,,,,,,,,,,,,,,,,,,,,,,,,
500,500,500,500,500,500,500,500,500,500,500,500,500,500,500,500,800,,,,,,,,,,,,,,,,,,,,,,,,,,,,,,,,,,,,,,,,,
500,500,500,500,500,500,500,500,500,500,500,500,500,500,500,500,800,,,,,,,,,,,,,,,,,,,,,,,,,,,,,,,,,,,,,,,,,
500,500,500,500,500,500,500,500,500,500,500,500,500,500,500,500,800,,,,,,,,,,,,,,,,,,,,,,,,,,,,,,,,,,,,,,,,,
500,500,500,500,500,500,500,500,500,500,500,500,500,500,500,500,800,,,,,,,,,,,,,,,,,,,,,,,,,,,,,,,,,,,,,,,,,
500,500,500,500,500,500,500,500,500,500,500,500,500,500,500,500,800,,,,,,,,,,,,,,,,,,,,,,,,,,,,,,,,,,,,,,,,,
500,500,500,500,500,500,500,500,500,500,500,500,500,500,500,500,800,,,,,,,,,,,,,,,,,,,,,,,,,,,,,,,,,,,,,,,,,
500,500,500,500,500,500,500,500,500,500,500,500,500,500,500,500,800,,,,,,,,,,,,,,,,,,,,,,,,,,,,,,,,,,,,,,,,,
500,500,500,500,500,500,500,500,500,500,500,500,500,500,500,500,800,,,,,,,,,,,,,,,,,,,,,,,,,,,,,,,,,,,,,,,,,
500,500,500,500,500,500,500,500,500,500,500,500,500,500,500,500,800,,,,,,,,,,,,,,,,,,,,,,,,,,,,,,,,,,,,,,,,,
500,500,500,500,500,500,500,500,500,500,500,500,500,500,500,500,800,,,,,,,,,,,,,,,,,,,,,,,,,,,,,,,,,,,,,,,,,
500,500,500,500,500,500,500,500,500,500,500,500,500,500,500,500,800,,,,,,,,,,,,,,,,,,,,,,,,,,,,,,,,,,,,,,,,,
500,500,500,500,500,500,500,500,500,500,500,500,500,500,500,500,800,,,,,,,,,,,,,,,,,,,,,,,,,,,,,,,,,,,,,,,,,
500,500,500,500,500,500,500,500,500,500,500,500,500,500,500,500,800,,,,,,,,,,,,,,,,,,,,,,,,,,,,,,,,,,,,,,,,,
500,500,500,500,500,500,500,500,500,500,500,500,500,500,500,500,800,,,,,,,,,,,,,,,,,,,,,,,,,,,,,,,,,,,,,,,,,
500,500,500,500,500,500,500,500,500,500,500,500,500,500,500,500,800,,,,,,,,,,,,,,,,,,,,,,,,,,,,,,,,,,,,,,,,,
500,500,500,500,500,500,500,500,500,500,500,500,500,500,500,500,800,,,,,,,,,,,,,,,,,,,,,,,,,,,,,,,,,,,,,,,,,
500,500,500,500,500,500,500,500,500,500,500,500,500,500,500,500,800,,,,,,,,,,,,,,,,,,,,,,,,,,,,,,,,,,,,,,,,,
500,500,500,500,500,500,500,500,500,500,500,500,500,500,500,500,800,,,,,,,,,,,,,,,,,,,,,,,,,,,,,,,,,,,,,,,,,
500,500,500,500,500,500,500,500,500,500,500,500,500,500,500,500,800,,,,,,,,,,,,,,,,,,,,,,,,,,,,,,,,,,,,,,,,,
500,500,500,500,500,500,500,500,500,500,500,500,500,500,500,500,800,,,,,,,,,,,,,,,,,,,,,,,,,,,,,,,,,,,,,,,,,
500,500,500,500,500,500,500,500,500,500,500,500,500,500,500,500,800,,,,,,,,,,,,,,,,,,,,,,,,,,,,,,,,,,,,,,,,,
500,500,500,500,500,500,500,500,500,500,500,500,500,500,500,500,800,,,,,,,,,,,,,,,,,,,,,,,,,,,,,,,,,,,,,,,,,
500,500,500,500,500,500,500,500,500,500,500,500,500,500,500,500,800,,,,,,,,,,,,,,,,,,,,,,,,,,,,,,,,,,,,,,,,,
500,500,500,500,500,500,500,500,500,500,500,500,500,500,500,500,800,,,,,,,,,,,,,,,,,,,,,,,,,,,,,,,,,,,,,,,,,
500,500,500,500,500,500,500,500,500,500,500,500,500,500,500,500,800,,,,,,,,,,,,,,,,,,,,,,,,,,,,,,,,,,,,,,,,,
500,500,500,500,500,500,500,500,500,500,500,500,500,500,500,500,800,,,,,,,,,,,,,,,,,,,,,,,,,,,,,,,,,,,,,,,,,
500,500,500,500,500,500,500,500,500,500,500,500,500,500,500,500,800,,,,,,,,,,,,,,,,,,,,,,,,,,,,,,,,,,,,,,,,,
500,500,500,500,500,500,500,500,500,500,500,500,500,500,500,500,800,,,,,,,,,,,,,,,,,,,,,,,,,,,,,,,,,,,,,,,,,
500,500,500,500,500,500,500,500,500,500,500,500,500,500,500,500,800,,,,,,,,,,,,,,,,,,,,,,,,,,,,,,,,,,,,,,,,,
500,500,500,500,500,500,500,500,500,500,500,500,500,500,500,500,800,,,,,,,,,,,,,,,,,,,,,,,,,,,,,,,,,,,,,,,,,
500,500,500,500,500,500,500,500,500,500,500,500,500,500,500,500,800,,,,,,,,,,,,,,,,,,,,,,,,,,,,,,,,,,,,,,,,,
500,500,500,500,500,500,500,500,500,500,500,500,500,500,500,500,800,,,,,,,,,,,,,,,,,,,,,,,,,,,,,,,,,,,,,,,,,
500,500,500,500,500,500,500,500,500,500,500,500,500,500,500,500,800,,,,,,,,,,,,,,,,,,,,,,,,,,,,,,,,,,,,,,,,,
500,500,500,500,500,500,500,500,500,500,500,500,500,500,500,500,800,,,,,,,,,,,,,,,,,,,,,,,,,,,,,,,,,,,,,,,,,
500,500,500,500,500,500,500,500,500,500,500,500,500,500,500,500,800,,,,,,,,,,,,,,,,,,,,,,,,,,,,,,,,,,,,,,,,,
2000,500,500,500,500,500,500,500,500,500,500,500,500,500,500,500,1000,,,,,,,,,,,,,,,,,,,,,,,,,,,,,,,,,,,,,,,,,
5000,1000,500,500,500,500,500,500,500,1500,500,500,500,500,500,500,5000,,,,,,,,,,,,,,,,,,,,,,,,,,,,,,,,,,,,,,,,,
#,raw_col_delta_min,,,,,,,,,,,,,,,,,,,,,,,,,,,,,,,,,,,,,,,,,,,,,,,,,,,,,,,,
-5000,-500,-500,-1000,-500,-1500,-500,-1300,-500,-1000,-500,-1000,-500,-500,-500,-1000,-5000,,,,,,,,,,,,,,,,,,,,,,,,,,,,,,,,,,,,,,,,,
-1000,-1000,-500,-500,-1000,-500,-500,-2000,-500,-500,-1000,-500,-500,-500,-500,-500,-1000,,,,,,,,,,,,,,,,,,,,,,,,,,,,,,,,,,,,,,,,,
-800,-500,-500,-500,-500,-500,-500,-500,-500,-500,-500,-500,-500,-500,-500,-500,-500,,,,,,,,,,,,,,,,,,,,,,,,,,,,,,,,,,,,,,,,,
-800,-500,-500,-500,-500,-500,-500,-500,-500,-500,-500,-500,-500,-500,-500,-500,-500,,,,,,,,,,,,,,,,,,,,,,,,,,,,,,,,,,,,,,,,,
-800,-500,-500,-500,-500,-500,-500,-500,-500,-500,-500,-500,-500,-500,-500,-500,-500,,,,,,,,,,,,,,,,,,,,,,,,,,,,,,,,,,,,,,,,,
-800,-500,-500,-500,-500,-500,-500,-500,-500,-500,-500,-500,-500,-500,-500,-500,-500,,,,,,,,,,,,,,,,,,,,,,,,,,,,,,,,,,,,,,,,,
-800,-500,-500,-500,-500,-500,-500,-500,-500,-500,-500,-500,-500,-500,-500,-500,-500,,,,,,,,,,,,,,,,,,,,,,,,,,,,,,,,,,,,,,,,,
-800,-500,-500,-500,-500,-500,-500,-500,-500,-500,-500,-500,-500,-500,-500,-500,-500,,,,,,,,,,,,,,,,,,,,,,,,,,,,,,,,,,,,,,,,,
-800,-500,-500,-500,-500,-500,-500,-500,-500,-500,-500,-500,-500,-500,-500,-500,-500,,,,,,,,,,,,,,,,,,,,,,,,,,,,,,,,,,,,,,,,,
-800,-500,-500,-500,-500,-500,-500,-500,-500,-500,-500,-500,-500,-500,-500,-500,-500,,,,,,,,,,,,,,,,,,,,,,,,,,,,,,,,,,,,,,,,,
-800,-500,-500,-500,-500,-500,-500,-500,-500,-500,-500,-500,-500,-500,-500,-500,-500,,,,,,,,,,,,,,,,,,,,,,,,,,,,,,,,,,,,,,,,,
-800,-500,-500,-500,-500,-500,-500,-500,-500,-500,-500,-500,-500,-500,-500,-500,-500,,,,,,,,,,,,,,,,,,,,,,,,,,,,,,,,,,,,,,,,,
-800,-500,-500,-500,-500,-500,-500,-500,-500,-500,-500,-500,-500,-500,-500,-500,-500,,,,,,,,,,,,,,,,,,,,,,,,,,,,,,,,,,,,,,,,,
-800,-500,-500,-500,-500,-500,-500,-500,-500,-500,-500,-500,-500,-500,-500,-500,-500,,,,,,,,,,,,,,,,,,,,,,,,,,,,,,,,,,,,,,,,,
-800,-500,-500,-500,-500,-500,-500,-500,-500,-500,-500,-500,-500,-500,-500,-500,-500,,,,,,,,,,,,,,,,,,,,,,,,,,,,,,,,,,,,,,,,,
-800,-500,-500,-500,-500,-500,-500,-500,-500,-500,-500,-500,-500,-500,-500,-500,-500,,,,,,,,,,,,,,,,,,,,,,,,,,,,,,,,,,,,,,,,,
-800,-500,-500,-500,-500,-500,-500,-500,-500,-500,-500,-500,-500,-500,-500,-500,-500,,,,,,,,,,,,,,,,,,,,,,,,,,,,,,,,,,,,,,,,,
-800,-500,-500,-500,-500,-500,-500,-500,-500,-500,-500,-500,-500,-500,-500,-500,-500,,,,,,,,,,,,,,,,,,,,,,,,,,,,,,,,,,,,,,,,,
-800,-500,-500,-500,-500,-500,-500,-500,-500,-500,-500,-500,-500,-500,-500,-500,-500,,,,,,,,,,,,,,,,,,,,,,,,,,,,,,,,,,,,,,,,,
-800,-500,-500,-500,-500,-500,-500,-500,-500,-500,-500,-500,-500,-500,-500,-500,-500,,,,,,,,,,,,,,,,,,,,,,,,,,,,,,,,,,,,,,,,,
-800,-500,-500,-500,-500,-500,-500,-500,-500,-500,-500,-500,-500,-500,-500,-500,-500,,,,,,,,,,,,,,,,,,,,,,,,,,,,,,,,,,,,,,,,,
-800,-500,-500,-500,-500,-500,-500,-500,-500,-500,-500,-500,-500,-500,-500,-500,-500,,,,,,,,,,,,,,,,,,,,,,,,,,,,,,,,,,,,,,,,,
-800,-500,-500,-500,-500,-500,-500,-500,-500,-500,-500,-500,-500,-500,-500,-500,-500,,,,,,,,,,,,,,,,,,,,,,,,,,,,,,,,,,,,,,,,,
-800,-500,-500,-500,-500,-500,-500,-500,-500,-500,-500,-500,-500,-500,-500,-500,-500,,,,,,,,,,,,,,,,,,,,,,,,,,,,,,,,,,,,,,,,,
-800,-500,-500,-500,-500,-500,-500,-500,-500,-500,-500,-500,-500,-500,-500,-500,-500,,,,,,,,,,,,,,,,,,,,,,,,,,,,,,,,,,,,,,,,,
-800,-500,-500,-500,-500,-500,-500,-500,-500,-500,-500,-500,-500,-500,-500,-500,-500,,,,,,,,,,,,,,,,,,,,,,,,,,,,,,,,,,,,,,,,,
-800,-500,-500,-500,-500,-500,-500,-500,-500,-500,-500,-500,-500,-500,-500,-500,-500,,,,,,,,,,,,,,,,,,,,,,,,,,,,,,,,,,,,,,,,,
-800,-500,-500,-500,-500,-500,-500,-500,-500,-500,-500,-500,-500,-500,-500,-500,-500,,,,,,,,,,,,,,,,,,,,,,,,,,,,,,,,,,,,,,,,,
-800,-500,-500,-500,-500,-500,-500,-500,-500,-500,-500,-500,-500,-500,-500,-500,-500,,,,,,,,,,,,,,,,,,,,,,,,,,,,,,,,,,,,,,,,,
-800,-500,-500,-500,-500,-500,-500,-500,-500,-500,-500,-500,-500,-500,-500,-500,-500,,,,,,,,,,,,,,,,,,,,,,,,,,,,,,,,,,,,,,,,,
-800,-500,-500,-500,-500,-500,-500,-500,-500,-500,-500,-500,-500,-500,-500,-500,-500,,,,,,,,,,,,,,,,,,,,,,,,,,,,,,,,,,,,,,,,,
-800,-500,-500,-500,-500,-500,-500,-500,-500,-500,-500,-500,-500,-500,-500,-500,-500,,,,,,,,,,,,,,,,,,,,,,,,,,,,,,,,,,,,,,,,,
-800,-500,-500,-500,-500,-500,-500,-500,-500,-500,-500,-500,-500,-500,-500,-500,-500,,,,,,,,,,,,,,,,,,,,,,,,,,,,,,,,,,,,,,,,,
-800,-500,-500,-500,-500,-500,-500,-500,-500,-500,-500,-500,-500,-500,-500,-500,-500,,,,,,,,,,,,,,,,,,,,,,,,,,,,,,,,,,,,,,,,,
-800,-500,-500,-500,-500,-500,-500,-500,-500,-500,-500,-500,-500,-500,-500,-500,-500,,,,,,,,,,,,,,,,,,,,,,,,,,,,,,,,,,,,,,,,,
-800,-500,-500,-500,-500,-500,-500,-500,-500,-500,-500,-500,-500,-500,-500,-500,-500,,,,,,,,,,,,,,,,,,,,,,,,,,,,,,,,,,,,,,,,,
-800,-500,-500,-500,-500,-500,-500,-500,-500,-500,-500,-500,-500,-500,-500,-500,-500,,,,,,,,,,,,,,,,,,,,,,,,,,,,,,,,,,,,,,,,,
-800,-500,-500,-500,-500,-500,-500,-500,-500,-500,-500,-500,-500,-500,-500,-500,-500,,,,,,,,,,,,,,,,,,,,,,,,,,,,,,,,,,,,,,,,,
-1000,-500,-500,-500,-500,-500,-500,-500,-500,-500,-500,-500,-500,-500,-500,-500,-2000,,,,,,,,,,,,,,,,,,,,,,,,,,,,,,,,,,,,,,,,,
-5000,-500,-500,-500,-500,-500,-500,-500,-500,-500,-2000,-500,-500,-500,-500,-1000,-5000,,,,,,,,,,,,,,,,,,,,,,,,,,,,,,,,,,,,,,,,,
#,line_max,,,,,,,,,,,,,,,,,,,,,,,,,,,,,,,,,,,,,,,,,,,,,,,,,,,,,,,,
58000,58000,58000,58000,58000,58000,58000,58000,58000,58000,58000,58000,58000,58000,58000,58000,58000,58000,58000,58000,58000,58000,58000,58000,58000,58000,58000,58000,58000,58000,58000,58000,58000,58000,58000,58000,58000,58000,58000,58000,58000,58000,58000,58000,58000,58000,58000,58000,58000,58000,58000,58000,58000,58000,58000,58000,58000,58000
#,line_min,,,,,,,,,,,,,,,,,,,,,,,,,,,,,,,,,,,,,,,,,,,,,,,,,,,,,,,,
10000,10000,10000,10000,10000,10000,10000,10000,10000,10000,10000,10000,10000,10000,10000,10000,10000,10000,10000,10000,10000,10000,10000,10000,10000,10000,10000,10000,10000,10000,10000,10000,10000,10000,10000,10000,10000,10000,10000,10000,10000,10000,10000,10000,10000,10000,10000,10000,10000,10000,10000,10000,10000,10000,10000,10000,10000,10000
#,full_max,,,,,,,,,,,,,,,,,,,,,,,,,,,,,,,,,,,,,,,,,,,,,,,,,,,,,,,,
1350,1350,1350,1350,1350,1350,1350,1350,1350,1350,1350,1350,1350,1350,1350,1350,1350,1350,,,,,,,,,,,,,,,,,,,,,,,,,,,,,,,,,,,,,,,,
1350,1350,1350,1350,1350,1350,1350,1350,1350,1350,1350,1350,1350,1350,1350,1350,1350,1350,,,,,,,,,,,,,,,,,,,,,,,,,,,,,,,,,,,,,,,,
1350,1350,1350,1350,1350,1350,1350,1350,1350,1350,1350,1350,1350,1350,1350,1350,1350,1350,,,,,,,,,,,,,,,,,,,,,,,,,,,,,,,,,,,,,,,,
1350,1350,1350,1350,1350,1350,1350,1350,1350,1350,1350,1350,1350,1350,1350,1350,1350,1350,,,,,,,,,,,,,,,,,,,,,,,,,,,,,,,,,,,,,,,,
1350,1350,1350,1350,1350,1350,1350,1350,1350,1350,1350,1350,1350,1350,1350,1350,1350,1350,,,,,,,,,,,,,,,,,,,,,,,,,,,,,,,,,,,,,,,,
1350,1350,1350,1350,1350,1350,1350,1350,1350,1350,1350,1350,1350,1350,1350,1350,1350,1350,,,,,,,,,,,,,,,,,,,,,,,,,,,,,,,,,,,,,,,,
1350,1350,1350,1350,1350,1350,1350,1350,1350,1350,1350,1350,1350,1350,1350,1350,1350,1350,,,,,,,,,,,,,,,,,,,,,,,,,,,,,,,,,,,,,,,,
1350,1350,1350,1350,1350,1350,1350,1350,1350,1350,1350,1350,1350,1350,1350,1350,1350,1350,,,,,,,,,,,,,,,,,,,,,,,,,,,,,,,,,,,,,,,,
1350,1350,1350,1350,1350,1350,1350,1350,1350,1350,1350,1350,1350,1350,1350,1350,1350,1350,,,,,,,,,,,,,,,,,,,,,,,,,,,,,,,,,,,,,,,,
1350,1350,1350,1350,1350,1350,1350,1350,1350,1350,1350,1350,1350,1350,1350,1350,1350,1350,,,,,,,,,,,,,,,,,,,,,,,,,,,,,,,,,,,,,,,,
1350,1350,1350,1350,1350,1350,1350,1350,1350,1350,1350,1350,1350,1350,1350,1350,1350,1350,,,,,,,,,,,,,,,,,,,,,,,,,,,,,,,,,,,,,,,,
1350,1350,1350,1350,1350,1350,1350,1350,1350,1350,1350,1350,1350,1350,1350,1350,1350,1350,,,,,,,,,,,,,,,,,,,,,,,,,,,,,,,,,,,,,,,,
1350,1350,1350,1350,1350,1350,1350,1350,1350,1350,1350,1350,1350,1350,1350,1350,1350,1350,,,,,,,,,,,,,,,,,,,,,,,,,,,,,,,,,,,,,,,,
1350,1350,1350,1350,1350,1350,1350,1350,1350,1350,1350,1350,1350,1350,1350,1350,1350,1350,,,,,,,,,,,,,,,,,,,,,,,,,,,,,,,,,,,,,,,,
1350,1350,1350,1350,1350,1350,1350,1350,1350,1350,1350,1350,1350,1350,1350,1350,1350,1350,,,,,,,,,,,,,,,,,,,,,,,,,,,,,,,,,,,,,,,,
1350,1350,1350,1350,1350,1350,1350,1350,1350,1350,1350,1350,1350,1350,1350,1350,1350,1350,,,,,,,,,,,,,,,,,,,,,,,,,,,,,,,,,,,,,,,,
1350,1350,1350,1350,1350,1350,1350,1350,1350,1350,1350,1350,1350,1350,1350,1350,1350,1350,,,,,,,,,,,,,,,,,,,,,,,,,,,,,,,,,,,,,,,,
1350,1350,1350,1350,1350,1350,1350,1350,1350,1350,1350,1350,1350,1350,1350,1350,1350,1350,,,,,,,,,,,,,,,,,,,,,,,,,,,,,,,,,,,,,,,,
1350,1350,1350,1350,1350,1350,1350,1350,1350,1350,1350,1350,1350,1350,1350,1350,1350,1350,,,,,,,,,,,,,,,,,,,,,,,,,,,,,,,,,,,,,,,,
1350,1350,1350,1350,1350,1350,1350,1350,1350,1350,1350,1350,1350,1350,1350,1350,1350,1350,,,,,,,,,,,,,,,,,,,,,,,,,,,,,,,,,,,,,,,,
1350,1350,1350,1350,1350,1350,1350,1350,1350,1350,1350,1350,1350,1350,1350,1350,1350,1350,,,,,,,,,,,,,,,,,,,,,,,,,,,,,,,,,,,,,,,,
1350,1350,1350,1350,1350,1350,1350,1350,1350,1350,1350,1350,1350,1350,1350,1350,1350,1350,,,,,,,,,,,,,,,,,,,,,,,,,,,,,,,,,,,,,,,,
1350,1350,1350,1350,1350,1350,1350,1350,1350,1350,1350,1350,1350,1350,1350,1350,1350,1350,,,,,,,,,,,,,,,,,,,,,,,,,,,,,,,,,,,,,,,,
1350,1350,1350,1350,1350,1350,1350,1350,1350,1350,1350,1350,1350,1350,1350,1350,1350,1350,,,,,,,,,,,,,,,,,,,,,,,,,,,,,,,,,,,,,,,,
1350,1350,1350,1350,1350,1350,1350,1350,1350,1350,1350,1350,1350,1350,1350,1350,1350,1350,,,,,,,,,,,,,,,,,,,,,,,,,,,,,,,,,,,,,,,,
1350,1350,1350,1350,1350,1350,1350,1350,1350,1350,1350,1350,1350,1350,1350,1350,1350,1350,,,,,,,,,,,,,,,,,,,,,,,,,,,,,,,,,,,,,,,,
1350,1350,1350,1350,1350,1350,1350,1350,1350,1350,1350,1350,1350,1350,1350,1350,1350,1350,,,,,,,,,,,,,,,,,,,,,,,,,,,,,,,,,,,,,,,,
1350,1350,1350,1350,1350,1350,1350,1350,1350,1350,1350,1350,1350,1350,1350,1350,1350,1350,,,,,,,,,,,,,,,,,,,,,,,,,,,,,,,,,,,,,,,,
1350,1350,1350,1350,1350,1350,1350,1350,1350,1350,1350,1350,1350,1350,1350,1350,1350,1350,,,,,,,,,,,,,,,,,,,,,,,,,,,,,,,,,,,,,,,,
1350,1350,1350,1350,1350,1350,1350,1350,1350,1350,1350,1350,1350,1350,1350,1350,1350,1350,,,,,,,,,,,,,,,,,,,,,,,,,,,,,,,,,,,,,,,,
1350,1350,1350,1350,1350,1350,1350,1350,1350,1350,1350,1350,1350,1350,1350,1350,1350,1350,,,,,,,,,,,,,,,,,,,,,,,,,,,,,,,,,,,,,,,,
1350,1350,1350,1350,1350,1350,1350,1350,1350,1350,1350,1350,1350,1350,1350,1350,1350,1350,,,,,,,,,,,,,,,,,,,,,,,,,,,,,,,,,,,,,,,,
1350,1350,1350,1350,1350,1350,1350,1350,1350,1350,1350,1350,1350,1350,1350,1350,1350,1350,,,,,,,,,,,,,,,,,,,,,,,,,,,,,,,,,,,,,,,,
1350,1350,1350,1350,1350,1350,1350,1350,1350,1350,1350,1350,1350,1350,1350,1350,1350,1350,,,,,,,,,,,,,,,,,,,,,,,,,,,,,,,,,,,,,,,,
1350,1350,1350,1350,1350,1350,1350,1350,1350,1350,1350,1350,1350,1350,1350,1350,1350,1350,,,,,,,,,,,,,,,,,,,,,,,,,,,,,,,,,,,,,,,,
1350,1350,1350,1350,1350,1350,1350,1350,1350,1350,1350,1350,1350,1350,1350,1350,1350,1350,,,,,,,,,,,,,,,,,,,,,,,,,,,,,,,,,,,,,,,,
1350,1350,1350,1350,1350,1350,1350,1350,1350,1350,1350,1350,1350,1350,1350,1350,1350,1350,,,,,,,,,,,,,,,,,,,,,,,,,,,,,,,,,,,,,,,,
1350,1350,1350,1350,1350,1350,1350,1350,1350,1350,1350,1350,1350,1350,1350,1350,1350,1350,,,,,,,,,,,,,,,,,,,,,,,,,,,,,,,,,,,,,,,,
1350,1350,1350,1350,1350,1350,1350,1350,1350,1350,1350,1350,1350,1350,1350,1350,1350,1350,,,,,,,,,,,,,,,,,,,,,,,,,,,,,,,,,,,,,,,,
1350,1350,1350,1350,1350,1350,1350,1350,1350,1350,1350,1350,1350,1350,1350,1350,1350,1350,,,,,,,,,,,,,,,,,,,,,,,,,,,,,,,,,,,,,,,,
#,full_min,,,,,,,,,,,,,,,,,,,,,,,,,,,,,,,,,,,,,,,,,,,,,,,,,,,,,,,,
10,450,450,450,450,450,450,450,450,450,450,450,450,450,450,450,450,10,,,,,,,,,,,,,,,,,,,,,,,,,,,,,,,,,,,,,,,,
450,450,450,450,450,450,450,450,450,450,450,450,450,450,450,450,450,450,,,,,,,,,,,,,,,,,,,,,,,,,,,,,,,,,,,,,,,,
450,450,450,450,450,450,450,450,450,450,450,450,450,450,450,450,450,450,,,,,,,,,,,,,,,,,,,,,,,,,,,,,,,,,,,,,,,,
450,450,450,450,450,450,450,450,450,450,450,450,450,450,450,450,450,450,,,,,,,,,,,,,,,,,,,,,,,,,,,,,,,,,,,,,,,,
450,450,450,450,450,450,450,450,450,450,450,450,450,450,450,450,450,450,,,,,,,,,,,,,,,,,,,,,,,,,,,,,,,,,,,,,,,,
450,450,450,450,450,450,450,450,450,450,450,450,450,450,450,450,450,450,,,,,,,,,,,,,,,,,,,,,,,,,,,,,,,,,,,,,,,,
450,450,450,450,450,450,450,450,450,450,450,450,450,450,450,450,450,450,,,,,,,,,,,,,,,,,,,,,,,,,,,,,,,,,,,,,,,,
450,450,450,450,450,450,450,450,450,450,450,450,450,450,450,450,450,450,,,,,,,,,,,,,,,,,,,,,,,,,,,,,,,,,,,,,,,,
450,450,450,450,450,450,450,450,450,450,450,450,450,450,450,450,450,450,,,,,,,,,,,,,,,,,,,,,,,,,,,,,,,,,,,,,,,,
450,450,450,450,450,450,450,450,450,450,450,450,450,450,450,450,450,450,,,,,,,,,,,,,,,,,,,,,,,,,,,,,,,,,,,,,,,,
450,450,450,450,450,450,450,450,450,450,450,450,450,450,450,450,450,450,,,,,,,,,,,,,,,,,,,,,,,,,,,,,,,,,,,,,,,,
450,450,450,450,450,450,450,450,450,450,450,450,450,450,450,450,450,450,,,,,,,,,,,,,,,,,,,,,,,,,,,,,,,,,,,,,,,,
450,450,450,450,450,450,450,450,450,450,450,450,450,450,450,450,450,450,,,,,,,,,,,,,,,,,,,,,,,,,,,,,,,,,,,,,,,,
450,450,450,450,450,450,450,450,450,450,450,450,450,450,450,450,450,450,,,,,,,,,,,,,,,,,,,,,,,,,,,,,,,,,,,,,,,,
450,450,450,450,450,450,450,450,450,450,450,450,450,450,450,450,450,450,,,,,,,,,,,,,,,,,,,,,,,,,,,,,,,,,,,,,,,,
450,450,450,450,450,450,450,450,450,450,450,450,450,450,450,450,450,450,,,,,,,,,,,,,,,,,,,,,,,,,,,,,,,,,,,,,,,,
450,450,450,450,450,450,450,450,450,450,450,450,450,450,450,450,450,450,,,,,,,,,,,,,,,,,,,,,,,,,,,,,,,,,,,,,,,,
450,450,450,450,450,450,450,450,450,450,450,450,450,450,450,450,450,450,,,,,,,,,,,,,,,,,,,,,,,,,,,,,,,,,,,,,,,,
450,450,450,450,450,450,450,450,450,450,450,450,450,450,450,450,450,450,,,,,,,,,,,,,,,,,,,,,,,,,,,,,,,,,,,,,,,,
450,450,450,450,450,450,450,450,450,450,450,450,450,450,450,450,450,450,,,,,,,,,,,,,,,,,,,,,,,,,,,,,,,,,,,,,,,,
450,450,450,450,450,450,450,450,450,450,450,450,450,450,450,450,450,450,,,,,,,,,,,,,,,,,,,,,,,,,,,,,,,,,,,,,,,,
450,450,450,450,450,450,450,450,450,450,450,450,450,450,450,450,450,450,,,,,,,,,,,,,,,,,,,,,,,,,,,,,,,,,,,,,,,,
450,450,450,450,450,450,450,450,450,450,450,450,450,450,450,450,450,450,,,,,,,,,,,,,,,,,,,,,,,,,,,,,,,,,,,,,,,,
450,450,450,450,450,450,450,450,450,450,450,450,450,450,450,450,450,450,,,,,,,,,,,,,,,,,,,,,,,,,,,,,,,,,,,,,,,,
450,450,450,450,450,450,450,450,450,450,450,450,450,450,450,450,450,450,,,,,,,,,,,,,,,,,,,,,,,,,,,,,,,,,,,,,,,,
450,450,450,450,450,450,450,450,450,450,450,450,450,450,450,450,450,450,,,,,,,,,,,,,,,,,,,,,,,,,,,,,,,,,,,,,,,,
450,450,450,450,450,450,450,450,450,450,450,450,450,450,450,450,450,450,,,,,,,,,,,,,,,,,,,,,,,,,,,,,,,,,,,,,,,,
450,450,450,450,450,450,450,450,450,450,450,450,450,450,450,450,450,450,,,,,,,,,,,,,,,,,,,,,,,,,,,,,,,,,,,,,,,,
450,450,450,450,450,450,450,450,450,450,450,450,450,450,450,450,450,450,,,,,,,,,,,,,,,,,,,,,,,,,,,,,,,,,,,,,,,,
450,450,450,450,450,450,450,450,450,450,450,450,450,450,450,450,450,450,,,,,,,,,,,,,,,,,,,,,,,,,,,,,,,,,,,,,,,,
450,450,450,450,450,450,450,450,450,450,450,450,450,450,450,450,450,450,,,,,,,,,,,,,,,,,,,,,,,,,,,,,,,,,,,,,,,,
450,450,450,450,450,450,450,450,450,450,450,450,450,450,450,450,450,450,,,,,,,,,,,,,,,,,,,,,,,,,,,,,,,,,,,,,,,,
450,450,450,450,450,450,450,450,450,450,450,450,450,450,450,450,450,450,,,,,,,,,,,,,,,,,,,,,,,,,,,,,,,,,,,,,,,,
450,450,450,450,450,450,450,450,450,450,450,450,450,450,450,450,450,450,,,,,,,,,,,,,,,,,,,,,,,,,,,,,,,,,,,,,,,,
450,450,450,450,450,450,450,450,450,450,450,450,450,450,450,450,450,450,,,,,,,,,,,,,,,,,,,,,,,,,,,,,,,,,,,,,,,,
450,450,450,450,450,450,450,450,450,450,450,450,450,450,450,450,450,450,,,,,,,,,,,,,,,,,,,,,,,,,,,,,,,,,,,,,,,,
450,450,450,450,450,450,450,450,450,450,450,450,450,450,450,450,450,450,,,,,,,,,,,,,,,,,,,,,,,,,,,,,,,,,,,,,,,,
450,450,450,450,450,450,450,450,450,450,450,450,450,450,450,450,450,450,,,,,,,,,,,,,,,,,,,,,,,,,,,,,,,,,,,,,,,,
450,450,450,450,450,450,450,450,450,450,450,450,450,450,450,450,450,450,,,,,,,,,,,,,,,,,,,,,,,,,,,,,,,,,,,,,,,,
10,450,450,450,450,450,450,450,450,450,450,450,450,450,450,450,450,10,,,,,,,,,,,,,,,,,,,,,,,,,,,,,,,,,,,,,,,,
#,full_row_delta_max,,,,,,,,,,,,,,,,,,,,,,,,,,,,,,,,,,,,,,,,,,,,,,,,,,,,,,,,
9000,3600,2340,2340,2340,2340,2340,2340,2340,2340,2340,2340,2340,2340,2340,2340,2340,2340,2340,2340,2340,2340,2340,2340,2340,2340,2340,2340,2340,2340,2340,2340,2340,2340,2340,2340,2340,3000,9000,,,,,,,,,,,,,,,,,,,
#,full_row_delta_min,,,,,,,,,,,,,,,,,,,,,,,,,,,,,,,,,,,,,,,,,,,,,,,,,,,,,,,,
-9000,-3600,-2340,-2340,-2340,-2340,-2340,-2340,-2340,-2340,-2340,-2340,-2340,-2340,-2340,-2340,-2340,-2340,-2340,-2340,-2340,-2340,-2340,-2340,-2340,-2340,-2340,-2340,-2340,-2340,-2340,-2340,-2340,-2340,-2340,-2340,-2340,-3000,-9000,,,,,,,,,,,,,,,,,,,
#,full_col_delta_max,,,,,,,,,,,,,,,,,,,,,,,,,,,,,,,,,,,,,,,,,,,,,,,,,,,,,,,,
8000,3800,3800,3800,3800,3800,3800,3800,3800,4700,3800,3800,3800,3800,3800,3800,8000,,,,,,,,,,,,,,,,,,,,,,,,,,,,,,,,,,,,,,,,,
#,full_col_delta_min,,,,,,,,,,,,,,,,,,,,,,,,,,,,,,,,,,,,,,,,,,,,,,,,,,,,,,,,
-8000,-3800,-3800,-3800,-3800,-3800,-3800,-4700,-3800,-3800,-3800,-3800,-3800,-3800,-3800,-3800,-8000,,,,,,,,,,,,,,,,,,,,,,,,,,,,,,,,,,,,,,,,,
