{
  "config":{
    "hw_platform": ["MTP", "Surf", "RCM", "QRD", "HDK"],
    "soc_id": ["415", "439", "456", "502", "552", "540"]
  },
  "tcs3718":{
    "owner": "sns_tcs3718",
    ".prox":{
      "owner": "sns_tcs3718",
      ".config":{
        "owner": "sns_tcs3718",
        "is_dri":{ "type": "int", "ver": "0",
          "data": "0"
        },
        "hw_id":{ "type": "int", "ver": "0",
          "data": "1"
        },
        "res_idx":{ "type": "int", "ver": "0",
          "data": "0"
        },
        "sync_stream":{ "type": "int", "ver": "0",
          "data": "0"
        }
      }
    },
    ".als":{
      "owner": "sns_tcs3718",
      ".config":{
        "owner": "sns_tcs3718",
        "is_dri":{ "type": "int", "ver": "0",
          "data": "0"
        },
        "hw_id":{ "type": "int", "ver": "0",
          "data": "1"
        },
        "res_idx":{ "type": "int", "ver": "0",
          "data": "0"
        },
        "sync_stream":{ "type": "int", "ver": "0",
          "data": "0"
        }
      }
    }
  },
  "tcs3718_platform":{
    "owner": "sns_tcs3718",
    ".config":{
      "owner": "sns_tcs3718",
      "bus_type":{ "type": "int", "ver": "0",
        "data": "0"
      },
      "bus_instance":{ "type": "int", "ver": "0",
        "data": "2"
      },
      "slave_config":{ "type": "int", "ver": "0",
        "data": "57"
      },
      "min_bus_speed_khz":{ "type": "int", "ver": "0",
        "data": "400"
      },
      "max_bus_speed_khz":{ "type": "int", "ver": "0",
        "data": "400"
      },
      "reg_addr_type":{ "type": "int", "ver": "0",
        "data": "0"
      },
      "dri_irq_num":{ "type": "int", "ver": "0",
        "data": "188"
      },
      "irq_pull_type":{ "type": "int", "ver": "0",
        "data": "3"
      },
      "irq_is_chip_pin":{ "type": "int", "ver": "0",
        "data": "1"
      },
      "irq_drive_strength":{ "type": "int", "ver": "0",
        "data": "0"
      },
      "irq_trigger_type":{ "type": "int", "ver": "0",
        "data": "1"
      },
      "num_rail":{ "type": "int", "ver": "0",
        "data": "2"
      },
      "rail_on_state":{ "type": "int", "ver": "0",
        "data": "2"
      },
      "vdd_rail":{ "type": "str", "ver": "0",
        "data": "/pmic/client/sensor_vdd"
      },
      "vddio_rail":{ "type": "str", "ver": "0",
        "data": "/pmic/client/sensor_vddio"
      },
      "rigid_body_type":{ "type": "int", "ver": "0",
      "data": "0"
      }
    },
    ".prox":{
      "owner": "sns_tcs3718",
      ".fac_cal":{
        "owner": "sns_tcs3718",
        "near_threshold":{ "type": "flt", "ver": "0",
          "data": "500.0"
        },
        "far_threshold":{ "type": "flt", "ver": "0",
          "data": "400.0"
        }
      },
      ".def_config":{
        "owner": "sns_tcs3718",
        "p_time":{ "type": "flt", "ver": "0",
          "data": "3.0"
        },
        "p_pulse_len":{ "type": "flt", "ver": "0",
          "data": "128.0"
        },
        "p_pulse":{ "type": "flt", "ver": "0",
          "data": "1.0"
        },
        "p_gain":{ "type": "flt", "ver": "0",
          "data": "4.0"
        },
        "p_Isink0":{ "type": "flt", "ver": "0",
          "data": "7.0"
        },
        "p_Isink1":{ "type": "flt", "ver": "0",
          "data": "7.0"
        },
        "p_Isink2":{ "type": "flt", "ver": "0",
          "data": "14.0"
        },
        "p_pers":{ "type": "flt", "ver": "0",
          "data": "0.0"
        },
        "p_avg":{ "type": "flt", "ver": "0",
          "data": "3.0"
        },
        "p_sync_delay0":{ "type": "flt", "ver": "0",
          "data": "240.0"
        },
        "p_sync_delay1":{ "type": "flt", "ver": "0",
          "data": "0.0"
        },
        "prox_filter_type":{ "type": "int", "ver": "0",
          "data": "0"
        },
        "prox_filter_size":{ "type": "int", "ver": "0",
          "data": "5"
        },
        "prox_lights_num":{ "type": "int", "ver": "0",
          "data": "0"
        },
        "product_type":{ "type": "int", "ver": "0",
          "data": "3"
        },
        "min_proximity":{ "type": "int", "ver": "0",
          "data": "5000"
        },
        "p_default_pwindow":{ "type": "int", "ver": "0",
          "data": "200"
        },
        "p_default_offset":{ "type": "int", "ver": "0",
          "data": "60"
        },
        "prox_near_delay":{ "type": "int", "ver": "0",
          "data": "1"
        }
      },
      ".hw_cal":{
        "owner": "sns_tcs3718",
        "p_offset":{ "type": "flt", "ver": "0",
          "data": "60.0"
        }
      },
      ".te_sync":{
        "owner": "sns_tcs3718",
        "p_sync_cfg0_30hz":{ "type": "int", "ver": "0",
          "data": "184"
        },
        "p_sync_cfg1_30hz":{ "type": "int", "ver": "0",
          "data": "4"
        },
        "p_sync_cfg0_60hz":{ "type": "int", "ver": "0",
          "data": "163"
        },
        "p_sync_cfg1_60hz":{ "type": "int", "ver": "0",
          "data": "4"
        },
        "p_sync_cfg0_90hz":{ "type": "int", "ver": "0",
          "data": "15"
        },
        "p_sync_cfg1_90hz":{ "type": "int", "ver": "0",
          "data": "13"
        },
        "p_sync_cfg0_120hz":{ "type": "int", "ver": "0",
          "data": "102"
        },
        "p_sync_cfg1_120hz":{ "type": "int", "ver": "0",
          "data": "9"
        }
      }
    },
    ".als":{
      "owner": "sns_tcs3718",
      ".fac_cal":{
        "owner": "sns_tcs3718",
        "scale":{ "type": "flt", "ver": "0",
          "data": "60.0"
        }
      },
      ".def_config":{
        "owner": "sns_tcs3718",
        "display_brightness":{ "type": "flt", "ver": "0",
          "data": "255"
        },
        "vsync_freq":{ "type": "int", "ver": "0",
          "data": "60"
        },
        "a_time":{ "type": "flt", "ver": "0",
          "data": "100000.0"
        },
        "a_gain":{ "type": "flt", "ver": "0",
          "data": "11.0"
        },
        "a_pers":{ "type": "flt", "ver": "0",
          "data": "1.0"
        },
        "a_thrs_width":{ "type": "flt", "ver": "0",
          "data": "10.0"
        },
        "lux_target":{ "type": "flt", "ver": "0",
          "data": "300.0"
        },
        "lux_target_error":{ "type": "flt", "ver": "0",
          "data": "30.0"
        }
      },
      ".lux_coefs":{
        "owner": "sns_tcs3718",
        "2ch_coefs_dgf_0":{ "type": "flt", "ver": "0",
          "data": "2.7518"
        },
        "2ch_coefs_ch0_0":{ "type": "flt", "ver": "0",
          "data": "1.0"
        },
        "2ch_coefs_ch1_0":{ "type": "flt", "ver": "0",
          "data": "-0.8223"
        },
        "2ch_coefs_dgf_1":{ "type": "flt", "ver": "0",
          "data": "3.7518"
        },
        "2ch_coefs_ch0_1":{ "type": "flt", "ver": "0",
          "data": "1.0"
        },
        "2ch_coefs_ch1_1":{ "type": "flt", "ver": "0",
          "data": "-0.8223"
        },
        "4ch_coefs_dgf_0":{ "type": "flt", "ver": "0",
          "data": "1.0"
        },
        "4ch_coefs_ch0_0":{ "type": "flt", "ver": "0",
          "data": "-59.1286"
        },
        "4ch_coefs_ch1_0":{ "type": "flt", "ver": "0",
          "data": "237.7574"
        },
        "4ch_coefs_ch2_0":{ "type": "flt", "ver": "0",
          "data": "1457.556"
        },
        "4ch_coefs_ch3_0":{ "type": "flt", "ver": "0",
          "data": "-73.9037"
        },
        "4ch_coefs_dgf_1":{ "type": "flt", "ver": "0",
          "data": "1.0"
        },
        "4ch_coefs_ch0_1":{ "type": "flt", "ver": "0",
          "data": "-59.1286"
        },
        "4ch_coefs_ch1_1":{ "type": "flt", "ver": "0",
          "data": "237.7574"
        },
        "4ch_coefs_ch2_1":{ "type": "flt", "ver": "0",
          "data": "1457.556"
        },
        "4ch_coefs_ch3_1":{ "type": "flt", "ver": "0",
          "data": "-73.9037"
        }
      },
      ".boled_config":{
        "owner": "sns_tcs3718",
        "alg_key_0":{ "type": "str", "ver": "0",
          "data": "alg_mgr"
        },
        "alg_cfg_0":{ "type": "str", "ver": "0",
          "data": "alg_key,pldc : bright_lower_th,0 : bright_upper_th,5  : ch,2 : itime_us,1000"
        },
        "alg_key_1":{ "type": "str", "ver": "0",
          "data": "alg_mgr"
        },
        "alg_cfg_1":{ "type": "str", "ver": "0",
          "data": "alg_key,pldc : bright_lower_th,6 : bright_upper_th,18  : ch,2 : itime_us,800"
        },
        "alg_key_2":{ "type": "str", "ver": "0",
          "data": "alg_mgr"
        },
        "alg_cfg_2":{ "type": "str", "ver": "0",
          "data": "alg_key,fca: bright_lower_th,19 : bright_upper_th,255 : ch,4 : itime_us,1087"
        },
        "alg_key_3":{ "type": "str", "ver": "0",
          "data": "fca"
        },
        "alg_cfg_3":{ "type": "str", "ver": "0",
          "data": "dc_model,<1,1,1,1>,<{1.834862e+00,-5.940642e-01,},{-5.502745e-01,4.363411e-01,},{-3.791313e-01,2.867855e-01,},{-1.470359e-01,1.124726e-01,},><{2.700093e+00,-4.490914e-01,},{-6.035751e-01,5.020232e-01,},{-8.194336e-01,1.698495e-01,},{-6.503021e-01,1.509858e-01,},><{1.181761e+00,-9.302880e-01,},{-6.773767e-01,4.441305e-01,},{4.516497e-01,5.505831e-01,},{-1.263996e-01,1.051748e-01,},><{-2.114881e-01,-4.380200e-01,},{6.385917e-02,2.163493e-01,},{-1.187963e-01,2.435986e-01,},{1.192189e+00,5.196208e-02,},>"
        },
        "alg_key_4":{ "type": "str", "ver": "0",
          "data": "fca"
        },
        "alg_cfg_4":{ "type": "str", "ver": "0",
          "data": "dc_model,<1,1,1,1>,<{1.834862e+00,-5.940642e-01,},{-5.502745e-01,4.363411e-01,},{-3.791313e-01,2.867855e-01,},{-1.470359e-01,1.124726e-01,},><{2.700093e+00,-4.490914e-01,},{-6.035751e-01,5.020232e-01,},{-8.194336e-01,1.698495e-01,},{-6.503021e-01,1.509858e-01,},><{1.181761e+00,-9.302880e-01,},{-6.773767e-01,4.441305e-01,},{4.516497e-01,5.505831e-01,},{-1.263996e-01,1.051748e-01,},><{-2.114881e-01,-4.380200e-01,},{6.385917e-02,2.163493e-01,},{-1.187963e-01,2.435986e-01,},{1.192189e+00,5.196208e-02,},>"
        },
        "alg_key_5":{ "type": "str", "ver": "0",
          "data": "fca"
        },
        "alg_cfg_5":{ "type": "str", "ver": "0",
          "data": "pwm_model,<31,4,{6.308298e-03,}{6.413066e-03,}{6.274251e-03,}{6.109224e-03,}>"
        },
        "alg_key_6":{ "type": "str", "ver": "0",
          "data": "fca"
        },
        "alg_cfg_6":{ "type": "str", "ver": "0",
          "data": "pwm_model,<31,4,{6.308298e-03,}{6.413066e-03,}{6.274251e-03,}{6.109224e-03,}>"
        },
        "alg_key_7":{ "type": "str", "ver": "0",
          "data": "fca"
        },
        "alg_cfg_7":{ "type": "str", "ver": "0",
          "data": "pwm_model,<19,4,{7.925050e-03,-3.659138e-04,1.637082e-05,}{1.095092e-02,-9.211603e-04,4.163631e-05,}{8.024677e-03,-4.419478e-04,2.117477e-05,}{5.747734e-03,1.096933e-05,-7.251667e-08,}>"
        },
        "alg_key_8":{ "type": "str", "ver": "0",
          "data": "fca"
        },
        "alg_cfg_8":{ "type": "str", "ver": "0",
          "data": "pwm_model,<19,4,{7.925050e-03,-3.659138e-04,1.637082e-05,}{1.095092e-02,-9.211603e-04,4.163631e-05,}{8.024677e-03,-4.419478e-04,2.117477e-05,}{5.747734e-03,1.096933e-05,-7.251667e-08,}>"
        },
        "alg_key_9":{ "type": "str", "ver": "0",
          "data": "fca"
        },
        "alg_cfg_9":{ "type": "str", "ver": "0",
          "data": "pwm_model,<19,4,{7.925050e-03,-3.659138e-04,1.637082e-05,}{1.095092e-02,-9.211603e-04,4.163631e-05,}{8.024677e-03,-4.419478e-04,2.117477e-05,}{5.747734e-03,1.096933e-05,-7.251667e-08,}>"
        },
        "alg_key_10":{ "type": "str", "ver": "0",
          "data": "fca"
        },
        "alg_cfg_10":{ "type": "str", "ver": "0",
          "data": "pwm_model,<19,4,{7.925050e-03,-3.659138e-04,1.637082e-05,}{1.095092e-02,-9.211603e-04,4.163631e-05,}{8.024677e-03,-4.419478e-04,2.117477e-05,}{5.747734e-03,1.096933e-05,-7.251667e-08,}>"
        },
        "alg_key_11":{ "type": "str", "ver": "0",
          "data": "fca"
        },
        "alg_cfg_11":{ "type": "str", "ver": "0",
          "data": "dc_cal,<255,{6233.386364,3659.431818,1777.630682,1381.329545,},{178.881644,102.489882,53.467757,40.365153,}>"
        },
        "alg_key_12":{ "type": "str", "ver": "0",
          "data": "fca"
        },
        "alg_cfg_12":{ "type": "str", "ver": "0",
          "data": "dc_cal,<255,{6233.386364,3659.431818,1777.630682,1381.329545,},{178.881644,102.489882,53.467757,40.365153,}>"
        },
        "alg_key_13":{ "type": "str", "ver": "0",
          "data": "fca"
        },
        "alg_cfg_13":{ "type": "str", "ver": "0",
          "data": "pwm_cal,<31,{6233.386364,3659.431818,1777.630682,1381.329545,},{34.219636,20.054555,9.768755,7.562693,}>"
        },
        "alg_key_14":{ "type": "str", "ver": "0",
          "data": "fca"
        },
        "alg_cfg_14":{ "type": "str", "ver": "0",
          "data": "pwm_cal,<31,{6233.386364,3659.431818,1777.630682,1381.329545,},{34.219636,20.054555,9.768755,7.562693,}>"
        }
      }
    }
  }
}
