{
	"centerX" : 0.5,
	"centerY" : 0.5,
	"angle" : 0,
	"scale" : 1,
	"width" : 150,
	"height" : 100,
	"contents" : [{
			"type" : "image",
			"resource" : {
				"type" : "static",
				"path" : "res/watermark_stamp_bg.png"
			},
			"centerX" : 0.5,
			"centerY" : 0.5,
			"width" : 150,
			"height" : 100,
			"angle" : 0,
			"zorder" : 1
		},
		{
            "type": "text",
            "centerX": 0.34,
            "centerY": 0.5,
            "width": 70,
            "height": 17,
            "angle": 0,
            "color": "#ffffffff",
            "isVertical": 0,
			"alignment": 0,
            "text": "{yyyy.MM.dd}",
            "zorder": 1
        }
	]
}
