{
  "config":{
    "hw_platform": ["QRD"],
    "soc_id": ["540"]
  },
  "lsm6dso_0_platform":{
    "owner": "lsm6dso",
    ".config":{
      "owner": "lsm6dso",
      "bus_type":{ "type": "int", "ver": "0",
        "data": "1"
      },
      "bus_instance":{ "type": "int", "ver": "0",
        "data": "3"
      },
      "slave_config":{ "type": "int", "ver": "0",
        "data": "0"
      },
      "min_bus_speed_khz":{ "type": "int", "ver": "0",
        "data": "0"
      },
      "max_bus_speed_khz":{ "type": "int", "ver": "0",
        "data": "960"
      },
      "reg_addr_type":{ "type": "int", "ver": "0",
        "data": "0"
      },
      "dri_irq_num":{ "type": "int", "ver": "0",
        "data": "90"
      },
      "irq_pull_type":{ "type": "int", "ver": "0",
        "data": "3"
      },
      "irq_is_chip_pin":{ "type": "int", "ver": "0",
        "data": "1"
      },
      "irq_drive_strength":{ "type": "int", "ver": "0",
        "data": "5"
      },
      "irq_trigger_type":{ "type": "int", "ver": "0",
        "data": "3"
      },
      "num_rail":{ "type": "int", "ver": "0",
        "data": "1"
      },
      "rail_on_state":{ "type": "int", "ver": "0",
        "data": "2"
      },
      "vdd_rail":{ "type": "str", "ver": "0",
        "data": "/pmic/client/sensor_vdd"
      },
      "vddio_rail":{ "type": "str", "ver": "0",
        "data": "/pmic/client/sensor_vddio"
      },
      "rigid_body_type":{ "type": "int", "ver": "0",
        "data": "0"
      }
    }
  }
}
