{
	"config":{
		"hw_platform": ["QRD"],
		"soc_id": ["540", "552"]
	},
	"aw9610x_0_sar":{
		"owner": "sns_aw9610x",
		".register_a":{
			"owner": "sns_aw9610x",
			"enable_reg_cfg": { "type": "int", "ver": "0",
			"data": "1"
			},
			"user_reg_num": { "type": "int", "ver": "0",
			"data": "138"
			},
			"chip_name": { "type": "int", "ver": "0",
			"data": "0x96103"
			},
			"check_sum": { "type": "int", "ver": "0",
			"data": "0xBA20AE25"
			},
			"reg_0x0000":{ "type": "int", "ver": "0", "data": "0x0000"},
			"reg_0x0000_val":{ "type": "int", "ver": "0", "data": "0x00000303"},
			"reg_0x0004":{ "type": "int", "ver": "0", "data": "0x0004"},
			"reg_0x0004_val":{ "type": "int", "ver": "0", "data": "0x03C00032"},
			"reg_0x0008":{ "type": "int", "ver": "0", "data": "0x0008"},
			"reg_0x0008_val":{ "type": "int", "ver": "0", "data": "0x0017A11E"},
			"reg_0x000C":{ "type": "int", "ver": "0", "data": "0x000C"},
			"reg_0x000C_val":{ "type": "int", "ver": "0", "data": "0x05000000"},
			"reg_0x0010":{ "type": "int", "ver": "0", "data": "0x0010"},
			"reg_0x0010_val":{ "type": "int", "ver": "0", "data": "0x042930FD"},
			"reg_0x0014":{ "type": "int", "ver": "0", "data": "0x0014"},
			"reg_0x0014_val":{ "type": "int", "ver": "0", "data": "0x0000000E"},
			"reg_0x0018":{ "type": "int", "ver": "0", "data": "0x0018"},
			"reg_0x0018_val":{ "type": "int", "ver": "0", "data": "0xB42D040B"},
			"reg_0x001C":{ "type": "int", "ver": "0", "data": "0x001C"},
			"reg_0x001C_val":{ "type": "int", "ver": "0", "data": "0xFF000000"},
			"reg_0x0020":{ "type": "int", "ver": "0", "data": "0x0020"},
			"reg_0x0020_val":{ "type": "int", "ver": "0", "data": "0x00000000"},
			"reg_0x0024":{ "type": "int", "ver": "0", "data": "0x0024"},
			"reg_0x0024_val":{ "type": "int", "ver": "0", "data": "0x042930DF"},
			"reg_0x0028":{ "type": "int", "ver": "0", "data": "0x0028"},
			"reg_0x0028_val":{ "type": "int", "ver": "0", "data": "0x0000000E"},
			"reg_0x002C":{ "type": "int", "ver": "0", "data": "0x002C"},
			"reg_0x002C_val":{ "type": "int", "ver": "0", "data": "0xB42D040B"},
			"reg_0x0030":{ "type": "int", "ver": "0", "data": "0x0030"},
			"reg_0x0030_val":{ "type": "int", "ver": "0", "data": "0x00000000"},
			"reg_0x0034":{ "type": "int", "ver": "0", "data": "0x0034"},
			"reg_0x0034_val":{ "type": "int", "ver": "0", "data": "0x00000000"},
			"reg_0x0038":{ "type": "int", "ver": "0", "data": "0x0038"},
			"reg_0x0038_val":{ "type": "int", "ver": "0", "data": "0x00050000"},
			"reg_0x003C":{ "type": "int", "ver": "0", "data": "0x003C"},
			"reg_0x003C_val":{ "type": "int", "ver": "0", "data": "0x00000009"},
			"reg_0x0040":{ "type": "int", "ver": "0", "data": "0x0040"},
			"reg_0x0040_val":{ "type": "int", "ver": "0", "data": "0xD81C8207"},
			"reg_0x0044":{ "type": "int", "ver": "0", "data": "0x0044"},
			"reg_0x0044_val":{ "type": "int", "ver": "0", "data": "0xFF000000"},
			"reg_0x0048":{ "type": "int", "ver": "0", "data": "0x0048"},
			"reg_0x0048_val":{ "type": "int", "ver": "0", "data": "0x00000000"},
			"reg_0x004C":{ "type": "int", "ver": "0", "data": "0x004C"},
			"reg_0x004C_val":{ "type": "int", "ver": "0", "data": "0x00050000"},
			"reg_0x0050":{ "type": "int", "ver": "0", "data": "0x0050"},
			"reg_0x0050_val":{ "type": "int", "ver": "0", "data": "0x00000009"},
			"reg_0x0054":{ "type": "int", "ver": "0", "data": "0x0054"},
			"reg_0x0054_val":{ "type": "int", "ver": "0", "data": "0xD81C8207"},
			"reg_0x0058":{ "type": "int", "ver": "0", "data": "0x0058"},
			"reg_0x0058_val":{ "type": "int", "ver": "0", "data": "0xFF000000"},
			"reg_0x005C":{ "type": "int", "ver": "0", "data": "0x005C"},
			"reg_0x005C_val":{ "type": "int", "ver": "0", "data": "0x00000000"},
			"reg_0x0060":{ "type": "int", "ver": "0", "data": "0x0060"},
			"reg_0x0060_val":{ "type": "int", "ver": "0", "data": "0x00050000"},
			"reg_0x0064":{ "type": "int", "ver": "0", "data": "0x0064"},
			"reg_0x0064_val":{ "type": "int", "ver": "0", "data": "0x00000009"},
			"reg_0x0068":{ "type": "int", "ver": "0", "data": "0x0068"},
			"reg_0x0068_val":{ "type": "int", "ver": "0", "data": "0xD81C0207"},
			"reg_0x006C":{ "type": "int", "ver": "0", "data": "0x006C"},
			"reg_0x006C_val":{ "type": "int", "ver": "0", "data": "0xFF000000"},
			"reg_0x0070":{ "type": "int", "ver": "0", "data": "0x0070"},
			"reg_0x0070_val":{ "type": "int", "ver": "0", "data": "0x00000000"},
			"reg_0x0074":{ "type": "int", "ver": "0", "data": "0x0074"},
			"reg_0x0074_val":{ "type": "int", "ver": "0", "data": "0x00050000"},
			"reg_0x0078":{ "type": "int", "ver": "0", "data": "0x0078"},
			"reg_0x0078_val":{ "type": "int", "ver": "0", "data": "0x00000009"},
			"reg_0x007C":{ "type": "int", "ver": "0", "data": "0x007C"},
			"reg_0x007C_val":{ "type": "int", "ver": "0", "data": "0xD81C0207"},
			"reg_0x0080":{ "type": "int", "ver": "0", "data": "0x0080"},
			"reg_0x0080_val":{ "type": "int", "ver": "0", "data": "0xFF000000"},
			"reg_0x0084":{ "type": "int", "ver": "0", "data": "0x0084"},
			"reg_0x0084_val":{ "type": "int", "ver": "0", "data": "0x00000000"},
			"reg_0x00A0":{ "type": "int", "ver": "0", "data": "0x00A0"},
			"reg_0x00A0_val":{ "type": "int", "ver": "0", "data": "0xE2842000"},
			"reg_0x00A4":{ "type": "int", "ver": "0", "data": "0x00A4"},
			"reg_0x00A4_val":{ "type": "int", "ver": "0", "data": "0x20000000"},
			"reg_0x00A8":{ "type": "int", "ver": "0", "data": "0x00A8"},
			"reg_0x00A8_val":{ "type": "int", "ver": "0", "data": "0x000408EA"},
			"reg_0x00AC":{ "type": "int", "ver": "0", "data": "0x00AC"},
			"reg_0x00AC_val":{ "type": "int", "ver": "0", "data": "0x00000000"},
			"reg_0x00B0":{ "type": "int", "ver": "0", "data": "0x00B0"},
			"reg_0x00B0_val":{ "type": "int", "ver": "0", "data": "0x00001000"},
			"reg_0x00B8":{ "type": "int", "ver": "0", "data": "0x00B8"},
			"reg_0x00B8_val":{ "type": "int", "ver": "0", "data": "0x00001388"},
			"reg_0x00BC":{ "type": "int", "ver": "0", "data": "0x00BC"},
			"reg_0x00BC_val":{ "type": "int", "ver": "0", "data": "0x00000000"},
			"reg_0x00C0":{ "type": "int", "ver": "0", "data": "0x00C0"},
			"reg_0x00C0_val":{ "type": "int", "ver": "0", "data": "0x00000000"},
			"reg_0x00C4":{ "type": "int", "ver": "0", "data": "0x00C4"},
			"reg_0x00C4_val":{ "type": "int", "ver": "0", "data": "0x00000000"},
			"reg_0x00C8":{ "type": "int", "ver": "0", "data": "0x00C8"},
			"reg_0x00C8_val":{ "type": "int", "ver": "0", "data": "0x00000000"},
			"reg_0x00CC":{ "type": "int", "ver": "0", "data": "0x00CC"},
			"reg_0x00CC_val":{ "type": "int", "ver": "0", "data": "0x00000000"},
			"reg_0x00D0":{ "type": "int", "ver": "0", "data": "0x00D0"},
			"reg_0x00D0_val":{ "type": "int", "ver": "0", "data": "0x00000000"},
			"reg_0x00D4":{ "type": "int", "ver": "0", "data": "0x00D4"},
			"reg_0x00D4_val":{ "type": "int", "ver": "0", "data": "0x00000000"},
			"reg_0x00D8":{ "type": "int", "ver": "0", "data": "0x00D8"},
			"reg_0x00D8_val":{ "type": "int", "ver": "0", "data": "0x00000000"},
			"reg_0x00DC":{ "type": "int", "ver": "0", "data": "0x00DC"},
			"reg_0x00DC_val":{ "type": "int", "ver": "0", "data": "0xE2800000"},
			"reg_0x00E0":{ "type": "int", "ver": "0", "data": "0x00E0"},
			"reg_0x00E0_val":{ "type": "int", "ver": "0", "data": "0x00000000"},
			"reg_0x00E4":{ "type": "int", "ver": "0", "data": "0x00E4"},
			"reg_0x00E4_val":{ "type": "int", "ver": "0", "data": "0x000008D2"},
			"reg_0x00E8":{ "type": "int", "ver": "0", "data": "0x00E8"},
			"reg_0x00E8_val":{ "type": "int", "ver": "0", "data": "0x00000000"},
			"reg_0x00EC":{ "type": "int", "ver": "0", "data": "0x00EC"},
			"reg_0x00EC_val":{ "type": "int", "ver": "0", "data": "0x00000000"},
			"reg_0x00F4":{ "type": "int", "ver": "0", "data": "0x00F4"},
			"reg_0x00F4_val":{ "type": "int", "ver": "0", "data": "0x000F4240"},
			"reg_0x00F8":{ "type": "int", "ver": "0", "data": "0x00F8"},
			"reg_0x00F8_val":{ "type": "int", "ver": "0", "data": "0x00000000"},
			"reg_0x00FC":{ "type": "int", "ver": "0", "data": "0x00FC"},
			"reg_0x00FC_val":{ "type": "int", "ver": "0", "data": "0x00000000"},
			"reg_0x0100":{ "type": "int", "ver": "0", "data": "0x0100"},
			"reg_0x0100_val":{ "type": "int", "ver": "0", "data": "0x00000000"},
			"reg_0x0104":{ "type": "int", "ver": "0", "data": "0x0104"},
			"reg_0x0104_val":{ "type": "int", "ver": "0", "data": "0x00000000"},
			"reg_0x0108":{ "type": "int", "ver": "0", "data": "0x0108"},
			"reg_0x0108_val":{ "type": "int", "ver": "0", "data": "0x00000000"},
			"reg_0x010C":{ "type": "int", "ver": "0", "data": "0x010C"},
			"reg_0x010C_val":{ "type": "int", "ver": "0", "data": "0x00000000"}
		}
	}
}