﻿{
	"centerX" : 0.5,
	"centerY" : 0.5,
	"angle" : 0,
	"scale" : 1,
	"width" : 221,
	"height" : 52,
	"contents" : [{
			"type" : "image",
			"resource":{
                "type":"dynamic",
                "resKey":"{aa}",
                "resources":[
                    {
                        "key":"凌晨",
                        "path":"res/wan an.png"
                    },
                    {
                        "key":"傍晚",
                        "path":"res/wan an.png"
					},
					{
                        "key":"晚上",
                        "path":"res/wan an.png"
                    },
                    {
                        "key":"上午",
                        "path":"res/zao an.png"
                    },{
                        "key":"中午",
                        "path":"res/wu an.png"
                    },
                    {
                        "key":"下午",
                        "path":"res/wu an.png"
                    }
                ]
            },
			"centerX" : 0.5,
			"centerY" : 0.5,
			"width" : 202,
			"height" : 52,
			"angle" : 0,
			"zorder" : 1
		},
		{
			"type" : "image",
			"resource" : {
				"type" : "static",
				"path" : "res/dingwei.png"
			},
			"centerX" : 0.45,
			"centerY" : 0.5,
			"width" : 6,
			"height" : 10,
			"angle" : 0,
			"zorder" : 1
		},
		{
            "type": "text",
            "centerX": 0.72,
            "centerY": 0.5,
            "width": 100,
            "height": 15,
            "angle": 0,
            "color": "#ffffffff",
            "isVertical": 0,
			"alignment": 1,
			"editable":true,
            "text": "{LOCATION}",
            "zorder": 2
		},
		{
            "type": "text",
            "centerX": 0.72,
            "centerY": 0.82,
            "width": 110,
            "height": 12,
            "angle": 0,
            "color": "#ffffffff",
            "isVertical": 0,
			"alignment": 0,
            "text": "{yyyy-MM-dd        aa hh:mm}",
            "zorder": 2
        }
	]
}
