#,version,,,,,,,,,,,,,,,,,,,,,,,,,,,,,,,,,,,,,,,,,,,,,,,,,,,,
2019,8,30,2,,,,,,,,,,,,,,,,,,,,,,,,,,,,,,,,,,,,,,,,,,,,,,,,,,
#,row_col_num,,,,,,,,,,,,,,,,,,,,,,,,,,,,,,,,,,,,,,,,,,,,,,,,,,,,
36,18,,,,,,,,,,,,,,,,,,,,,,,,,,,,,,,,,,,,,,,,,,,,,,,,,,,,
#,noise,,,,,,,,,,,,,,,,,,,,,,,,,,,,,,,,,,,,,,,,,,,,,,,,,,,,
-5000,5000,,,,,,,,,,,,,,,,,,,,,,,,,,,,,,,,,,,,,,,,,,,,,,,,,,,,
#,raw_max,,,,,,,,,,,,,,,,,,,,,,,,,,,,,,,,,,,,,,,,,,,,,,,,,,,,
9470,9778,9835,9853,9855,9580,12000,12000,12000,12000,12000,12000,10677,10064,9971,9940,9889,9632,,,,,,,,,,,,,,,,,,,,,,,,,,,,,,,,,,,,
9815,9758,9755,9753,9754,9765,9778,9773,9772,9772,9773,9775,9744,9757,9761,9761,9768,9869,,,,,,,,,,,,,,,,,,,,,,,,,,,,,,,,,,,,
9806,9755,9751,9750,9751,9756,9756,9756,9753,9753,9753,9750,9727,9747,9751,9750,9760,9850,,,,,,,,,,,,,,,,,,,,,,,,,,,,,,,,,,,,
9803,9750,9747,9745,9745,9750,9751,9750,9747,9747,9747,9744,9722,9742,9746,9746,9755,9841,,,,,,,,,,,,,,,,,,,,,,,,,,,,,,,,,,,,
9799,9745,9741,9739,9739,9744,9745,9744,9741,9740,9741,9739,9716,9737,9741,9745,9747,9835,,,,,,,,,,,,,,,,,,,,,,,,,,,,,,,,,,,,
9785,9740,9738,9735,9736,9740,9742,9740,9737,9737,9737,9736,9713,9734,9737,9739,9756,9819,,,,,,,,,,,,,,,,,,,,,,,,,,,,,,,,,,,,
9777,9737,9735,9733,9733,9738,9740,9738,9735,9735,9735,9734,9711,9731,9735,9735,9739,9807,,,,,,,,,,,,,,,,,,,,,,,,,,,,,,,,,,,,
9768,9732,9730,9728,9728,9733,9735,9734,9731,9731,9732,9729,9706,9726,9729,9729,9733,9796,,,,,,,,,,,,,,,,,,,,,,,,,,,,,,,,,,,,
9758,9724,9722,9720,9720,9726,9728,9727,9724,9724,9725,9722,9698,9718,9721,9720,9724,9783,,,,,,,,,,,,,,,,,,,,,,,,,,,,,,,,,,,,
9752,9720,9718,9717,9717,9723,9725,9724,9721,9721,9722,9719,9695,9716,9717,9716,9720,9774,,,,,,,,,,,,,,,,,,,,,,,,,,,,,,,,,,,,
9736,9703,9701,9700,9700,9706,9709,9708,9704,9706,9705,9702,9678,9697,9700,9699,9702,9756,,,,,,,,,,,,,,,,,,,,,,,,,,,,,,,,,,,,
9725,9693,9693,9691,9691,9698,9702,9701,9697,9697,9697,9696,9669,9689,9691,9690,9691,9742,,,,,,,,,,,,,,,,,,,,,,,,,,,,,,,,,,,,
9709,9683,9684,9683,9683,9690,9693,9693,9689,9689,9689,9686,9660,9679,9683,9680,9681,9725,,,,,,,,,,,,,,,,,,,,,,,,,,,,,,,,,,,,
9703,9678,9679,9678,9678,9685,9689,9689,9685,9685,9686,9682,9655,9674,9676,9675,9675,9716,,,,,,,,,,,,,,,,,,,,,,,,,,,,,,,,,,,,
9691,9665,9665,9664,9664,9671,9676,9675,9672,9672,9671,9668,9641,9660,9662,9662,9661,9699,,,,,,,,,,,,,,,,,,,,,,,,,,,,,,,,,,,,
9664,9646,9647,9646,9645,9652,9658,9657,9654,9658,9654,9651,9623,9641,9643,9691,9700,9681,,,,,,,,,,,,,,,,,,,,,,,,,,,,,,,,,,,,
9643,9631,9632,9631,9630,9638,9643,9643,9639,9639,9638,9635,9609,9626,9627,9625,9625,9642,,,,,,,,,,,,,,,,,,,,,,,,,,,,,,,,,,,,
9635,9622,9622,9620,9620,9628,9634,9633,9629,9629,9629,9625,9597,9614,9615,9613,9614,9633,,,,,,,,,,,,,,,,,,,,,,,,,,,,,,,,,,,,
9622,9617,9617,9616,9615,9623,9630,9630,9627,9625,9624,9621,9591,9609,9609,9607,9607,9617,,,,,,,,,,,,,,,,,,,,,,,,,,,,,,,,,,,,
9601,9601,9602,9601,9601,9609,9616,9617,9612,9610,9610,9606,9575,9593,9594,9592,9591,9589,,,,,,,,,,,,,,,,,,,,,,,,,,,,,,,,,,,,
9863,9855,9859,9856,9857,9864,9870,9870,9867,9864,9863,9859,9831,9845,9847,9846,9846,9844,,,,,,,,,,,,,,,,,,,,,,,,,,,,,,,,,,,,
9852,9847,9848,9847,9848,9857,9862,9861,9858,9855,9854,9850,9821,9835,9836,9836,9835,9829,,,,,,,,,,,,,,,,,,,,,,,,,,,,,,,,,,,,
9836,9836,9838,9836,9838,9845,9854,9852,9849,9846,9844,9841,9811,9825,9825,9824,9823,9809,,,,,,,,,,,,,,,,,,,,,,,,,,,,,,,,,,,,
9816,9820,9822,9823,9823,9830,9839,9837,9834,9831,9830,9826,9796,9809,9810,9808,9806,9784,,,,,,,,,,,,,,,,,,,,,,,,,,,,,,,,,,,,
9805,9803,9805,9804,9805,9813,9822,9820,9817,9814,9813,9809,9778,9791,9792,9791,9790,9770,,,,,,,,,,,,,,,,,,,,,,,,,,,,,,,,,,,,
9791,9791,9792,9790,9794,9800,9809,9808,9805,9802,9800,9796,9764,9778,9779,9780,9778,9754,,,,,,,,,,,,,,,,,,,,,,,,,,,,,,,,,,,,
9808,9846,9779,9821,9779,9788,9798,9796,9793,9790,9788,9784,9752,9765,9766,9768,9764,9726,,,,,,,,,,,,,,,,,,,,,,,,,,,,,,,,,,,,
9744,9761,9764,9763,9764,9773,9783,9782,9778,9775,9774,9770,9736,9749,9751,9755,9748,9703,,,,,,,,,,,,,,,,,,,,,,,,,,,,,,,,,,,,
9727,9745,9748,9747,9748,9757,9768,9767,9763,9760,9758,9754,9720,9733,9735,9738,9732,9685,,,,,,,,,,,,,,,,,,,,,,,,,,,,,,,,,,,,
9715,9737,9737,9737,9737,9747,9758,9756,9753,9750,9748,9743,9709,9722,9728,9726,9722,9671,,,,,,,,,,,,,,,,,,,,,,,,,,,,,,,,,,,,
9690,9713,9716,9720,9716,9726,9737,9736,9732,9729,9727,9723,9687,9700,9709,9704,9702,9647,,,,,,,,,,,,,,,,,,,,,,,,,,,,,,,,,,,,
9662,9690,9691,9689,9690,9700,9711,9710,9706,9703,9701,9697,9661,9674,9685,9679,9677,9618,,,,,,,,,,,,,,,,,,,,,,,,,,,,,,,,,,,,
9646,9665,9670,9669,9669,9680,9692,9691,9686,9683,9681,9677,9640,9654,9664,9659,9657,9604,,,,,,,,,,,,,,,,,,,,,,,,,,,,,,,,,,,,
9625,9649,9650,9649,9650,9660,9673,9672,9667,9664,9662,9658,9621,9640,9641,9640,9639,9582,,,,,,,,,,,,,,,,,,,,,,,,,,,,,,,,,,,,
9609,9622,9626,9625,9626,9637,9651,9650,9646,9642,9640,9635,9598,9621,9617,9618,9619,9570,,,,,,,,,,,,,,,,,,,,,,,,,,,,,,,,,,,,
9749,9965,9990,9973,10000,10014,10045,10054,10055,10056,10062,10061,10027,10054,10050,10055,10043,9805,,,,,,,,,,,,,,,,,,,,,,,,,,,,,,,,,,,,
#,raw_min,,,,,,,,,,,,,,,,,,,,,,,,,,,,,,,,,,,,,,,,,,,,,,,,,,,,
6630,6857,6900,6913,6915,6711,5000,5000,5000,5000,5000,5000,7522,7069,7000,6977,6940,6750,,,,,,,,,,,,,,,,,,,,,,,,,,,,,,,,,,,,
7254,7212,7210,7209,7209,7217,7227,7224,7223,7223,7223,7225,7202,7212,7214,7215,7220,7295,,,,,,,,,,,,,,,,,,,,,,,,,,,,,,,,,,,,
7248,7210,7208,7207,7207,7211,7211,7211,7209,7209,7209,7206,7190,7204,7207,7207,7214,7280,,,,,,,,,,,,,,,,,,,,,,,,,,,,,,,,,,,,
7246,7207,7204,7203,7203,7206,7207,7206,7204,7204,7204,7202,7186,7201,7203,7203,7210,7274,,,,,,,,,,,,,,,,,,,,,,,,,,,,,,,,,,,,
7243,7203,7200,7198,7199,7202,7203,7202,7200,7199,7200,7198,7182,7197,7200,7203,7205,7269,,,,,,,,,,,,,,,,,,,,,,,,,,,,,,,,,,,,
7232,7199,7197,7196,7196,7199,7200,7199,7197,7197,7197,7196,7179,7195,7197,7198,7211,7258,,,,,,,,,,,,,,,,,,,,,,,,,,,,,,,,,,,,
7226,7197,7195,7194,7194,7198,7199,7198,7195,7195,7196,7194,7177,7193,7195,7195,7198,7249,,,,,,,,,,,,,,,,,,,,,,,,,,,,,,,,,,,,
7220,7193,7192,7190,7190,7194,7196,7195,7192,7192,7193,7191,7174,7189,7191,7191,7194,7240,,,,,,,,,,,,,,,,,,,,,,,,,,,,,,,,,,,,
7213,7188,7186,7184,7184,7189,7190,7190,7187,7187,7188,7186,7168,7183,7185,7184,7188,7231,,,,,,,,,,,,,,,,,,,,,,,,,,,,,,,,,,,,
7208,7185,7183,7182,7182,7186,7188,7187,7185,7185,7185,7184,7166,7181,7182,7181,7184,7224,,,,,,,,,,,,,,,,,,,,,,,,,,,,,,,,,,,,
7196,7172,7171,7169,7170,7174,7176,7175,7173,7174,7173,7171,7153,7167,7169,7169,7171,7211,,,,,,,,,,,,,,,,,,,,,,,,,,,,,,,,,,,,
7188,7164,7164,7163,7163,7168,7171,7170,7167,7167,7167,7167,7147,7161,7163,7162,7163,7201,,,,,,,,,,,,,,,,,,,,,,,,,,,,,,,,,,,,
7176,7157,7158,7157,7157,7162,7165,7164,7161,7161,7161,7159,7140,7154,7157,7155,7155,7188,,,,,,,,,,,,,,,,,,,,,,,,,,,,,,,,,,,,
7172,7153,7154,7153,7153,7158,7161,7161,7158,7158,7159,7156,7136,7150,7152,7151,7151,7181,,,,,,,,,,,,,,,,,,,,,,,,,,,,,,,,,,,,
7163,7144,7144,7143,7143,7148,7152,7151,7149,7149,7148,7146,7126,7140,7141,7141,7141,7169,,,,,,,,,,,,,,,,,,,,,,,,,,,,,,,,,,,,
7143,7130,7130,7129,7129,7134,7138,7138,7136,7139,7136,7133,7113,7126,7127,7163,7170,7156,,,,,,,,,,,,,,,,,,,,,,,,,,,,,,,,,,,,
7127,7119,7119,7118,7118,7123,7128,7127,7125,7124,7124,7122,7103,7115,7115,7114,7114,7127,,,,,,,,,,,,,,,,,,,,,,,,,,,,,,,,,,,,
7122,7112,7112,7111,7110,7116,7121,7120,7117,7117,7117,7114,7093,7106,7107,7105,7106,7120,,,,,,,,,,,,,,,,,,,,,,,,,,,,,,,,,,,,
7112,7108,7108,7107,7107,7113,7118,7118,7116,7114,7114,7111,7089,7102,7102,7101,7101,7108,,,,,,,,,,,,,,,,,,,,,,,,,,,,,,,,,,,,
7097,7096,7097,7096,7096,7102,7108,7108,7104,7103,7103,7100,7077,7090,7091,7090,7089,7088,,,,,,,,,,,,,,,,,,,,,,,,,,,,,,,,,,,,
7290,7284,7287,7285,7286,7291,7296,7295,7293,7291,7290,7287,7266,7277,7278,7277,7277,7276,,,,,,,,,,,,,,,,,,,,,,,,,,,,,,,,,,,,
7282,7278,7279,7278,7279,7286,7290,7289,7286,7284,7283,7281,7259,7270,7270,7270,7270,7265,,,,,,,,,,,,,,,,,,,,,,,,,,,,,,,,,,,,
7270,7270,7271,7270,7271,7277,7284,7282,7279,7277,7276,7274,7252,7262,7262,7261,7261,7250,,,,,,,,,,,,,,,,,,,,,,,,,,,,,,,,,,,,
7255,7258,7260,7260,7260,7266,7272,7271,7269,7267,7266,7263,7240,7250,7251,7250,7248,7232,,,,,,,,,,,,,,,,,,,,,,,,,,,,,,,,,,,,
7247,7246,7247,7246,7247,7253,7260,7258,7256,7254,7253,7250,7227,7237,7238,7237,7236,7221,,,,,,,,,,,,,,,,,,,,,,,,,,,,,,,,,,,,
7236,7237,7238,7236,7239,7244,7250,7249,7247,7245,7244,7241,7217,7227,7228,7228,7227,7209,,,,,,,,,,,,,,,,,,,,,,,,,,,,,,,,,,,,
7250,7277,7228,7259,7228,7235,7242,7241,7238,7236,7235,7232,7208,7217,7219,7220,7217,7189,,,,,,,,,,,,,,,,,,,,,,,,,,,,,,,,,,,,
7202,7215,7217,7216,7217,7224,7231,7230,7227,7225,7224,7221,7196,7206,7207,7210,7205,7172,,,,,,,,,,,,,,,,,,,,,,,,,,,,,,,,,,,,
7190,7203,7205,7204,7205,7212,7220,7219,7216,7214,7212,7209,7184,7194,7196,7198,7193,7158,,,,,,,,,,,,,,,,,,,,,,,,,,,,,,,,,,,,
7181,7197,7197,7197,7197,7204,7212,7211,7209,7206,7205,7202,7176,7185,7190,7189,7186,7148,,,,,,,,,,,,,,,,,,,,,,,,,,,,,,,,,,,,
7162,7179,7182,7184,7181,7188,7197,7196,7193,7191,7190,7186,7160,7169,7176,7173,7171,7130,,,,,,,,,,,,,,,,,,,,,,,,,,,,,,,,,,,,
7141,7162,7163,7162,7162,7170,7178,7177,7174,7172,7170,7167,7141,7150,7158,7154,7152,7109,,,,,,,,,,,,,,,,,,,,,,,,,,,,,,,,,,,,
7129,7144,7148,7146,7147,7155,7164,7163,7159,7157,7156,7153,7125,7136,7143,7140,7138,7098,,,,,,,,,,,,,,,,,,,,,,,,,,,,,,,,,,,,
7114,7132,7133,7132,7132,7140,7150,7149,7145,7143,7142,7138,7111,7125,7126,7125,7125,7082,,,,,,,,,,,,,,,,,,,,,,,,,,,,,,,,,,,,
7102,7112,7115,7114,7115,7123,7133,7132,7129,7127,7125,7122,7094,7111,7108,7109,7110,7074,,,,,,,,,,,,,,,,,,,,,,,,,,,,,,,,,,,,
7132,7292,7310,7297,7317,7328,7350,7357,7358,7359,7363,7362,7338,7357,7354,7358,7349,7173,,,,,,,,,,,,,,,,,,,,,,,,,,,,,,,,,,,,
#,raw_row_delta_max,,,,,,,,,,,,,,,,,,,,,,,,,,,,,,,,,,,,,,,,,,,,,,,,,,,,
1043,781,729,712,716,895,2000,2000,2000,2000,2000,2000,650,546,623,646,696,946,,,,,,,,,,,,,,,,,,,,,,,,,,,,,,,,,,,,
238,246,249,250,250,252,253,269,270,270,268,255,247,246,245,244,245,231,,,,,,,,,,,,,,,,,,,,,,,,,,,,,,,,,,,,
263,258,257,257,257,258,258,260,258,258,258,256,257,256,256,255,255,257,,,,,,,,,,,,,,,,,,,,,,,,,,,,,,,,,,,,
256,235,238,237,238,238,240,242,241,241,240,242,241,240,239,242,232,256,,,,,,,,,,,,,,,,,,,,,,,,,,,,,,,,,,,,
230,242,245,245,247,247,250,251,250,250,249,250,248,248,248,244,253,231,,,,,,,,,,,,,,,,,,,,,,,,,,,,,,,,,,,,
239,242,246,244,246,245,247,246,245,244,245,247,244,245,246,244,230,236,,,,,,,,,,,,,,,,,,,,,,,,,,,,,,,,,,,,
241,238,239,239,242,240,243,242,243,244,244,242,241,240,242,239,239,239,,,,,,,,,,,,,,,,,,,,,,,,,,,,,,,,,,,,
241,237,234,233,235,235,237,236,237,238,238,236,236,235,236,235,234,236,,,,,,,,,,,,,,,,,,,,,,,,,,,,,,,,,,,,
262,259,259,259,261,260,262,262,261,261,261,262,260,262,261,259,258,255,,,,,,,,,,,,,,,,,,,,,,,,,,,,,,,,,,,,
256,238,237,236,238,241,240,239,239,241,239,240,241,237,238,238,238,254,,,,,,,,,,,,,,,,,,,,,,,,,,,,,,,,,,,,
246,235,238,236,236,237,237,236,237,235,236,238,237,234,233,233,232,240,,,,,,,,,,,,,,,,,,,,,,,,,,,,,,,,,,,,
246,240,241,241,242,243,241,240,241,240,242,241,243,240,239,239,240,243,,,,,,,,,,,,,,,,,,,,,,,,,,,,,,,,,,,,
242,240,240,241,241,241,242,240,242,240,243,241,241,238,236,238,238,237,,,,,,,,,,,,,,,,,,,,,,,,,,,,,,,,,,,,
242,245,247,249,247,249,249,251,249,249,250,250,249,247,247,246,245,238,,,,,,,,,,,,,,,,,,,,,,,,,,,,,,,,,,,,
237,237,238,239,237,239,241,241,242,246,241,241,239,237,237,277,287,246,,,,,,,,,,,,,,,,,,,,,,,,,,,,,,,,,,,,
233,235,232,232,235,235,236,234,234,232,233,233,235,233,232,193,185,219,,,,,,,,,,,,,,,,,,,,,,,,,,,,,,,,,,,,
242,242,242,242,244,243,243,244,243,243,243,243,242,243,242,242,241,240,,,,,,,,,,,,,,,,,,,,,,,,,,,,,,,,,,,,
232,240,238,238,240,240,240,239,241,241,240,241,242,241,240,240,240,229,,,,,,,,,,,,,,,,,,,,,,,,,,,,,,,,,,,,
231,238,238,239,241,240,239,238,237,238,237,238,241,238,238,238,238,228,,,,,,,,,,,,,,,,,,,,,,,,,,,,,,,,,,,,
513,510,507,507,510,510,509,509,511,511,512,510,511,507,505,505,508,509,,,,,,,,,,,,,,,,,,,,,,,,,,,,,,,,,,,,
265,271,267,271,272,272,271,272,271,271,272,271,271,271,270,269,267,263,,,,,,,,,,,,,,,,,,,,,,,,,,,,,,,,,,,,
259,255,254,256,258,257,259,258,258,260,259,258,256,253,255,255,255,259,,,,,,,,,,,,,,,,,,,,,,,,,,,,,,,,,,,,
232,235,235,238,235,235,233,235,235,235,236,237,236,234,234,236,235,229,,,,,,,,,,,,,,,,,,,,,,,,,,,,,,,,,,,,
247,251,251,252,253,254,255,256,254,254,253,255,255,252,252,254,253,245,,,,,,,,,,,,,,,,,,,,,,,,,,,,,,,,,,,,
251,239,241,240,244,241,240,239,241,241,239,239,239,239,238,239,236,248,,,,,,,,,,,,,,,,,,,,,,,,,,,,,,,,,,,,
281,320,262,301,261,263,267,264,265,266,264,264,268,264,261,263,259,239,,,,,,,,,,,,,,,,,,,,,,,,,,,,,,,,,,,,
188,172,237,195,234,236,235,235,236,236,236,235,235,233,234,234,234,226,,,,,,,,,,,,,,,,,,,,,,,,,,,,,,,,,,,,
239,232,231,230,232,233,233,233,234,234,235,234,235,233,232,230,233,240,,,,,,,,,,,,,,,,,,,,,,,,,,,,,,,,,,,,
256,253,248,252,250,250,249,251,249,249,250,249,249,248,252,250,251,255,,,,,,,,,,,,,,,,,,,,,,,,,,,,,,,,,,,,
246,241,241,244,242,241,244,245,243,243,244,244,244,242,243,242,244,244,,,,,,,,,,,,,,,,,,,,,,,,,,,,,,,,,,,,
245,239,235,232,236,233,234,234,234,234,232,233,236,235,235,235,238,250,,,,,,,,,,,,,,,,,,,,,,,,,,,,,,,,,,,,
256,237,242,242,244,246,247,247,249,248,249,246,247,246,244,245,245,262,,,,,,,,,,,,,,,,,,,,,,,,,,,,,,,,,,,,
241,245,243,243,245,246,245,246,246,246,247,246,246,250,243,245,247,242,,,,,,,,,,,,,,,,,,,,,,,,,,,,,,,,,,,,
241,236,242,243,243,244,244,244,244,245,245,245,245,248,242,243,241,240,,,,,,,,,,,,,,,,,,,,,,,,,,,,,,,,,,,,
307,540,577,557,588,598,615,629,633,636,647,652,658,654,650,653,624,398,,,,,,,,,,,,,,,,,,,,,,,,,,,,,,,,,,,,
#,raw_row_delta_min,,,,,,,,,,,,,,,,,,,,,,,,,,,,,,,,,,,,,,,,,,,,,,,,,,,,
-253,-446,-499,-517,-523,-205,-2000,-2000,-2000,-2000,-2000,-2000,-1292,-711,-619,-587,-537,-264,,,,,,,,,,,,,,,,,,,,,,,,,,,,,,,,,,,,
-253,-252,-254,-255,-255,-268,-290,-299,-302,-304,-302,-299,-277,-263,-263,-263,-258,-264,,,,,,,,,,,,,,,,,,,,,,,,,,,,,,,,,,,,
-268,-266,-266,-267,-266,-268,-268,-272,-269,-270,-269,-265,-266,-264,-264,-263,-263,-273,,,,,,,,,,,,,,,,,,,,,,,,,,,,,,,,,,,,
-263,-244,-247,-247,-248,-248,-250,-252,-252,-252,-251,-252,-250,-249,-248,-244,-246,-266,,,,,,,,,,,,,,,,,,,,,,,,,,,,,,,,,,,,
-256,-251,-251,-251,-253,-254,-256,-257,-257,-256,-255,-255,-254,-253,-254,-254,-237,-258,,,,,,,,,,,,,,,,,,,,,,,,,,,,,,,,,,,,
-253,-247,-251,-248,-250,-249,-251,-250,-249,-248,-248,-250,-248,-249,-251,-251,-261,-257,,,,,,,,,,,,,,,,,,,,,,,,,,,,,,,,,,,,
-256,-247,-248,-247,-251,-248,-251,-249,-250,-251,-250,-249,-249,-249,-251,-249,-250,-259,,,,,,,,,,,,,,,,,,,,,,,,,,,,,,,,,,,,
-258,-251,-248,-247,-248,-248,-250,-248,-249,-250,-250,-249,-250,-250,-251,-250,-250,-258,,,,,,,,,,,,,,,,,,,,,,,,,,,,,,,,,,,,
-273,-266,-266,-265,-267,-266,-267,-267,-266,-267,-267,-268,-266,-265,-268,-266,-266,-271,,,,,,,,,,,,,,,,,,,,,,,,,,,,,,,,,,,,
-284,-269,-266,-266,-267,-270,-269,-267,-268,-267,-269,-269,-271,-270,-268,-267,-268,-286,,,,,,,,,,,,,,,,,,,,,,,,,,,,,,,,,,,,
-265,-252,-252,-250,-250,-250,-249,-248,-249,-251,-249,-249,-251,-248,-248,-249,-250,-263,,,,,,,,,,,,,,,,,,,,,,,,,,,,,,,,,,,,
-273,-257,-256,-256,-257,-258,-255,-254,-255,-254,-256,-258,-259,-256,-253,-256,-259,-274,,,,,,,,,,,,,,,,,,,,,,,,,,,,,,,,,,,,
-252,-249,-249,-250,-250,-250,-249,-248,-249,-247,-247,-249,-250,-248,-249,-248,-248,-252,,,,,,,,,,,,,,,,,,,,,,,,,,,,,,,,,,,,
-264,-268,-272,-273,-271,-273,-272,-274,-273,-272,-276,-273,-274,-271,-272,-268,-269,-266,,,,,,,,,,,,,,,,,,,,,,,,,,,,,,,,,,,,
-283,-270,-269,-270,-269,-272,-273,-272,-272,-269,-271,-272,-270,-270,-269,-227,-218,-278,,,,,,,,,,,,,,,,,,,,,,,,,,,,,,,,,,,,
-270,-262,-258,-259,-261,-260,-261,-259,-260,-265,-260,-260,-259,-260,-260,-308,-316,-286,,,,,,,,,,,,,,,,,,,,,,,,,,,,,,,,,,,,
-256,-259,-260,-260,-262,-260,-260,-261,-260,-261,-260,-260,-264,-262,-263,-263,-260,-256,,,,,,,,,,,,,,,,,,,,,,,,,,,,,,,,,,,,
-255,-249,-246,-247,-248,-248,-246,-245,-244,-247,-247,-248,-252,-251,-250,-251,-251,-258,,,,,,,,,,,,,,,,,,,,,,,,,,,,,,,,,,,,
-267,-265,-264,-265,-267,-265,-263,-261,-265,-262,-263,-264,-268,-266,-265,-265,-267,-275,,,,,,,,,,,,,,,,,,,,,,,,,,,,,,,,,,,,
-58,-68,-61,-65,-64,-66,-67,-69,-68,-70,-72,-69,-67,-67,-64,-62,-64,-67,,,,,,,,,,,,,,,,,,,,,,,,,,,,,,,,,,,,
-284,-286,-286,-286,-287,-284,-285,-286,-286,-287,-287,-287,-288,-289,-288,-287,-285,-289,,,,,,,,,,,,,,,,,,,,,,,,,,,,,,,,,,,,
-287,-274,-272,-274,-276,-278,-272,-274,-274,-276,-276,-275,-274,-272,-274,-275,-276,-293,,,,,,,,,,,,,,,,,,,,,,,,,,,,,,,,,,,,
-267,-263,-262,-262,-262,-261,-261,-261,-260,-260,-261,-262,-262,-261,-262,-263,-264,-272,,,,,,,,,,,,,,,,,,,,,,,,,,,,,,,,,,,,
-266,-280,-281,-285,-283,-284,-284,-285,-283,-284,-283,-285,-286,-283,-283,-284,-282,-271,,,,,,,,,,,,,,,,,,,,,,,,,,,,,,,,,,,,
-276,-261,-263,-263,-263,-263,-262,-261,-262,-263,-261,-260,-262,-262,-261,-259,-258,-276,,,,,,,,,,,,,,,,,,,,,,,,,,,,,,,,,,,,
-250,-224,-284,-249,-287,-284,-287,-284,-286,-286,-284,-285,-289,-287,-283,-283,-282,-287,,,,,,,,,,,,,,,,,,,,,,,,,,,,,,,,,,,,
-299,-318,-263,-296,-261,-262,-261,-260,-262,-261,-261,-260,-262,-261,-261,-257,-261,-265,,,,,,,,,,,,,,,,,,,,,,,,,,,,,,,,,,,,
-268,-259,-259,-258,-260,-260,-259,-259,-261,-261,-262,-261,-263,-262,-259,-260,-261,-272,,,,,,,,,,,,,,,,,,,,,,,,,,,,,,,,,,,,
-277,-267,-267,-268,-268,-269,-266,-268,-267,-266,-268,-267,-269,-268,-265,-271,-268,-278,,,,,,,,,,,,,,,,,,,,,,,,,,,,,,,,,,,,
-290,-282,-277,-275,-279,-277,-280,-281,-280,-279,-280,-280,-282,-279,-276,-280,-279,-288,,,,,,,,,,,,,,,,,,,,,,,,,,,,,,,,,,,,
-295,-279,-279,-286,-281,-278,-279,-278,-279,-278,-278,-278,-281,-280,-278,-280,-283,-299,,,,,,,,,,,,,,,,,,,,,,,,,,,,,,,,,,,,
-284,-281,-278,-278,-279,-281,-281,-281,-283,-282,-283,-281,-282,-280,-280,-279,-278,-287,,,,,,,,,,,,,,,,,,,,,,,,,,,,,,,,,,,,
-277,-273,-279,-277,-280,-280,-278,-278,-279,-278,-280,-279,-280,-276,-282,-279,-279,-280,,,,,,,,,,,,,,,,,,,,,,,,,,,,,,,,,,,,
-268,-284,-284,-285,-284,-284,-283,-283,-282,-283,-284,-285,-285,-281,-284,-282,-276,-260,,,,,,,,,,,,,,,,,,,,,,,,,,,,,,,,,,,,
-239,-117,-117,-125,-112,-116,-105,-100,-95,-90,-87,-86,-84,-75,-70,-67,-61,-164,,,,,,,,,,,,,,,,,,,,,,,,,,,,,,,,,,,,
#,raw_col_delta_max,,,,,,,,,,,,,,,,,,,,,,,,,,,,,,,,,,,,,,,,,,,,,,,,,,,,
605,190,200,174,558,836,2000,2000,2000,2000,2000,2000,649,180,172,181,456,,,,,,,,,,,,,,,,,,,,,,,,,,,,,,,,,,,,,
187,165,177,172,176,240,225,171,171,168,243,228,190,174,165,163,260,,,,,,,,,,,,,,,,,,,,,,,,,,,,,,,,,,,,,
188,160,166,165,175,185,162,169,160,161,180,192,184,163,166,165,228,,,,,,,,,,,,,,,,,,,,,,,,,,,,,,,,,,,,,
177,161,165,168,172,185,169,169,161,165,172,193,179,163,160,156,229,,,,,,,,,,,,,,,,,,,,,,,,,,,,,,,,,,,,,
181,161,169,156,165,186,170,172,163,170,176,187,173,162,161,161,232,,,,,,,,,,,,,,,,,,,,,,,,,,,,,,,,,,,,,
177,163,166,160,169,178,165,165,154,166,165,188,171,160,163,158,226,,,,,,,,,,,,,,,,,,,,,,,,,,,,,,,,,,,,,
178,161,163,164,167,185,155,157,153,159,163,189,175,161,161,161,215,,,,,,,,,,,,,,,,,,,,,,,,,,,,,,,,,,,,,
175,161,159,159,165,176,156,154,157,159,164,186,173,164,157,156,211,,,,,,,,,,,,,,,,,,,,,,,,,,,,,,,,,,,,,
175,161,162,155,163,174,156,161,153,155,158,184,170,160,159,156,205,,,,,,,,,,,,,,,,,,,,,,,,,,,,,,,,,,,,,
169,155,164,152,163,175,156,155,157,157,156,185,171,161,158,159,203,,,,,,,,,,,,,,,,,,,,,,,,,,,,,,,,,,,,,
172,155,162,154,168,175,156,153,153,161,156,184,167,158,154,158,199,,,,,,,,,,,,,,,,,,,,,,,,,,,,,,,,,,,,,
167,157,160,151,159,176,153,153,153,156,161,182,165,157,154,157,197,,,,,,,,,,,,,,,,,,,,,,,,,,,,,,,,,,,,,
168,158,164,153,164,176,153,152,152,156,159,179,164,158,157,157,191,,,,,,,,,,,,,,,,,,,,,,,,,,,,,,,,,,,,,
169,182,160,157,161,177,201,201,153,160,154,180,164,155,173,173,229,,,,,,,,,,,,,,,,,,,,,,,,,,,,,,,,,,,,,
169,153,156,151,163,181,153,151,154,153,155,181,166,155,153,159,188,,,,,,,,,,,,,,,,,,,,,,,,,,,,,,,,,,,,,
167,153,156,152,162,179,151,154,299,300,159,183,162,196,198,188,170,,,,,,,,,,,,,,,,,,,,,,,,,,,,,,,,,,,,,
168,155,158,151,161,176,154,239,251,156,153,185,164,157,157,161,179,,,,,,,,,,,,,,,,,,,,,,,,,,,,,,,,,,,,,
173,153,159,152,160,176,149,152,155,155,153,179,164,158,160,167,178,,,,,,,,,,,,,,,,,,,,,,,,,,,,,,,,,,,,,
173,152,157,150,160,180,152,155,154,152,151,182,163,193,198,202,190,,,,,,,,,,,,,,,,,,,,,,,,,,,,,,,,,,,,,
174,155,155,151,162,177,149,151,153,154,154,183,163,158,152,168,171,,,,,,,,,,,,,,,,,,,,,,,,,,,,,,,,,,,,,
171,151,155,149,162,178,152,152,152,151,155,181,164,155,151,161,169,,,,,,,,,,,,,,,,,,,,,,,,,,,,,,,,,,,,,
167,149,155,153,161,179,149,152,151,154,154,185,168,156,151,155,166,,,,,,,,,,,,,,,,,,,,,,,,,,,,,,,,,,,,,
169,149,156,153,162,181,153,153,152,156,155,190,168,154,151,155,164,,,,,,,,,,,,,,,,,,,,,,,,,,,,,,,,,,,,,
170,149,157,155,159,181,152,153,152,154,155,187,168,156,156,161,161,,,,,,,,,,,,,,,,,,,,,,,,,,,,,,,,,,,,,
168,150,155,153,162,179,151,150,153,153,155,188,167,158,155,159,165,,,,,,,,,,,,,,,,,,,,,,,,,,,,,,,,,,,,,
170,150,155,157,161,179,151,152,153,153,156,192,170,157,155,160,173,,,,,,,,,,,,,,,,,,,,,,,,,,,,,,,,,,,,,
174,152,158,153,167,183,152,153,152,156,157,193,176,155,162,160,181,,,,,,,,,,,,,,,,,,,,,,,,,,,,,,,,,,,,,
176,153,158,157,165,183,154,153,153,158,160,192,177,156,161,171,193,,,,,,,,,,,,,,,,,,,,,,,,,,,,,,,,,,,,,
172,156,157,155,167,187,156,155,153,154,162,198,175,156,160,166,187,,,,,,,,,,,,,,,,,,,,,,,,,,,,,,,,,,,,,
175,159,160,163,163,192,157,154,155,155,162,196,176,154,161,162,186,,,,,,,,,,,,,,,,,,,,,,,,,,,,,,,,,,,,,
180,159,160,159,166,186,157,152,154,156,166,201,178,158,162,167,201,,,,,,,,,,,,,,,,,,,,,,,,,,,,,,,,,,,,,
182,157,164,161,174,197,157,158,153,161,170,207,179,185,187,177,219,,,,,,,,,,,,,,,,,,,,,,,,,,,,,,,,,,,,,
185,159,163,159,170,189,159,162,164,158,169,212,186,158,169,170,204,,,,,,,,,,,,,,,,,,,,,,,,,,,,,,,,,,,,,
193,158,166,165,168,192,159,158,157,160,179,207,190,162,163,182,234,,,,,,,,,,,,,,,,,,,,,,,,,,,,,,,,,,,,,
197,164,169,165,172,195,163,159,158,159,175,211,192,168,165,163,211,,,,,,,,,,,,,,,,,,,,,,,,,,,,,,,,,,,,,
402,170,221,193,202,214,169,172,168,165,179,216,196,170,182,273,512,,,,,,,,,,,,,,,,,,,,,,,,,,,,,,,,,,,,,
#,raw_col_delta_min,,,,,,,,,,,,,,,,,,,,,,,,,,,,,,,,,,,,,,,,,,,,,,,,,,,,
-605,-190,-200,-174,-558,-836,-2000,-2000,-2000,-2000,-2000,-2000,-649,-180,-172,-181,-456,,,,,,,,,,,,,,,,,,,,,,,,,,,,,,,,,,,,,
-187,-165,-177,-172,-176,-240,-225,-171,-171,-168,-243,-228,-190,-174,-165,-163,-260,,,,,,,,,,,,,,,,,,,,,,,,,,,,,,,,,,,,,
-188,-160,-166,-165,-175,-185,-162,-169,-160,-161,-180,-192,-184,-163,-166,-165,-228,,,,,,,,,,,,,,,,,,,,,,,,,,,,,,,,,,,,,
-177,-161,-165,-168,-172,-185,-169,-169,-161,-165,-172,-193,-179,-163,-160,-156,-229,,,,,,,,,,,,,,,,,,,,,,,,,,,,,,,,,,,,,
-181,-161,-169,-156,-165,-186,-170,-172,-163,-170,-176,-187,-173,-162,-161,-161,-232,,,,,,,,,,,,,,,,,,,,,,,,,,,,,,,,,,,,,
-177,-163,-166,-160,-169,-178,-165,-165,-154,-166,-165,-188,-171,-160,-163,-158,-226,,,,,,,,,,,,,,,,,,,,,,,,,,,,,,,,,,,,,
-178,-161,-163,-164,-167,-185,-155,-157,-153,-159,-163,-189,-175,-161,-161,-161,-215,,,,,,,,,,,,,,,,,,,,,,,,,,,,,,,,,,,,,
-175,-161,-159,-159,-165,-176,-156,-154,-157,-159,-164,-186,-173,-164,-157,-156,-211,,,,,,,,,,,,,,,,,,,,,,,,,,,,,,,,,,,,,
-175,-161,-162,-155,-163,-174,-156,-161,-153,-155,-158,-184,-170,-160,-159,-156,-205,,,,,,,,,,,,,,,,,,,,,,,,,,,,,,,,,,,,,
-169,-155,-164,-152,-163,-175,-156,-155,-157,-157,-156,-185,-171,-161,-158,-159,-203,,,,,,,,,,,,,,,,,,,,,,,,,,,,,,,,,,,,,
-172,-155,-162,-154,-168,-175,-156,-153,-153,-161,-156,-184,-167,-158,-154,-158,-199,,,,,,,,,,,,,,,,,,,,,,,,,,,,,,,,,,,,,
-167,-157,-160,-151,-159,-176,-153,-153,-153,-156,-161,-182,-165,-157,-154,-157,-197,,,,,,,,,,,,,,,,,,,,,,,,,,,,,,,,,,,,,
-168,-158,-164,-153,-164,-176,-153,-152,-152,-156,-159,-179,-164,-158,-157,-157,-191,,,,,,,,,,,,,,,,,,,,,,,,,,,,,,,,,,,,,
-169,-182,-160,-157,-161,-177,-201,-201,-153,-160,-154,-180,-164,-155,-173,-173,-229,,,,,,,,,,,,,,,,,,,,,,,,,,,,,,,,,,,,,
-169,-153,-156,-151,-163,-181,-153,-151,-154,-153,-155,-181,-166,-155,-153,-159,-188,,,,,,,,,,,,,,,,,,,,,,,,,,,,,,,,,,,,,
-167,-153,-156,-152,-162,-179,-151,-154,-299,-300,-159,-183,-162,-196,-198,-188,-170,,,,,,,,,,,,,,,,,,,,,,,,,,,,,,,,,,,,,
-168,-155,-158,-151,-161,-176,-154,-239,-251,-156,-153,-185,-164,-157,-157,-161,-179,,,,,,,,,,,,,,,,,,,,,,,,,,,,,,,,,,,,,
-173,-153,-159,-152,-160,-176,-149,-152,-155,-155,-153,-179,-164,-158,-160,-167,-178,,,,,,,,,,,,,,,,,,,,,,,,,,,,,,,,,,,,,
-173,-152,-157,-150,-160,-180,-152,-155,-154,-152,-151,-182,-163,-193,-198,-202,-190,,,,,,,,,,,,,,,,,,,,,,,,,,,,,,,,,,,,,
-174,-155,-155,-151,-162,-177,-149,-151,-153,-154,-154,-183,-163,-158,-152,-168,-171,,,,,,,,,,,,,,,,,,,,,,,,,,,,,,,,,,,,,
-171,-151,-155,-149,-162,-178,-152,-152,-152,-151,-155,-181,-164,-155,-151,-161,-169,,,,,,,,,,,,,,,,,,,,,,,,,,,,,,,,,,,,,
-167,-149,-155,-153,-161,-179,-149,-152,-151,-154,-154,-185,-168,-156,-151,-155,-166,,,,,,,,,,,,,,,,,,,,,,,,,,,,,,,,,,,,,
-169,-149,-156,-153,-162,-181,-153,-153,-152,-156,-155,-190,-168,-154,-151,-155,-164,,,,,,,,,,,,,,,,,,,,,,,,,,,,,,,,,,,,,
-170,-149,-157,-155,-159,-181,-152,-153,-152,-154,-155,-187,-168,-156,-156,-161,-161,,,,,,,,,,,,,,,,,,,,,,,,,,,,,,,,,,,,,
-168,-150,-155,-153,-162,-179,-151,-150,-153,-153,-155,-188,-167,-158,-155,-159,-165,,,,,,,,,,,,,,,,,,,,,,,,,,,,,,,,,,,,,
-170,-150,-155,-157,-161,-179,-151,-152,-153,-153,-156,-192,-170,-157,-155,-160,-173,,,,,,,,,,,,,,,,,,,,,,,,,,,,,,,,,,,,,
-174,-152,-158,-153,-167,-183,-152,-153,-152,-156,-157,-193,-176,-155,-162,-160,-181,,,,,,,,,,,,,,,,,,,,,,,,,,,,,,,,,,,,,
-176,-153,-158,-157,-165,-183,-154,-153,-153,-158,-160,-192,-177,-156,-161,-171,-193,,,,,,,,,,,,,,,,,,,,,,,,,,,,,,,,,,,,,
-172,-156,-157,-155,-167,-187,-156,-155,-153,-154,-162,-198,-175,-156,-160,-166,-187,,,,,,,,,,,,,,,,,,,,,,,,,,,,,,,,,,,,,
-175,-159,-160,-163,-163,-192,-157,-154,-155,-155,-162,-196,-176,-154,-161,-162,-186,,,,,,,,,,,,,,,,,,,,,,,,,,,,,,,,,,,,,
-180,-159,-160,-159,-166,-186,-157,-152,-154,-156,-166,-201,-178,-158,-162,-167,-201,,,,,,,,,,,,,,,,,,,,,,,,,,,,,,,,,,,,,
-182,-157,-164,-161,-174,-197,-157,-158,-153,-161,-170,-207,-179,-185,-187,-177,-219,,,,,,,,,,,,,,,,,,,,,,,,,,,,,,,,,,,,,
-185,-159,-163,-159,-170,-189,-159,-162,-164,-158,-169,-212,-186,-158,-169,-170,-204,,,,,,,,,,,,,,,,,,,,,,,,,,,,,,,,,,,,,
-193,-158,-166,-165,-168,-192,-159,-158,-157,-160,-179,-207,-190,-162,-163,-182,-234,,,,,,,,,,,,,,,,,,,,,,,,,,,,,,,,,,,,,
-197,-164,-169,-165,-172,-195,-163,-159,-158,-159,-175,-211,-192,-168,-165,-163,-211,,,,,,,,,,,,,,,,,,,,,,,,,,,,,,,,,,,,,
-402,-170,-221,-193,-202,-214,-169,-172,-168,-165,-179,-216,-196,-170,-182,-273,-512,,,,,,,,,,,,,,,,,,,,,,,,,,,,,,,,,,,,,
#,line_max,,,,,,,,,,,,,,,,,,,,,,,,,,,,,,,,,,,,,,,,,,,,,,,,,,,,
58000,58000,58000,58000,58000,58000,58000,58000,58000,58000,58000,58000,58000,58000,58000,58000,58000,58000,58000,58000,58000,58000,58000,58000,58000,58000,58000,58000,58000,58000,58000,58000,58000,58000,58000,58000,58000,58000,58000,58000,58000,58000,58000,58000,58000,58000,58000,58000,58000,58000,58000,58000,58000,58000
#,line_min,,,,,,,,,,,,,,,,,,,,,,,,,,,,,,,,,,,,,,,,,,,,,,,,,,,,
10000,10000,10000,10000,10000,10000,10000,10000,10000,10000,10000,10000,10000,10000,10000,10000,10000,10000,10000,10000,10000,10000,10000,10000,10000,10000,10000,10000,10000,10000,10000,10000,10000,10000,10000,10000,10000,10000,10000,10000,10000,10000,10000,10000,10000,10000,10000,10000,10000,10000,10000,10000,10000,10000
