{
    "systemCapability":[
        {
            "name":"SystemCapability.Account.AppAccount",
            "register-on-startup":true
        },
        {
            "name":"SystemCapability.Account.OsAccount",
            "register-on-startup":true
        },
        {
            "name":"SystemCapability.Dms.Samgr",
            "register-on-startup":true
        },
        {
            "name":"SystemCapability.Dms.Fwk",
            "register-on-startup":true
        },
        {
            "name":"SystemCapability.Dms.Safwk",
            "register-on-startup":true
        },
        {
            "name":"SystemCapability.Foundation.Server",
            "register-on-startup":true
        },
        {
            "name":"SystemCapability.Data.DistributedDataMgr",
            "register-on-startup":true
        },
        {
            "name":"SystemCapability.Data.AppDataMgr",
            "register-on-startup":true
        },
        {
            "name":"SystemCapability.Data.AppDataMgr.JsStorage",
            "register-on-startup":true
        },
        {
            "name":"SystemCapability.Data.Search",
            "register-on-startup":true
        },
        {
            "name":"SystemCapability.Ressched.BackgroundTaskMgr",
            "register-on-startup":true
        },
        {
            "name":"SystemCapability.Ressched.WorkScheduler",
            "register-on-startup":true
        },
        {
            "name":"SystemCapability.Ressched.SchedulerPolicy",
            "register-on-startup":true
        },
        {
            "name":"SystemCapability.Ressched.StorageInfo",
            "register-on-startup":true
        },
        {
            "name":"SystemCapability.Ressched.BundleActive",
            "register-on-startup":true
        },
        {
            "name":"SystemCapability.Ressched.SchedService",
            "register-on-startup":true
        },
        {
            "name":"SystemCapability.Ivi",
            "register-on-startup":false
        },
        {
            "name":"SystemCapability.Ivi.DrivingSafety",
            "register-on-startup":true
        },
        {
            "name":"SystemCapability.Ivi.VehicleControl",
            "register-on-startup":false
        },
        {
            "name":"SystemCapability.Ivi.ADAS",
            "register-on-startup":false
        },
        {
            "name":"SystemCapability.Ivi.TBOX",
            "register-on-startup":false
        },
        {
            "name":"SystemCapability.Ivi.Cluster",
            "register-on-startup":false
        },
        {
            "name":"SystemCapability.Usb.UsbManager",
            "register-on-startup":true
        },
        {
            "name":"SystemCapability.Aafwk.AbilityJet",
            "register-on-startup":true
        },
        {
            "name":"SystemCapability.Aafwk.Ability",
            "register-on-startup":true
        },
        {
            "name":"SystemCapability.Aafwk.Intent",
            "register-on-startup":true
        },
        {
            "name":"SystemCapability.Developtools.Bytrace",
            "register-on-startup":true
        },
        {
            "name":"SystemCapability.Sensors.Sensor",
            "register-on-startup":true
        },
        {
            "name":"SystemCapability.Sensors.MiscDevice",
            "register-on-startup":true
        },
        {
            "name":"SystemCapability.HiviewDFX.HiLog",
            "register-on-startup":true
        },
        {
            "name":"SystemCapability.HiviewDFX.HiTrace",
            "register-on-startup":true
        },
        {
            "name":"SystemCapability.Startup.SysInfo",
            "register-on-startup":true
        },
        {
            "name":"SystemCapability.Startup.Restore",
            "register-on-startup":true
        },
        {
            "name":"SystemCapability.PowerMgr.BatteryManager",
            "register-on-startup":true
        },
        {
            "name":"SystemCapability.PowerMgr.PowerManager",
            "register-on-startup":true
        },
        {
            "name":"SystemCapability.PowerMgr.ThermalManager",
            "register-on-startup":true
        },
        {
            "name":"SystemCapability.PowerMgr.BatteryStatistics",
            "register-on-startup":true
        },
        {
            "name":"SystemCapability.PowerMgr.DisplayManager",
            "register-on-startup":true
        },
        {
            "name":"SystemCapability.Communication.NetManager",
            "register-on-startup":true
        },
        {
            "name":"SystemCapability.Telephony.Telephony",
            "register-on-startup":false
        },
        {
            "name":"SystemCapability.Telephony.DCall",
            "register-on-startup":false
        },
        {
            "name":"SystemCapability.Notification.ANS",
            "register-on-startup":true
        },
        {
            "name":"SystemCapability.Notification.CES",
            "register-on-startup":true
        },
        {
            "name":"SystemCapability.Accessibility.Ability",
            "register-on-startup":true
        },
        {
            "name":"SystemCapability.MiscServices.Download",
            "register-on-startup":true
        },
        {
            "name":"SystemCapability.MiscServices.Wallpaper",
            "register-on-startup":true
        },
        {
            "name":"SystemCapability.MiscServices.Time",
            "register-on-startup":true
        },
        {
            "name":"SystemCapability.MiscServices.Screensaver",
            "register-on-startup":true
        },
        {
            "name":"SystemCapability.MiscServices.Pasteboard",
            "register-on-startup":true
        },
		{
            "name": "SystemCapability.MiscServices.ScreenLock",
            "register-on-startup": true
        },
        {
            "name":"SystemCapability.Location",
            "register-on-startup":true
        },
        {
            "name":"SystemCapability.Location.Fine",
            "register-on-startup":true
        },
        {
            "name":"SystemCapability.Location.Coarse",
            "register-on-startup":true
        },
        {
            "name":"SystemCapability.Location.Geocode",
            "register-on-startup":true
        },
        {
            "name":"SystemCapability.Communication.SoftBus",
            "register-on-startup":true
        },
        {
            "name":"SystemCapability.SysAppComponents.Contact",
            "register-on-startup":true
        },
        {
            "name":"SystemCapability.Ivi.DFT",
            "register-on-startup":false
        }
    ]
}
