﻿{
	"centerX" : 0.5,
	"centerY" : 0.5,
	"angle" : 0,
	"scale" : 1,
	"width" : 312,
	"height" : 140,
	"contents" : [
        {
			"type" : "image",
			"resource" : {
				"type" : "static",
				"path" : "res/foodstory.png"
			},
			"centerX" : 0.5,
			"centerY" : 0.4,
			"width" : 302,
			"height" : 114,
			"angle" : 0,
			"zorder" : 1
        },
		{
            "type": "text",
            "centerX": 0.5,
            "centerY": 0.9,
            "width": 162,
            "height": 20,
            "angle": 0,
            "color": "#ffffffff",
            "isVertical": 0,
            "alignment": 0,
            "editable":true,
            "text": "吃货的世界，你不懂的",
            "zorder": 2
        }
	]
}
