﻿{
	"centerX" : 0.5,
	"centerY" : 0.5,
	"angle" : 0,
	"scale" : 1,
	"width" : 158,
	"height" : 300,
	"contents" : [{
			"type" : "image",
			"resource" : {
				"type" : "static",
				"path" : "res/health_1_logo.png"
			},
			"centerX" : 0.7,
			"centerY" : 0.3,
			"width" : 73,
			"height" : 171,
			"angle" : 0,
			"zorder" : 1
		},{
			"type" : "image",
			"resource" : {
				"type" : "static",
				"path" : "res/health_1_ic_location.png"
			},
			"centerX" : 0.68,
			"centerY" : 0.71,
			"width" : 10,
			"height" : 20,
			"angle" : 0,
			"zorder" : 1
		},
		{
            "type": "text",
            "centerX": 0.86,
            "centerY": 0.7,
            "width": 40,
            "height": 20,
            "angle": 0,
            "color": "#ffffffff",
            "isVertical": 0,
			"alignment": 0,
			"editable":true,
            "text": "{LOCATION}",
            "textsize": "12",
            "zorder": 2
        },{
			"type" : "image",
			"resource" : {
				"type" : "static",
				"path" : "res/health_1_ic_1_step.png"
			},
			"centerX" : 0.25,
			"centerY" : 0.8,
			"width" : 20,
			"height" : 20,
			"angle" : 0,
			"zorder" : 1
		},
		{
            "type": "text",
            "centerX": 0.40,
            "centerY": 0.8,
            "width": 30,
            "height": 15,
            "angle": 0,
            "color": "#ffffffff",
            "isVertical": 0,
			"alignment": 0,
			"editable":true,
            "text": "{STEPS}",
            "zorder": 2
        },
		{
            "type": "text",
            "centerX": 0.54,
            "centerY": 0.8,
            "width": 15,
            "height": 15,
            "angle": 0,
            "color": "#ffffffff",
            "isVertical": 0,
			"alignment": 0,
            "text": "步",
            "zorder": 2
        },{
			"type" : "image",
			"resource" : {
				"type" : "static",
				"path" : "res/health_1_ic_2_cal.png"
			},
			"centerX" : 0.64,
			"centerY" : 0.8,
			"width" : 20,
			"height" : 20,
			"angle" : 0,
			"zorder" : 1
		},
		{
            "type": "text",
            "centerX": 0.78,
            "centerY": 0.8,
            "width": 26,
            "height": 15,
            "angle": 0,
            "color": "#ffffffff",
            "isVertical": 0,
			"alignment": 0,
            "text": "{CALORIE}",
            "zorder": 2
        },
		{
            "type": "text",
            "centerX": 0.92,
            "centerY": 0.8,
            "width": 20,
            "height": 15,
            "angle": 0,
            "color": "#ffffffff",
            "isVertical": 0,
			"alignment": 0,
            "text": "千卡",
            "zorder": 2
        }
		,{
			"type" : "image",
			"resource" : {
				"type" : "static",
				"path" : "res/health_1_div.png"
			},
			"centerX" : 0.6,
			"centerY" : 0.85,
			"width" : 130,
			"height" : 2,
			"angle" : 0,
			"zorder" : 1
		},
		{
            "type": "text",
            "centerX": 0.69,
            "centerY": 0.9,
            "width": 120,
            "height": 15,
            "angle": 0,
            "color": "#ffffffff",
            "isVertical": 0,
			"alignment": 0,
            "text": "{yyyy-MM-dd HH:mm}",
            "zorder": 2
        }
	]
}
