{
    "priority_install": [
        "Framework-common",
        "Framework-manager",
        "Framework-runtime",
        "Framework-ui",
        "Framework-privacy",
        "Framework-kitstore",
        "Framework-webapp"
    ],
    "kits": [
        {
            "version_code": "30200300",
            "kit_type": "sdk",
            "kit_name": "huawei_module_mlkit_ocr",
            "api_level": "4",
            "pkg_name": "com.huawei.hms.mlkit.ocr",
            "apk_name": "ML-ocr.apk",
            "minSdkVersion": "19",
            "kit_lib": "armeabi-v7a,arm64-v8a",
            "dependencies": "huawei_module_dynamicloader,6",
            "main_entry": ""
        },
        {
            "version_code": "30200300",
            "kit_type": "sdk",
            "kit_name": "huawei_module_mlkit_bcr",
            "api_level": "4",
            "pkg_name": "com.huawei.hms.mlkit.bcr",
            "apk_name": "ML-bcr.apk",
            "minSdkVersion": "19",
            "kit_lib": "armeabi-v7a,arm64-v8a",
            "dependencies": "huawei_module_dynamicloader,6",
            "main_entry": ""
        },
        {
            "version_code": "60100300",
            "kit_type": "app",
            "kit_name": "AGCLink",
            "api_level": "2",
            "pkg_name": "com.huawei.hms.agclink",
            "apk_name": "AGCLink.apk",
            "minSdkVersion": "19",
            "dependencies": "fwcom-grs,1;fwcom-util,1;fwui,1;hmscore,6;kpms,3;runtime,9;kams,3;apptouch,3",
            "main_entry": "com.huawei.hms.agclink.MainEntry"
        },
        {
            "version_code": "60200315",
            "kit_type": "app",
            "kit_name": "wireless",
            "api_level": "3",
            "pkg_name": "com.huawei.hms.wireless",
            "apk_name": "Wireless.apk",
            "minSdkVersion": "24",
            "main_entry": "com.huawei.hms.wireless.MainEntry"
        },
        {
            "version_code": "30200301",
            "kit_type": "sdk",
            "kit_name": "huawei_module_mlkit_label",
            "api_level": "2",
            "pkg_name": "com.huawei.hms.mlkit.label",
            "apk_name": "ML-label.apk",
            "minSdkVersion": "19",
            "kit_lib": "armeabi-v7a,arm64-v8a",
            "dependencies": "huawei_module_dynamicloader,6",
            "main_entry": ""
        },
        {
            "version_code": "50005380",
            "kit_type": "app",
            "kit_name": "consent",
            "api_level": "110",
            "pkg_name": "com.huawei.hms.consent",
            "apk_name": "Consent.apk",
            "minSdkVersion": "19",
            "dependencies": "fwcom-grs,1;fwcom-util,1;tss,-1:weak;fwui,1;hmscore,10;safetydetect,1;runtime,20;kpms,11;measurement,1;kams,11;apptouch,3",
            "main_entry": "com.huawei.hms.consent.MainEntry"
        },
        {
            "version_code": "100020300",
            "kit_type": "app",
            "kit_name": "qoes",
            "api_level": "1",
            "pkg_name": "com.huawei.hms.qoes",
            "apk_name": "QoES.apk",
            "minSdkVersion": "19",
            "dependencies": "fwcom-grs,1;fwcom-util,1;fwui,1;hmscore,5;kpms,3;runtime,7;location,2;kams,3;apptouch,1",
            "main_entry": "com.huawei.hms.qoes.MainEntry"
        },
        {
            "version_code": "60201300",
            "kit_type": "sdk",
            "kit_name": "huawei_module_huaweimaps",
            "api_level": "13",
            "pkg_name": "com.huawei.hms.maps.provider.huawei",
            "apk_name": "Map-HuaweiProvider.apk",
            "minSdkVersion": "19",
            "kit_loader": "huawei_module_huaweimaps:huawei_module_dynamicloader",
            "kit_lib": "armeabi-v7a,arm64-v8a",
            "dependencies": "hmscore,1;huawei_module_dynamicloader,8;location,1",
            "main_entry": ""
        },
        {
            "version_code": "30200300",
            "kit_type": "sdk",
            "kit_name": "huawei_module_mlkit_translate",
            "api_level": "2",
            "pkg_name": "com.huawei.hms.mlkit.translate",
            "apk_name": "ML-Translate.apk",
            "minSdkVersion": "19",
            "kit_lib": "armeabi-v7a,arm64-v8a",
            "dependencies": "huawei_module_dynamicloader,6",
            "main_entry": ""
        },
        {
            "version_code": "30200301",
            "kit_type": "sdk",
            "kit_name": "huawei_module_mlkit_fr",
            "api_level": "3",
            "pkg_name": "com.huawei.hms.mlkit.fr",
            "apk_name": "ML-formrecognition.apk",
            "minSdkVersion": "19",
            "kit_lib": "armeabi-v7a,arm64-v8a",
            "dependencies": "huawei_module_dynamicloader,6",
            "main_entry": ""
        },
        {
            "version_code": "10000305",
            "kit_type": "app",
            "kit_name": "airtouch",
            "api_level": "1",
            "pkg_name": "com.huawei.hms.airtouch",
            "apk_name": "AirTouch.apk",
            "minSdkVersion": "19",
            "kit_lib": "armeabi-v7a,arm64-v8a",
            "dependencies": "hmscore,1",
            "main_entry": "com.huawei.hms.airtouch.MainEntry"
        },
        {
            "version_code": "30200300",
            "kit_type": "sdk",
            "kit_name": "huawei_module_mlkit_face",
            "api_level": "5",
            "pkg_name": "com.huawei.hms.mlkit.face",
            "apk_name": "ML-face.apk",
            "minSdkVersion": "19",
            "kit_lib": "armeabi-v7a,arm64-v8a",
            "dependencies": "huawei_module_dynamicloader,6",
            "main_entry": ""
        },
        {
            "version_code": "30200300",
            "kit_type": "sdk",
            "kit_name": "huawei_module_mlkit_scenedetection",
            "api_level": "2",
            "pkg_name": "com.huawei.hms.mlkit.scd",
            "apk_name": "ML-scenedetection.apk",
            "minSdkVersion": "19",
            "kit_lib": "armeabi-v7a,arm64-v8a",
            "dependencies": "huawei_module_dynamicloader,6",
            "main_entry": ""
        },
        {
            "version_code": "10003300",
            "kit_type": "app",
            "kit_name": "hem",
            "api_level": "1",
            "pkg_name": "com.huawei.hms.hem",
            "apk_name": "hemkitapk.apk",
            "minSdkVersion": "19",
            "main_entry": "com.huawei.hms.hem.MainEntry"
        },
        {
            "version_code": "60200400",
            "kit_type": "app",
            "kit_name": "nearby",
            "api_level": "124",
            "pkg_name": "com.huawei.hms.nearby",
            "apk_name": "Nearby.apk",
            "minSdkVersion": "21",
            "kit_lib": "armeabi-v7a,arm64-v8a",
            "dependencies": "fwcom-grs,1;fwcom-util,1;fwui,1;hmscore,10;runtime,19;kpms,3;measurement,1;kams,3;apptouch,3",
            "main_entry": "com.huawei.hms.nearby.MainEntry"
        },
        {
            "version_code": "40002309",
            "kit_type": "app",
            "kit_name": "walletkit",
            "api_level": "1",
            "pkg_name": "com.huawei.hms.walletkit",
            "apk_name": "WalletKit.apk",
            "minSdkVersion": "19",
            "kit_lib": "armeabi-v7a,arm64-v8a",
            "dependencies": "fwcom-grs,1;fwcom-util,1;fwui,1;hmscore,5;kpms,3;runtime,7;kams,3;apptouch,1",
            "main_entry": "com.huawei.hms.walletkit.MainEntry"
        },
        {
            "version_code": "30200300",
            "kit_type": "sdk",
            "kit_name": "huawei_module_mlkit_skeleton",
            "api_level": "2",
            "pkg_name": "com.huawei.hms.mlkit.skeleton",
            "apk_name": "ML-skeleton.apk",
            "minSdkVersion": "19",
            "kit_lib": "armeabi-v7a,arm64-v8a",
            "dependencies": "huawei_module_dynamicloader,6",
            "main_entry": ""
        },
        {
            "version_code": "60200300",
            "kit_type": "app",
            "kit_name": "identity",
            "api_level": "3",
            "pkg_name": "com.huawei.hms.identity",
            "apk_name": "Identity.apk",
            "minSdkVersion": "19",
            "kit_lib": "armeabi-v7a,arm64-v8a",
            "dependencies": "fwcom-grs,1;fwcom-util,1;fwui,1;hmscore,6;kpms,3;runtime,9;kams,3;apptouch,1",
            "main_entry": "com.huawei.hms.identity.MainEntry"
        },
        {
            "version_code": "10009300",
            "kit_type": "app;sdk",
            "kit_name": "videokit;huawei_module_videoplayer",
            "api_level": "1;10",
            "pkg_name": "com.huawei.hms.videokit.player",
            "apk_name": "videoplayer.apk",
            "minSdkVersion": "19",
            "kit_loader": "huawei_module_videoplayer:huawei_module_dynamicloader",
            "kit_lib": "armeabi-v7a,arm64-v8a",
            "main_entry": ";"
        },
        {
            "version_code": "10106300",
            "kit_type": "app",
            "kit_name": "hbm",
            "api_level": "107",
            "pkg_name": "com.huawei.hms.hbm",
            "apk_name": "hbm.apk",
            "minSdkVersion": "22",
            "dependencies": "fwcom-grs,1;fwcom-util,6;fwui,7;hmscore,12;kpms,11;runtime,22;kams,11;apptouch,3",
            "main_entry": "com.huawei.hms.hbm.entry.MainEntry"
        },
        {
            "version_code": "30200300",
            "kit_type": "sdk",
            "kit_name": "huawei_module_mlkit_tts_bee",
            "api_level": "2",
            "pkg_name": "com.huawei.hms.mlkit.tts.bee",
            "apk_name": "ML-bee.apk",
            "minSdkVersion": "19",
            "kit_lib": "armeabi-v7a,arm64-v8a",
            "dependencies": "huawei_module_dynamicloader,6",
            "main_entry": ""
        },
        {
            "version_code": "30200300",
            "kit_type": "sdk",
            "kit_name": "huawei_module_mlkit_imagesuperresolution",
            "api_level": "3",
            "pkg_name": "com.huawei.hms.mlkit.imagesuperresolution",
            "apk_name": "ML-isr.apk",
            "minSdkVersion": "19",
            "kit_lib": "armeabi-v7a,arm64-v8a",
            "dependencies": "huawei_module_dynamicloader,6",
            "main_entry": ""
        },
        {
            "version_code": "60200300",
            "kit_type": "sdk",
            "kit_name": "huawei_module_hwdtm",
            "api_level": "1",
            "pkg_name": "com.huawei.hms.dtm",
            "apk_name": "DTM.apk",
            "minSdkVersion": "19",
            "dependencies": "huawei_module_dynamicloader,4;hmscore,1;push,1",
            "main_entry": ""
        },
        {
            "version_code": "60101301",
            "kit_type": "app",
            "kit_name": "keyring",
            "api_level": "610",
            "pkg_name": "com.huawei.hms.keyring",
            "apk_name": "keyring.apk",
            "minSdkVersion": "24",
            "dependencies": "fwcom-grs,1;fwcom-util,1;fwui,1;hmscore,10;safetydetect,1;kpms,3;runtime,9;kams,3;apptouch,3",
            "main_entry": "com.huawei.hms.keyring.MainEntry"
        },
        {
            "version_code": "30200300",
            "kit_type": "sdk",
            "kit_name": "huawei_module_mlkit_tisr",
            "api_level": "2",
            "pkg_name": "com.huawei.hms.mlkit.textimagesuperresolution",
            "apk_name": "ML-tsr.apk",
            "minSdkVersion": "19",
            "kit_lib": "armeabi-v7a,arm64-v8a",
            "dependencies": "huawei_module_dynamicloader,6",
            "main_entry": ""
        },
        {
            "version_code": "60201300",
            "kit_type": "app;loader",
            "kit_name": "huawei_route_maps;huawei_module_maps",
            "api_level": "13;13",
            "pkg_name": "com.huawei.hms.maps.maproute",
            "apk_name": "Map-Route.apk",
            "minSdkVersion": "19",
            "kit_lib": "armeabi-v7a,arm64-v8a",
            "dependencies": "hmscore,1;huawei_module_dynamicloader,8",
            "main_entry": "com.huawei.hms.maps.maproute.hmsclient.MainEntry;"
        },
        {
            "version_code": "50000313",
            "kit_type": "app",
            "kit_name": "realname",
            "api_level": "1",
            "pkg_name": "com.huawei.hms.realname",
            "apk_name": "RealName-core.apk",
            "minSdkVersion": "19",
            "kit_lib": "armeabi-v7a,arm64-v8a",
            "dependencies": "huawei_module_dynamicloader,2",
            "main_entry": "com.huawei.hms.realname.MainEntry"
        },
        {
            "version_code": "109300",
            "kit_type": "app",
            "kit_name": "awareness_kit",
            "api_level": "10",
            "pkg_name": "com.huawei.hms.kit.awareness",
            "apk_name": "Awareness.apk",
            "minSdkVersion": "24",
            "dependencies": "fwcom-grs,1;fwcom-util,1;fwui,1;hmscore,10;runtime,19;kpms,3;location,2;nearby,105;measurement,1;kams,3;apptouch,3",
            "main_entry": "com.huawei.hms.kit.awareness.entry.MainEntry"
        },
        {
            "version_code": "30200300",
            "kit_type": "sdk",
            "kit_name": "huawei_module_mlkit_imgseg",
            "api_level": "10",
            "pkg_name": "com.huawei.hms.mlkit.imgseg",
            "apk_name": "ML-imgseg.apk",
            "minSdkVersion": "19",
            "kit_lib": "armeabi-v7a,arm64-v8a",
            "dependencies": "huawei_module_dynamicloader,6",
            "main_entry": ""
        },
        {
            "version_code": "30200300",
            "kit_type": "sdk",
            "kit_name": "huawei_module_mlkit_icr",
            "api_level": "5",
            "pkg_name": "com.huawei.hms.mlkit.icr",
            "apk_name": "ML-icr.apk",
            "minSdkVersion": "19",
            "kit_lib": "armeabi-v7a,arm64-v8a",
            "dependencies": "huawei_module_dynamicloader,6",
            "main_entry": ""
        },
        {
            "version_code": "10003305",
            "kit_type": "sdk",
            "kit_name": "huawei_module_imagevision",
            "api_level": "10003301",
            "pkg_name": "com.huawei.hms.image.visionkit",
            "apk_name": "Image-vision.apk",
            "minSdkVersion": "26",
            "dependencies": "hmscore,1;huawei_module_dynamicloader,8;huawei_module_mlkit_object,2",
            "main_entry": ""
        },
        {
            "version_code": "30200300",
            "kit_type": "sdk",
            "kit_name": "huawei_module_mlkit_handkeypoint",
            "api_level": "3",
            "pkg_name": "com.huawei.hms.mlkit.handkeypoint",
            "apk_name": "ML-handKeypoint.apk",
            "minSdkVersion": "19",
            "kit_lib": "armeabi-v7a,arm64-v8a",
            "dependencies": "huawei_module_dynamicloader,6",
            "main_entry": ""
        },
        {
            "version_code": "30200301",
            "kit_type": "sdk",
            "kit_name": "huawei_module_mlkit_dsc",
            "api_level": "3",
            "pkg_name": "com.huawei.hms.mlkit.dsc",
            "apk_name": "ML-documentskew.apk",
            "minSdkVersion": "19",
            "kit_lib": "armeabi-v7a,arm64-v8a",
            "dependencies": "huawei_module_dynamicloader,6",
            "main_entry": ""
        },
        {
            "version_code": "10003306",
            "kit_type": "sdk",
            "kit_name": "huawei_module_imagerender",
            "api_level": "3",
            "pkg_name": "com.huawei.hms.image.render",
            "apk_name": "Image-render.apk",
            "minSdkVersion": "19",
            "dependencies": "fwcom-grs,1;fwcom-util,1;fwui,1;huawei_module_dynamicloader,8;hmscore,6;kpms,3;runtime,9;kams,3;apptouch,1",
            "main_entry": ""
        },
        {
            "version_code": "60200300",
            "kit_type": "sdk",
            "kit_name": "huawei_module_scene",
            "api_level": "5",
            "pkg_name": "com.huawei.hms.scene",
            "apk_name": "SceneKit.apk",
            "minSdkVersion": "19",
            "kit_lib": "armeabi-v7a,arm64-v8a",
            "dependencies": "huawei_module_dynamicloader,6;hmscore,1;huawei_module_mlkit_face,5",
            "main_entry": ""
        },
        {
            "version_code": "60200300",
            "kit_type": "app",
            "kit_name": "findnetwork",
            "api_level": "3",
            "pkg_name": "com.huawei.hms.findnetwork",
            "apk_name": "FindNetwork.apk",
            "minSdkVersion": "21",
            "kit_lib": "armeabi-v7a,arm64-v8a",
            "dependencies": "fwcom-grs,1;fwcom-util,1;fwui,1;hmscore,10;runtime,19;kpms,3;measurement,1;kams,3;apptouch,3",
            "main_entry": "com.huawei.hms.findnetwork.MainEntry"
        },
        {
            "version_code": "50002307",
            "kit_type": "app;sdk",
            "kit_name": "panorama;huawei_module_panorama",
            "api_level": "8;8",
            "pkg_name": "com.huawei.hms.panorama",
            "apk_name": "Panorama.apk",
            "minSdkVersion": "19",
            "dependencies": "fwcom-grs,1;fwcom-util,1;fwui,1;huawei_module_dynamicloader,8;hmscore,9;kpms,3;runtime,9;kams,3;apptouch,3",
            "main_entry": "com.huawei.hms.panorama.MainEntry;"
        },
        {
            "version_code": "30200300",
            "kit_type": "sdk",
            "kit_name": "huawei_module_mlkit_object",
            "api_level": "3",
            "pkg_name": "com.huawei.hms.mlkit.object",
            "apk_name": "ML-object.apk",
            "minSdkVersion": "19",
            "kit_lib": "armeabi-v7a,arm64-v8a",
            "dependencies": "huawei_module_dynamicloader,6",
            "main_entry": ""
        },
        {
            "version_code": "50000300",
            "kit_type": "sdk",
            "kit_name": "huawei_module_quic",
            "api_level": "1",
            "pkg_name": "com.huawei.hms.hquic",
            "apk_name": "hquic.apk",
            "minSdkVersion": "19",
            "kit_lib": "arm64-v8a",
            "main_entry": ""
        },
        {
            "version_code": "30200300",
            "kit_type": "sdk",
            "kit_name": "huawei_module_mlkit_faceverify",
            "api_level": "2",
            "pkg_name": "com.huawei.hms.mlkit.faceverify",
            "apk_name": "ML-faceverify.apk",
            "minSdkVersion": "19",
            "kit_lib": "armeabi-v7a,arm64-v8a",
            "dependencies": "huawei_module_dynamicloader,6",
            "main_entry": ""
        },
        {
            "version_code": "10400300",
            "kit_type": "sdk",
            "kit_name": "huawei_module_audiokit",
            "api_level": "10",
            "pkg_name": "com.huawei.hms.audiokit",
            "apk_name": "Audio.apk",
            "minSdkVersion": "19",
            "kit_loader": "huawei_module_audiokit:huawei_module_dynamicloader",
            "kit_lib": "armeabi,arm64-v8a",
            "dependencies": "huawei_module_dynamicloader,5",
            "main_entry": ""
        }
    ]
}