ENG AH NG
ER AA R 
F F
G G
H HH
IA IY AA
IANG IY AE NG
IAN IY AE N
IAO IY AW
IE IY EH
M M
N N
O AO
ONG UH NG
OU OW
P P
Q Q
R R
SH SH
S S
T T
UAI UW AY
UANG UW AE NG
UAN UW AE N
UA UW AA
UI UW IY 
UN UW AH N
UO UW AO
U UW
UE IY EH 
VE IY EH 
V IY UW
VN IY N 
IU IY UH 
J J
K K
L L
W W
X X 
Y Y
ZH JH 
Z Z
A AA
AI AY
AN AE N 
ANG AE NG
AO AW   
B B 
CH CH
C T S
D D
E ER 
EI EY
EN AH N
I IY
ING IY NG
IN IY N
IONG IY UH NG