﻿{
  "name":"haibao",
  "bsFilePath":"009_haibao/haibao.bs",
  "fbxFilePath":"009_haibao/haibao.obj2",
  "eyeFbxFilePath":["009_haibao/haibao_eye_left.fbx",
                    "009_haibao/haibao_eye_right.fbx"],
  "textureImgs": [
        "009_haibao/haibao_d.jpg",
        "009_haibao/haibao_n.jpg",
        "009_haibao/haibao_s.jpg"
    ],
   "eyePostion": [
        "-0.0415f",
        "0.0572f",
        "0.0816f",
        "0.0415f",
        "0.0572f",
        "0.0816f"
    ],
    "modelSize": "1.0F",
    "mtlFilePath": "009_haibao/haibao.mtl",
    "changeSkinLists":null,
    "bOpenLighting": true,
    "blendType": 1,
    "blendStep": "0f"

}