{
    "id":"dynamic",
    "title_id":"story_template_title_dynamic",
    "music":"Resource/music/out.aac",
    "template_desc_id": "dynamic_template_desc",
    "segments":[
        {
            "camera_id":0,
            "duration":3.2,
            "demo_offset":[0,3],
            "audio_offset":0,
            "clip_desc_id": "auto_shoot_video",
            "algo_scripts":{
                "operation_mode":"rotate",
                "operation_param":"-45"
            },
            "holder_scripts":{
                "delay_before_shoot_pos":0.5,
                "gimbal_before_shoot_pos":[0,0.2,0,0,0,1],
                "gimbal_start_pos":[0,0.2,0,0,0,1],
                "gimbal_move":[
                    [0.5,3.2,0,-45,0,1]
                ]
            }
        },
        {
            "camera_id":0,
            "duration":3.3,
            "demo_offset":[3.4,6.2],
            "audio_offset":3.2,
            "clip_desc_id": "auto_shoot_video",
            "algo_scripts":{
                "operation_mode":"rotate",
                "operation_param":"-45"
            },
            "holder_scripts":{
                "delay_before_shoot_pos":0.5,
                "gimbal_before_shoot_pos":[0,0.2,0,0,0,1],
                "gimbal_start_pos":[0,0.2,0,0,0,1],
                "gimbal_move":[
                    [0.5,3.3,0,-45,0,1]
                ]
            }
        },
        {
            "camera_id":0,
            "duration":3.4,
            "demo_offset":[6.7,9.4],
            "audio_offset":6.5,
            "clip_desc_id": "auto_shoot_video",
            "algo_scripts":{
                "operation_mode":"rotate",
                "operation_param":"-45"
            },
            "holder_scripts":{
                "delay_before_shoot_pos":0.5,
                "gimbal_before_shoot_pos":[0,0.2,0,0,0,1],
                "gimbal_start_pos":[0,0.2,0,0,0,1],
                "gimbal_move":[
                    [0.5,3.4,0,-45,0,1]
                ]
            }
        },
        {
            "camera_id":0,
            "duration":3.5,
            "demo_offset":[10.4,13.2],
            "audio_offset":9.7,
            "clip_desc_id": "auto_shoot_video",
            "algo_scripts":{
			    "operation_mode":"zoom",
                "operation_param":"1.5,1"
            }
        }
    ]
}