﻿{
	"centerX" : 0.5,
	"centerY" : 0.5,
	"angle" : 0,
	"scale" : 1,
	"width" : 117,
	"height" : 280,
	"contents" : [{
			"type" : "image",
			"resource":{
                "type":"dynamic",
                "resKey":"{SEASON}",
                "resources":[
                    {
                        "key":"春",
                        "path":"res/spring.png"
                    },
                    {
                        "key":"夏",
                        "path":"res/summer.png"
					},
					{
                        "key":"秋",
                        "path":"res/autumn.png"
                    },
                    {
                        "key":"冬",
                        "path":"res/winter.png"
                    }
                ]
            },
			"centerX" : 0.5,
			"centerY" : 0.5,
			"width" : 117,
			"height" : 280,
			"angle" : 0,
			"zorder" : 1
		}
	]
}
