{
  "ambient_brightness_scale": 1,
  "ambient_saturation_scale": 1,
  "ambient_shadow_brightness_scale": 1,
  "ambient_shadow_saturation_scale": 1.4500000476837158,
  "bg_color_temp": 7500,
  "bg_grayscale": false,
  "cameras": [
    {
      "ext_rot": [
        0,
        0,
        0
      ],
      "eye": [
        0,
        0,
        10000
      ],
      "fov": 45,
      "look_at": [
        0,
        0,
        0
      ],
      "name": "Primary",
      "ortho_scale": 1,
      "perspective": false,
      "up": [
        0,
        1,
        0
      ]
    },
    {
      "ext_rot": [
        0,
        0,
        0
      ],
      "eye": [
        0,
        0,
        10000
      ],
      "fov": 45,
      "look_at": [
        0,
        0,
        0
      ],
      "name": "Secondary",
      "ortho_scale": 1,
      "perspective": true,
      "up": [
        0,
        1,
        0
      ]
    }
  ],
  "eye_alpha_threshold": 0.11999999731779099,
  "eyeball_radius_scale": 2.5,
  "ignore_pupil_normal": true,
  "is_huawei_depth": false,
  "light_filenames": [
    ".\/lights\/light-leafyshade.json"
  ],
  "mtl_filenames": [
    ".\/materials\/face-type-b.dat"
  ],
  "n_max_faces": -1,
  "overwrite_bg_normal": true,
  "overwrite_eyeball_normal": true,
  "post_bg_blur_width": 0,
  "post_bg_color": [
    0,
    0,
    0
  ],
  "post_bg_color2": [
    1,
    1,
    1
  ],
  "post_bg_inpaint": true,
  "post_bg_mode": "TEXTURE",
  "post_bg_org_alpha": -0.14000000059604645,
  "post_bg_projshadow_blend_mode": "SCREEN",
  "post_bg_projshadow_enable_alpha_channel": true,
  "post_bg_projshadow_indep_blend": false,
  "post_bg_projshadow_intensity": 0.62000000476837158,
  "post_bg_projshadow_onoff": false,
  "post_bg_projshadow_scale": [
    1,
    1
  ],
  "post_bg_projshadow_scale_by_face": false,
  "post_bg_s_tone_scale": 4.9600000381469727,
  "post_bg_tex_alpha": 0.5,
  "post_bg_tex_blend_mode": "SCREEN",
  "post_bg_tex_scale": 0.67000001668930054,
  "post_bg_tex_trans": [
    -0.070000000298023224,
    0.020000001415610313
  ],
  "post_bg_texname": "textures\/leaf_bg_rgba.png",
  "post_bg_z_offset": 200.00001525878906,
  "post_dropshadow_blur_width": 0.079999998211860657,
  "post_dropshadow_color": [
    0.37745100259780884,
    0.3774472177028656,
    0.3774472177028656
  ],
  "post_dropshadow_intensity": 0,
  "post_exposure": 1,
  "post_exposure_offset": 0,
  "post_fg_tex_alpha": 1,
  "post_fg_tex_blend_mode": "SCREEN",
  "post_fg_tex_scale": 1,
  "post_fg_tex_trans": [
    0,
    0
  ],
  "post_fg_texname": "",
  "post_grayscale": false,
  "post_tonemap_mode": "LINEAR",
  "post_use_dropshadow": true,
  "projshadow_blend_mode": "OVERLAY",
  "projshadow_buffer_range": 0.25,
  "projshadow_color": [
    0.7401961088180542,
    0.74018871784210205,
    0.74018871784210205
  ],
  "projshadow_enable_alpha_channel": true,
  "projshadow_ext_scale": 1,
  "projshadow_ext_trans_mode": true,
  "projshadow_fit_to_image": false,
  "projshadow_ignore_ext_move": false,
  "projshadow_intensity": 0.5,
  "projshadow_mono_inversion": false,
  "projshadow_repeat": false,
  "projshadow_repeat_flip": false,
  "projshadow_scale": [
    1.1500000953674316,
    1.5100001096725464
  ],
  "projshadow_scale_by_face": false,
  "projshadow_shadow_mode": false,
  "projshadow_texname": "projshadow\/leafyshade.png",
  "projshadow_trans": [
    -0.1900000125169754,
    -0.23000000417232513,
    0
  ],
  "projshadow_two_sided": true,
  "projshadow_yaw_pitch_roll": [
    -0.069244682788848877,
    -0.11807458102703094,
    0
  ],
  "pupil_radius_scale": 2.5999999046325684,
  "relative_light": true,
  "rigid_eyeball_normal": true,
  "screen_width": 1024,
  "shading_grayscale": false,
  "shading_region_thld": 0.004999999888241291,
  "softshadow_blur_width": 0.11000000685453415,
  "softshadow_buffer_range": 0.5,
  "softshadow_intensity": 1,
  "softshadow_ray_offset": 1,
  "ssss_quality": 0,
  "ssss_width": 0.059999998658895493,
  "use_ambient": true,
  "use_bg_color_temp": false,
  "use_bg_s_tone": false,
  "use_foreground": false,
  "use_projshadow": true,
  "use_softshadow": true,
  "use_ssss": false
}
