{
	"centerX" : 0.5,
	"centerY" : 0.5,
	"angle" : 0,
	"scale" : 1,
	"width" : 218,
	"height" : 86,
	"contents" : [
		{
			"type" : "image",
			"resource" : {
				"type" : "static",
				"path" : "res/fei.png"
			},
			"centerX" : 0.5,
			"centerY" : 0.45,
			"width" : 218,
			"height" : 82,
			"angle" : 0,
			"zorder" : 1
		},
		{
            "type": "text",
            "centerX": 0.33,
            "centerY": 0.9,
            "width": 90,
            "height": 14,
            "angle": 0,
            "color": "#ffffffff",
            "isVertical": 0,
			"alignment": 1,
            "text": "{yyyy-MM-dd aa hh:mm}",
            "zorder": 2
        }
	]
}
