0 0 0 0 
0 0 0 0 
0 0 0 0 
0 0 0 0 
0 0 0 0 
0 0 0 0 
0 0 0 0 
0 0 0 0 
0 0 0 0 
0 0 0 0 
0.00278237485326827 4.44813440481084e-06 0 -4.04636636697209e-11 
0.00341453496366739 3.80519736609131e-06 -6.00263163619275e-08 2.38404524566249e-07 
0.00381324300542474 4.02644900532323e-06 1.77292314162969e-08 -1.64273696867667e-08 
0.00424508890137076 3.34623041453597e-06 -5.30468611259494e-08 7.44363415350335e-09 
0.00461527798324823 3.03671185974963e-06 1.39499874762805e-07 7.61366507617822e-08 
0.0049306876026094 2.28584212891292e-06 -5.24885628294669e-08 -7.62881384730463e-08 
0.00517811020836234 1.56366388637252e-06 -1.91325586484936e-08 7.09364700313131e-09 
0.00533822737634182 7.47090325603494e-07 5.60807293936705e-08 1.1534146554526e-10 
0.00540216034278274 6.91947320774489e-07 -9.77024967596662e-08 -1.15313480986146e-10 
0.00533938081935048 3.9279666452785e-07 2.36586203072875e-07 -1.03392905348443e-10 
0.00520201632753015 4.18571090676778e-07 5.93817262029006e-08 -3.49508477714977e-10 
0.00503742136061192 2.7898730081688e-07 -1.24220562724986e-08 8.86767395624766e-11 
0.00487385084852576 1.76644292082528e-07 -1.94713978274308e-09 -1.92535015708373e-10 
0.00474680028855801 1.18826449124754e-07 7.37167715758602e-10 1.03847659638223e-10 
0.00471076834946871 2.38721867162894e-07 5.26156028468616e-11 4.05676103820696e-10 
0.0047841090708971 5.49001640592905e-07 4.54670162630677e-10 -2.25641727524817e-10 
0.0049748201854527 7.18307830993581e-07 3.957001115662e-10 -2.19075643043132e-11 
0.00526115018874407 1.32717343603872e-06 -1.28812405186807e-10 -4.52566976949509e-11 
0.00562310870736837 1.90683419987181e-06 -3.22708595956733e-11 2.25138532816693e-10 
0.00598520273342729 2.44530338022741e-06 3.38356426210495e-11 -4.75040506930924e-10 
0.00632263440638781 2.78615380011615e-06 -3.98656829769806e-10 1.83721163282691e-10 
0.00657506706193089 3.3397839160898e-06 -4.50818576913647e-10 -3.49740271465837e-11 
0.00674257753416896 3.58413899448351e-06 -6.59377830114494e-10 3.11476851255765e-11 
0.0068014026619494 3.62806395060034e-06 1.8856279038193e-10 2.09753298063831e-10 
0.00678730243816972 3.68754876944877e-06 -1.02235289678454e-10 8.44792569232311e-11 
0.00673800427466631 4.0930954128271e-06 -1.30055619051994e-10 5.35200994633556e-10 
0.00673932768404484 4.33077093475731e-06 -1.42580617451538e-11 -1.98680655261185e-10 
0.0069001317024231 4.98397139381268e-06 3.36760730412777e-10 2.80695994225866e-10 
0.00738126737996936 6.60329533275217e-06 -5.66810931523776e-10 -4.19423419606435e-11 
0.00834235642105341 8.40535903989803e-06 -9.31588139962969e-11 -2.1725091170488e-10 
0.00989705137908459 1.03559004855924e-05 -1.49220624745539e-09 -4.84008222390031e-10 
0.0121513474732637 1.3118843526172e-05 -2.407455623743e-10 1.98827607156282e-10 
0.015304266475141 1.72571217262885e-05 -6.36352470717583e-10 -1.14527165528955e-10 
0.0195945724844933 2.13309140235651e-05 -8.8152185551138e-10 6.50534792701052e-10 
0.0251904223114252 2.68917065113783e-05 -1.88012161395079e-09 -8.04766753237374e-10 
0.0323437042534351 3.1221588869812e-05 1.80265047333705e-09 4.25519786073636e-10 
0.0410631634294987 3.77733631466981e-05 -1.70666103471717e-09 1.65708002874965e-09 
0.0511744022369385 4.09608401241712e-05 -1.79911374686981e-09 7.30327520681584e-10 
0.0621570013463497 4.3975032895105e-05 -1.53297297078581e-09 -1.58596957788859e-09 
0.0737464651465416 4.49171056970954e-05 -2.84062418032249e-09 -2.30687136060226e-09 
0.0852569118142128 4.64677432319149e-05 3.44536554841568e-09 -3.26501736758189e-09 
0.0961155816912651 4.15884278481826e-05 2.72506506249215e-09 2.88438006812441e-09 
0.105908095836639 3.92270339943934e-05 -9.13766484700318e-09 -1.23368248949873e-09 
0.114788755774498 3.62355822289828e-05 -4.04771238748936e-09 -3.84573661804666e-09 
0.122229412198067 3.12752890749834e-05 -9.41177802360471e-10 -1.09561639760614e-08 
0.128213539719582 2.71300868917024e-05 2.24942975357578e-09 9.28032051206173e-09 
0.133372634649277 2.68846633844078e-05 2.22244955772055e-09 4.53899939856228e-09 
0.137804314494133 2.43824833887629e-05 1.96800442608946e-09 5.39680478084392e-09 
0.141051724553108 2.71525186690269e-05 -9.2782901361943e-09 -7.41155470329602e-10 
0.143750116229057 3.29717549902853e-05 3.45329964623886e-09 9.90865345329439e-09 
0.146122425794601 3.42157945851795e-05 -8.01168076325354e-10 -5.06647435116747e-09 
0.147667020559311 3.57007775164675e-05 1.03159498721084e-08 5.49803136351557e-09 
0.148992940783501 3.28119749610778e-05 4.29270707869023e-09 4.75876171801559e-10 
0.150191515684128 2.29337165364996e-05 -3.06048697495953e-09 -8.08071121127796e-09 
0.150794237852097 1.96840737771709e-05 -5.98733684853414e-09 -2.90317681006513e-09 
0.151307180523872 1.70386665558908e-05 1.59502344665441e-09 -1.40417713012653e-08 
0.151790410280228 1.47874006870552e-05 -3.66407815199921e-09 4.91123719470465e-09 
0.151802584528923 1.72591317095794e-05 -8.66691385326135e-10 5.51415491045759e-09 
0.151687026023865 1.83545616891934e-05 7.97319721357326e-09 3.94378263379735e-09 
0.151790484786034 1.23735253509949e-05 4.84027351532745e-09 8.97329233140454e-09 
0.151472851634026 1.23532709039864e-05 -8.57437343348977e-10 -2.95031887809216e-09 
0.150870740413666 9.22316849027993e-06 -4.91361351606656e-09 -1.55336383755866e-08 
0.150722414255142 7.5947423283651e-06 -1.02312736061094e-08 -5.52540369014309e-09 
0.15041808784008 1.28388173834537e-05 -7.80168907255074e-09 2.10962491919986e-09 
0.150051265954971 9.30424630496418e-06 -3.98380706201351e-09 -3.82640058527173e-10 
0.149746894836426 2.20428637476289e-06 -1.18831544604348e-09 -5.57744428419937e-09 
0.149562805891037 -2.26004522119183e-06 1.65666182994073e-08 -1.4277266036089e-09 
0.14853972196579 -2.16227999771945e-06 9.0133078778365e-10 3.88895404768164e-09 
0.147681996226311 -1.25645019579679e-05 8.27974844241908e-09 1.4241152701544e-09 
0.146398574113846 -1.03671718534315e-05 5.91392268489699e-09 -8.99203878024224e-10 
0.145276680588722 -1.1444531082816e-05 5.6264166659048e-09 3.70861313880866e-10 
0.144024342298508 -1.07890309664072e-05 2.97402258375712e-09 1.9237280657336e-09 
0.142931789159775 -1.18140060294536e-05 -1.00238422007237e-08 -5.32984056889063e-09 
0.141191467642784 -1.33661187646794e-05 -2.08141814894702e-09 -4.2073287076505e-09 
0.139790236949921 -8.49925072543556e-06 -3.57721630095398e-09 2.44471998200879e-09 
0.138015747070313 -1.54689168994082e-05 5.95863625107995e-09 2.26512431034109e-09 
0.136076733469963 -2.04042535187909e-05 3.31690408472696e-09 -7.89162335479432e-09 
0.133397042751312 -2.91974338324508e-05 3.96987331896526e-09 5.80738568345396e-09 
0.130984961986542 -3.05197754641995e-05 -1.65225511050693e-09 4.85755169421509e-09 
0.128027200698853 -4.40097828686703e-05 1.59110735697965e-09 9.19444342883935e-09 
0.125051125884056 -3.39693942805752e-05 -3.82842868518196e-09 2.42040365527885e-09 
0.121685892343521 -3.18004495056812e-05 -9.10486797067733e-09 -1.18794281078749e-08 
0.118521831929684 -2.77594408544246e-05 -2.99730551489574e-09 -9.56905443771916e-10 
0.11510594189167 -3.01949021377368e-05 -9.99534011114633e-10 -1.51274937021384e-09 
0.111507594585419 -2.89427462121239e-05 -2.89511548068333e-09 -2.57092902522515e-09 
0.107575669884682 -3.33023635903373e-05 -3.78587339255887e-09 2.77498846124047e-09 
0.104241095483303 -3.22330015478656e-05 -7.29803995014322e-10 -2.25303353751372e-09 
0.100602023303509 -3.38077006745152e-05 -1.14923519589638e-08 3.81749787337071e-09 
0.0970412343740463 -2.80112781183561e-05 -7.83020703831738e-10 5.11994358021184e-09 
0.0937730595469475 -2.28252101805992e-05 6.45217601569215e-10 5.46822087610366e-10 
0.0904149860143661 -2.09569134312915e-05 1.66974889470595e-09 -1.0256233640149e-09 
0.0867376029491425 -2.47808566200547e-05 -2.53189114118868e-09 -1.7544679598025e-10 
0.0832514837384224 -2.21191767195705e-05 2.50238296750638e-09 -1.45846912324998e-09 
0.079691968858242 -2.59821645158809e-05 3.67445673887801e-09 5.04548269830707e-09 
0.0757220908999443 -3.00210467685247e-05 4.20844292747802e-09 1.85617698988949e-09 
0.0717960074543953 -3.17288613587152e-05 3.62120022856516e-09 1.00935548807968e-09 
0.0674053579568863 -2.98387603834271e-05 2.88636403666942e-09 1.94271954079284e-09 
0.0631927996873856 -3.05088942695875e-05 1.45994785705206e-10 1.9452290889177e-09 
0.0587515830993652 -2.88661285594571e-05 -1.64058999718719e-09 8.97254492926436e-11 
0.0545848347246647 -2.70271320914617e-05 -4.2116204967968e-10 1.76779468841204e-09 
0.0502479001879692 -2.51723722612951e-05 -1.36784794602107e-09 -3.62691165989304e-09 
0.0462312698364258 -2.34681356232613e-05 -2.05670391828505e-09 2.23627427686779e-09 
0.0423797145485878 -2.44486982410308e-05 1.29593547004703e-09 1.40690958883027e-09 
0.0388894863426685 -2.25694311666302e-05 -9.83710224389256e-10 -1.28267077514899e-10 
0.0357346758246422 -2.19320663745748e-05 -7.05958180802213e-10 9.68847668758599e-10 
0.0329167768359184 -2.15449672396062e-05 -3.89980520099087e-10 1.19028442657765e-09 
0.0304534584283829 -2.01611001102719e-05 -2.58697008259645e-10 -9.83139236687691e-10 
0.0282887499779463 -1.8763761545415e-05 -1.15188769633789e-09 2.13105399993196e-09 
0.0262658018618822 -1.72498075698968e-05 -1.60708213403638e-09 -1.26990140625338e-09 
0.0243614353239536 -1.58916809596121e-05 -1.77506360304891e-11 1.2524226100652e-10 
0.022778544574976 -1.55720063048648e-05 6.53220144641864e-10 2.4268823062279e-10 
0.0212986543774605 -1.58948878379306e-05 -6.80919834405991e-11 2.59809396219168e-10 
0.0198665391653776 -1.5367622836493e-05 8.96963503471682e-10 -8.677831231374e-10 
0.018608720973134 -1.41803402584628e-05 -5.62268953618883e-10 1.32675270769766e-09 
0.0173342991620302 -1.34530127979815e-05 2.27649632478233e-09 2.12078576922181e-10 
0.0161589793860912 -1.18774914881214e-05 1.18162568618629e-09 -5.93586402253266e-10 
0.0150410206988454 -9.7347083283239e-06 7.13825221154707e-10 4.75694816870487e-10 
0.0139565886929631 -8.94133609108394e-06 5.98923022288034e-10 1.64286828585603e-09 
0.0128793623298407 -8.23682148620719e-06 6.19387319211739e-10 -7.81119405268704e-11 
0.0119475452229381 -6.98668191034812e-06 3.92443466612491e-10 5.27544508077682e-10 
0.0109959077090025 -6.28883753961418e-06 4.70703476196377e-10 1.20345011733747e-10 
0.0101329907774925 -6.35861078990274e-06 4.82453244021741e-10 3.70531993976186e-10 
0.00933368410915136 -5.73816259930027e-06 4.88325380132437e-10 -4.45983278085649e-10 
0.00855009164661169 -5.1225920287834e-06 -3.40809043312962e-12 -6.36919683660864e-12 
0.00777440285310149 -4.59416605735896e-06 1.0398835126324e-09 1.61291438538491e-10 
0.00705890543758869 -3.66845983990061e-06 -3.64261398821952e-10 5.16827913799034e-10 
0.00633523054420948 -2.83346253127092e-06 5.21901966088478e-10 -1.06054977300207e-10 
0.00562902446836233 -1.75302557181567e-06 5.95044985507442e-11 -8.63496843472866e-11 
0.00500395335257053 -1.30422404254205e-06 1.24829341308086e-10 -2.50969856008254e-10 
0.00438058888539672 -8.69783036705485e-07 1.43286327247694e-10 6.859911944046e-11 
0.00380894122645259 -5.76646243644063e-07 2.58074728254343e-10 -1.36852182364144e-10 
0.00327590107917786 3.16813206779898e-08 2.3608634144856e-11 -9.48101319675487e-11 
0.00276809162460268 -3.83149334481914e-08 1.75822759129751e-10 1.3365489270889e-10 
0.00230829580686986 -4.29967528248199e-08 2.19556831049239e-10 3.07400424559567e-11 
0.00191725045442581 1.379151282066e-08 -1.03411057494895e-10 -1.36870167977143e-10 
0.00158159097190946 -9.41248003982764e-08 2.78564601940978e-11 2.62413615143009e-12 
0.00130243180319667 -1.67576814646964e-07 -6.58566187694554e-11 -4.11948513495686e-12 
0.00109461648389697 -1.74760614868319e-07 -2.30256248096028e-11 1.80239295710649e-11 
0.000929213885683566 -2.07403743957002e-07 1.02803807133789e-10 2.67733786529778e-11 
0.000806780532002449 -4.86910550989705e-07 1.3366478930632e-11 -1.93551667748704e-11 
0.000701953715179116 -9.71792019299755e-07 3.79402897987546e-11 2.30917993060409e-11 
0.000634674215689301 -1.49566994878114e-06 -1.6449449441458e-11 -8.86924919358406e-13 
0.000591159914620221 -1.83406291398569e-06 5.85863788038488e-11 2.2315998007838e-11 
0.000567308103200048 -2.0362251689221e-06 6.60419427478409e-11 4.47927701874296e-11 
0.000551556120626628 -2.15173440665239e-06 1.01209693403881e-10 1.65693726100757e-11 
0.000549120188225061 -1.95422330762085e-06 8.16164288930388e-11 5.13290347725626e-11 
0.000584223715122789 -1.67013524787762e-06 3.53599649560721e-11 1.79901614438815e-11 
0.000582908047363162 -1.90286630186165e-06 5.99051502847558e-11 -6.57077430660236e-12 
0.000577222090214491 -1.89192166999419e-06 7.24297705145815e-11 3.66191868494958e-11 
0.000549695920199156 -1.82796600256552e-06 5.28263925658745e-11 3.39124700543536e-11 
0.000516969186719507 -1.82657879577164e-06 5.07002946570356e-11 4.45515221936255e-11 
0.00044151849579066 -2.16719899981399e-06 8.35511312913262e-11 5.36622517255392e-11 
0.000396682880818844 -1.87604098300653e-06 8.45736813914755e-11 6.04151104144357e-11 
0.000355443567968905 -1.93831988326565e-06 6.18994647205717e-11 3.98955521396793e-11 
0.000335926510160789 -1.78817140294996e-06 6.2931111710629e-11 1.38766047264038e-11 
0.000319192768074572 -1.74054991930461e-06 5.50409440247535e-11 4.14838753626245e-11 
0.000315198907628655 -1.34390722905664e-06 2.99583968743633e-11 1.39997692258365e-11 
0.000310086907120422 -1.25566850783798e-06 2.30108813947805e-11 2.10209488704649e-11 
0.000296681362669915 -1.01855721368338e-06 4.92101637217246e-11 2.25584950025448e-11 
0.000289975287159905 -9.10833591660776e-07 5.69062574840018e-11 1.84873054365209e-11 
0.000265407055849209 -8.80403774772276e-07 3.48088918800116e-11 1.8783684677115e-11 
0 0 0 0 
0 0 0 0 
0 0 0 0 
0 0 0 0 
0 0 0 0 
0 0 0 0 
0 0 0 0 
0 0 0 0 
0 0 0 0 
0 0 0 0 
0 0 0 0 
0 0 0 0 
0 0 0 0 
0 0 0 0 
99.97509765625 0.023751063272357 3.21506267937366e-05 2.65709331870312e-05 
