psfParams
0.019679
2.921367
0.00000000659403
-0.341839f
768
320
nodeX
2.5
3.5
6
10
14
18
28
42
56
100
154
263
400
nodeY
0
2.289763
4.646344
6.595074
7.248451
7.771402
8.805946
9.862799
10.949904
12.350096
13.117491
14.285245
14.890973
20080000
0
0.002384
0
0
0.0
0.0
60240000
0
0.001295
0
0
0.0
0.0
80320000
0
0.001282
0
0
0.0
0.0
120480000
0
0.001400
0
0
0.0
0.0