0.000882999680470675 -0.00135493371635675 
0.000579476356506348 -0.000269685173407197 
0.000439346738858148 0.000402390956878662 
0.000648506334982812 0.000177077017724514 
0.00108988583087921 0.000210555124795064 
0.00184967019595206 8.14957602415234e-05 
0.00274465815164149 0.000758741982281208 
0.00374288135208189 0.00176018429920077 
0.00469347694888711 0.0027525092009455 
0.00572303822264075 0.00257226871326566 
0.00662274286150932 0.00223711878061295 
0.00734733231365681 0.00194943929091096 
0.00776501186192036 0.00258907210081816 
0.00808913819491863 0.00235051079653203 
0.00817080121487379 0.00275725242681801 
0.00831459648907185 0.00324246217496693 
0.00827235542237759 0.00420953705906868 
0.0082956226542592 0.00381390284746885 
0.00812695175409317 0.00366524048149586 
0.00797813385725021 0.00334582896903157 
0.00779404025524855 0.00365572981536388 
0.00750074163079262 0.00286848237738013 
0.00711090676486492 0.00238232826814055 
0.00670142099261284 0.00170146208256483 
0.00634293211624026 0.0015729753067717 
0.00596943311393261 0.00173926609568298 
0.00562383281067014 0.00194814370479435 
0.00536024151369929 0.00213562720455229 
0.00514808902516961 0.00201603258028626 
0.00500781182199717 0.00176773977000266 
0.00476683815941215 0.00144630856812 
0.0045433770865202 0.000989693333394825 
0.00429474655538797 0.000938315119128674 
0.00412535248324275 0.00092092709382996 
0.00396028766408563 0.00109745829831809 
0.00374641572125256 0.000811681908089668 
0.00337353791110218 0.000884860870428383 
0.00314346887171268 0.00123542570509017 
0.00306654046289623 0.00158904155250639 
0.00321128801442683 0.00153782335110009 
0.0033191975671798 0.0012133609270677 
0.00341209769248962 0.00127256964333355 
0.0035096004139632 0.0014611006481573 
0.00369360763579607 0.00135973305441439 
0.00391940632835031 0.00120643386617303 
0.00416957074776292 0.0011201755842194 
0.00452496996149421 0.00136270117945969 
0.00494055217131972 0.00161210831720382 
0.00539818266406655 0.00165304006077349 
0.00577371940016747 0.00138307933229953 
0.00618212530389428 0.00101114134304225 
0.00661082658916712 0.000658034579828382 
0.0069300215691328 0.000849105417728424 
0.00721236551180482 0.000889911781996489 
0.00752343703061342 0.00105318368878216 
0.00794609822332859 0.000579355750232935 
0.0083452807739377 0.000456871057394892 
0.0087256645783782 0.000299606734188274 
0.00909776799380779 0.000533222570084035 
0.00943978689610958 0.000729955732822418 
0.00980160012841225 0.000461909861769527 
0.0101891597732902 0.000312423013383523 
0.0106760123744607 -3.34264564116893e-06 
0.0111999930813909 0.000151689222548157 
0.0118390209972858 3.01091877190629e-05 
0.0126673253253102 -7.26484940969385e-05 
0.0135954301804304 -3.08653507090639e-05 
0.0147013049572706 -5.54090947844088e-05 
0.0158639028668404 0.000411685759900138 
0.0171231646090746 0.000289220770355314 
0.0183306690305471 0.000253745005466044 
0.0194636061787605 0.000271725439233705 
0.0204403456300497 0.000282551016425714 
0.0212005730718374 -5.41441295354161e-05 
0.0215357150882483 -0.00105654820799828 
0.0213129334151745 -0.000750789302401245 
0.0206892527639866 -0.000640211044810712 
0.0197273269295692 0.000607505906373262 
0.0188220273703337 0.00050209421897307 
0.0177990291267633 0.00075396237662062 
0.0170547440648079 -0.000206951590371318 
0.0163524765521288 -0.000295083737000823 
0.0159032735973597 -0.000508430006448179 
0.0155562656000257 -0.000120093995064963 
0.0153859620913863 -0.000372017588233575 
0.0153809208422899 -8.36958715808578e-05 
0.0154587049037218 -0.000107893094536848 
0.0156391654163599 -2.51851433858974e-05 
0.0159040503203869 -0.000218611879972741 
0.0162087418138981 -0.000327693356666714 
0.0165967177599669 6.0565558669623e-05 
0.0171513110399246 0.000218152708839625 
0.0178102739155293 0.000225177354877815 
0.0189107153564692 0.000170406070537865 
0.0206797681748867 0.000561838503926992 
0.0244487132877111 0.000974816328380257 
0.0316263325512409 0.000136011105496436 
0.0438792519271374 -0.000854871061164886 
0.0622859448194504 -0.0017304418142885 
0.0865600109100342 -0.00307966745458543 
0.114765129983425 -0.00605766661465168 
0.143804177641869 -0.00836746301501989 
0.169671043753624 -0.00903325993567705 
0.190080925822258 -0.00695623736828566 
0.203699946403503 -0.00707831280305982 
0.211955785751343 -0.00479817623272538 
0.215813338756561 -0.00573171582072973 
0.217543542385101 -0.000961054698564112 
0.217088267207146 0.00158755457960069 
0.214406579732895 0.00357042043469846 
0.210514888167381 0.000742569100111723 
0.205891132354736 -0.000995352980680764 
0.20134936273098 0.000955632538534701 
0.196733862161636 0.00154802482575178 
0.191920176148415 0.00581033807247877 
0.187936335802078 0.00652950163930655 
0.183642968535423 0.00452809454873204 
0.178978636860847 -0.0025030430406332 
0.174450919032097 -0.00665339455008507 
0.169242635369301 -0.00739426538348198 
0.164148107171059 -0.00834019016474485 
0.158280462026596 -0.00725150294601917 
0.152108520269394 -0.00812998600304127 
0.146042451262474 -0.0101353991776705 
0.140075966715813 -0.0141284056007862 
0.133937612175941 -0.0170425344258547 
0.127299383282661 -0.0167491305619478 
0.120079711079597 -0.0181065145879984 
0.112700469791889 -0.01778544485569 
0.105145946145058 -0.0210620444267988 
0.0973532870411873 -0.0241363719105721 
0.0896258875727654 -0.0278100967407227 
0.0820315703749657 -0.0289652477949858 
0.0744791999459267 -0.0297517068684101 
0.0671976134181023 -0.0289201065897942 
0.0599826127290726 -0.0295800380408764 
0.0528876073658466 -0.0289839524775743 
0.0460402145981789 -0.0299280826002359 
0.0393740199506283 -0.0285466499626637 
0.0334503650665283 -0.0279542896896601 
0.0280409455299377 -0.0252341590821743 
0.0231705214828253 -0.0232184734195471 
0.0184255708009005 -0.0194549970328808 
0.0140856551006436 -0.0158136989921331 
0.0105606755241752 -0.0121167358011007 
0.00786638166755438 -0.00971802696585655 
0.00579908723011613 -0.00832639262080193 
0.00432047201320529 -0.00722217885777354 
0.00307871284894645 -0.00549374194815755 
0.00226653390564024 -0.00338947749696672 
0.00150986656080931 -0.00179731450043619 
0.00108880724292248 -0.000770075770560652 
0.000749141443520784 -0.000458324881037697 
0.000508854514919221 0.000128699030028656 
0.000355192605638877 0.000468319689389318 
0.00015987608639989 0.000968692940659821 
0.000167267033248208 0.000401506520574912 
8.51689546834677e-05 0.000395505601773039 
6.30246213404462e-05 0.000572756049223244 
3.96546347474214e-05 0.00063774234149605 
0.000150826759636402 0.000285603193333372 
0.000131246604723856 -0.000175221095560119 
8.3300554251764e-05 -0.000518000742886215 
2.92342174361693e-05 -0.000627792149316519 
0.000162832977366634 -0.000803356757387519 
0.000168610131368041 -0.000235123559832573 
0.000145466052345 -0.000174999193404801 
7.29587336536497e-05 -0.000249752716626972 
5.35087274329271e-05 -0.000194211839698255 
4.04044039896689e-05 0.000142119824886322 
3.61788552254438e-05 0.000506637326907367 
6.91742461640388e-05 0.0003054981934838 
0.00011207300121896 -0.000114721733552869 
2.00521117221797e-05 -1.78064110514242e-05 
-7.99408808234148e-05 0.000291863398160785 
-0.00020040464005433 0.000611683470197022 
-0.000190713020856492 0.00080317264655605 
-0.000131296968902461 0.000824710994493216 
-6.04858578299172e-05 0.000554219586774707 
-7.59479444241151e-05 0.000312302203383297 
-5.40937180630863e-05 7.22793483873829e-05 
-7.02543620718643e-05 -1.75609256984899e-05 
-3.4065295039909e-05 0.000232634847634472 
-9.77920717559755e-05 0.000413116096751764 
-4.21076802012976e-05 0.000528895063325763 
