0 0 0 0 
0 0 0 0 
0 0 0 0 
0 0 0 0 
0 0 0 0 
0 0 0 0 
0 0 0 0 
0 0 0 0 
0 0 0 0 
0 0 0 0 
0.00728865014389157 -0.000188387843081728 2.7751437301049e-05 1.55526026901498e-06 
0.00858856923878193 -0.00021029295749031 3.41011582349893e-05 6.16815214016242e-07 
0.0094911502674222 -0.000229332232265733 3.9000155084068e-05 -7.95770915829053e-07 
0.0103657860308886 -0.000250219745794311 4.33934837928973e-05 -1.67480982327106e-06 
0.011031343601644 -0.000267455994617194 4.74925545859151e-05 -3.06436209029926e-06 
0.0115429237484932 -0.000276935024885461 5.06453761772718e-05 -4.61475565316505e-06 
0.0119965150952339 -0.000282029184745625 5.18305387231521e-05 -5.12818223796785e-06 
0.0123834684491158 -0.000281604094197974 5.12719998368993e-05 -5.32312697032467e-06 
0.0126895541325212 -0.000274862482910976 4.89889862365089e-05 -5.68415180168813e-06 
0.0129298800602555 -0.000265582726569846 4.36354202975053e-05 -4.92429990117671e-06 
0.0130354668945074 -0.000257550680544227 3.65547057299409e-05 -3.81664267479209e-06 
0.0129909459501505 -0.00024802194093354 2.84420402749674e-05 -2.98997133540979e-06 
0.0128635717555881 -0.000238055406953208 1.95313623407856e-05 -1.93159962691425e-06 
0.0126086305826902 -0.000226543299504556 1.11896542875911e-05 -8.78879234278429e-07 
0.0122588602825999 -0.000213639577850699 3.9509745874966e-06 -9.07799702076773e-08 
0.0118433246389031 -0.0002002956753131 -2.07263042284467e-06 6.24850031272217e-07 
0.0113907149061561 -0.000187045487109572 -6.67663925923989e-06 1.32214734094305e-06 
0.0108884116634727 -0.000173034160980023 -9.90715761872707e-06 1.66833171988401e-06 
0.0103631606325507 -0.000159281757078134 -1.2647034964175e-05 2.14805322684697e-06 
0.00983869750052691 -0.000146533784572966 -1.43915021908469e-05 2.49466461355041e-06 
0.00930900778621435 -0.000134202055050991 -1.55127127072774e-05 2.63103788711305e-06 
0.00879323296248913 -0.000123372708912939 -1.63255808729446e-05 2.66633014689432e-06 
0.00830196216702461 -0.00011492166959215 -1.66846402862575e-05 2.88201795228815e-06 
0.00782482698559761 -0.000108929176349193 -1.67053876793943e-05 2.85618762063677e-06 
0.00732647068798542 -0.000104238999483641 -1.69514914887259e-05 2.9473580980266e-06 
0.00680884020403028 -9.88457759376615e-05 -1.71181909536244e-05 3.08536073134746e-06 
0.00632935855537653 -9.18233272386715e-05 -1.70238727150718e-05 3.16249384013645e-06 
0.00589889800176024 -8.28716219984926e-05 -1.6748806956457e-05 3.07715095004824e-06 
0.00554895773530006 -7.21541946404614e-05 -1.6325298929587e-05 3.01831551041687e-06 
0.00529666803777218 -6.09681155765429e-05 -1.55871348397341e-05 2.88766386802308e-06 
0.00515314377844334 -5.10168283653911e-05 -1.50825671880739e-05 2.76674654742237e-06 
0.00505084125325084 -4.2534498788882e-05 -1.46677530210582e-05 2.65613198280334e-06 
0.00498871318995953 -3.53192190232221e-05 -1.43805555126164e-05 2.57054512076138e-06 
0.00497160525992513 -2.88732062472263e-05 -1.41924074341659e-05 2.50665107159875e-06 
0.00502216629683971 -2.21582431549905e-05 -1.41041982715251e-05 2.40507029047876e-06 
0.0051532369107008 -1.56657551997341e-05 -1.41010814331821e-05 2.29524357564515e-06 
0.00535637652501464 -9.88663941825507e-06 -1.41000455187168e-05 2.16500802707742e-06 
0.00561032118275762 -4.61398803963675e-06 -1.41576047099079e-05 2.04782804757997e-06 
0.00589883606880903 7.17497186997207e-07 -1.42210728881764e-05 1.86959289294464e-06 
0.0062157241627574 5.25545419804985e-06 -1.43000524985837e-05 1.73418823123939e-06 
0.0065073654986918 8.69526957103517e-06 -1.43631114042364e-05 1.53627274812607e-06 
0.00676211435347795 1.21231823868584e-05 -1.43790539368638e-05 1.47245350490266e-06 
0.00697268778458238 1.5376277588075e-05 -1.43056959132082e-05 1.3042022146692e-06 
0.00714562460780144 1.97016779566184e-05 -1.42434973895433e-05 1.20529250580148e-06 
0.00727641955018044 2.41841444221791e-05 -1.40087267936906e-05 1.10431074062944e-06 
0.0073828250169754 3.04439236060716e-05 -1.38763161885436e-05 1.07248013136996e-06 
0.00747677031904459 3.75313757103868e-05 -1.37224142235937e-05 9.33275771330955e-07 
0.00757375499233603 4.62811040051747e-05 -1.35504596983083e-05 8.17367379113421e-07 
0.00767663819715381 5.49150536244269e-05 -1.33716712298337e-05 7.19168440355133e-07 
0.00779082486405969 6.46316329948604e-05 -1.34591909954906e-05 5.98499298121169e-07 
0.0079291108995676 7.47639060136862e-05 -1.32817012854503e-05 4.41106095649957e-07 
0.00809869170188904 8.49901844048873e-05 -1.32906989165349e-05 3.20462987701831e-07 
0.00830950122326612 9.53395137912594e-05 -1.34336623887066e-05 2.38998268287105e-07 
0.00857921782881021 0.000106559084088076 -1.3635247341881e-05 4.77123087705422e-08 
0.00893565639853477 0.000118806208774913 -1.39412632051972e-05 2.63462340832632e-09 
0.00939528271555901 0.000132785891764797 -1.44054629345192e-05 -7.72549810790224e-08 
0.00995649676769972 0.000149121944559738 -1.48606777656823e-05 -1.41787253937764e-07 
0.0106130437925458 0.000166948608239181 -1.54613426275318e-05 -2.07464523782619e-07 
0.0113312099128962 0.000184424250619486 -1.6195937860175e-05 -1.36348035084666e-07 
0.0120683591812849 0.000201725299120881 -1.67974631040124e-05 -1.22180722428311e-07 
0.0128129422664642 0.000219290886889212 -1.74512570083607e-05 3.70583528308543e-08 
0.013480412773788 0.000232582577154972 -1.8174507204094e-05 4.12156957452225e-08 
0.0140349585562944 0.000244135007960722 -1.86055403901264e-05 6.49401812324868e-08 
0.0143936304375529 0.000250587909249589 -1.84368564077886e-05 1.89563905905743e-07 
0.0145042864605784 0.000252458121394739 -1.8483862731955e-05 3.57899580194498e-07 
0.0143257798627019 0.000247801683144644 -1.8048833226203e-05 2.67402811005013e-07 
0.0139362756162882 0.000240506866248325 -1.72434065461857e-05 2.69490413984386e-07 
0.0133486976847053 0.000227840937441215 -1.65618275786983e-05 3.43474908959251e-07 
0.0126947779208422 0.000215461259358563 -1.59338123921771e-05 5.94941518272663e-08 
0.0120453722774982 0.000202368901227601 -1.50638370541856e-05 -2.44868829213374e-07 
0.0114638227969408 0.000190343998838216 -1.38607183544082e-05 -5.33247145995119e-07 
0.010988999158144 0.000179744543856941 -1.31253709696466e-05 -7.04726460298843e-07 
0.0106421234086156 0.00017087826563511 -1.23461741168285e-05 -9.49616264733777e-07 
0.0104139046743512 0.000163960110512562 -1.18625694085495e-05 -9.47884927882114e-07 
0.0103135574609041 0.00015954468108248 -1.11475155790686e-05 -1.17618162676081e-06 
0.0103115644305944 0.000155778805492446 -1.11556746560382e-05 -1.19494563932676e-06 
0.0103625515475869 0.00015312027244363 -1.11228619061876e-05 -1.2472388561946e-06 
0.0104871401563287 0.000151912390720099 -1.10069322545314e-05 -1.36551454943401e-06 
0.0106674274429679 0.000152485692524351 -1.11520348582417e-05 -1.50956714151107e-06 
0.0108906589448452 0.000153498607687652 -1.12926772999344e-05 -1.4820885780864e-06 
0.0111644500866532 0.000157287620822899 -1.17393501568586e-05 -1.70950045230711e-06 
0.0115477768704295 0.000165805424330756 -1.2088527000742e-05 -2.01359284801583e-06 
0.0120925409719348 0.000179530106834136 -1.24915486594546e-05 -2.10051484828e-06 
0.0129764778539538 0.000203394534764811 -1.2593433893926e-05 -2.28379826694436e-06 
0.0146143501624465 0.000244199996814132 -1.33395988086704e-05 -3.03189722217212e-06 
0.0177863147109747 0.000312493764795363 -1.35119180413312e-05 -4.0741188058746e-06 
0.0235663484781981 0.000413326924899593 -1.44699552038219e-05 -5.63185813007294e-06 
0.0332192853093147 0.000531670404598117 -1.88542398973368e-05 -7.26050984667381e-06 
0.0478106141090393 0.0006422123988159 -2.56737257586792e-05 -9.22128401725786e-06 
0.0677850916981697 0.00073151511605829 -2.88940009340877e-05 -1.07366486190585e-05 
0.092282772064209 0.000763205869589001 -3.40321203111671e-05 -9.91520937532187e-06 
0.118776075541973 0.00071759830461815 -4.26727820013184e-05 -8.14272152638296e-06 
0.145040348172188 0.000611295981798321 -4.90212732984219e-05 -3.64473180525238e-06 
0.168603986501694 0.000479111331515014 -4.55964582215529e-05 1.27061241528281e-06 
0.187582477927208 0.000313670403556898 -5.49199139641132e-05 8.01259193394799e-06 
0.200564458966255 0.000162786964210682 -6.14854870946147e-05 1.17161334856064e-05 
0.209072530269623 2.97383721772349e-05 -6.24367094133049e-05 1.75990207935683e-05 
0.213699266314507 -7.04102567397058e-05 -6.50913862045854e-05 1.56838250404689e-05 
0.215240955352783 -0.000142703211167827 -6.35011747363023e-05 1.15504653876997e-05 
0.214677348732948 -0.000171416002558544 -5.33851198269986e-05 8.00894849817269e-06 
0.21332323551178 -0.000208064404432662 -4.95377171318978e-05 4.93125253342441e-06 
0.210792034864426 -0.000235343002714217 -4.63554970338009e-05 1.48186484238977e-06 
0.207268729805946 -0.000246094714384526 -3.99925593228545e-05 -5.92766298268543e-07 
0.20344190299511 -0.000280812848359346 -3.56662239937577e-05 2.64195068666595e-06 
0.199163526296616 -0.000309124327031896 -3.41561208188068e-05 1.88412150237127e-06 
0.194751158356667 -0.000312129268422723 -2.80924432445318e-05 -7.82209497174335e-07 
0.190400511026382 -0.00030143343610689 -2.01755119633162e-05 -3.71886721950432e-06 
0.185846284031868 -0.000284229405224323 -9.2833270173287e-06 -2.89032527689415e-06 
0.181173950433731 -0.000252951693255454 -4.09674294132856e-06 -6.94513391863438e-06 
0.175863221287727 -0.000228763368795626 5.49424430573708e-06 -8.04998853709549e-06 
0.170206248760223 -0.00020650758233387 2.04884909180691e-05 -6.74856846671901e-06 
0.164361760020256 -0.000186475619557314 2.97483511531027e-05 -7.06139690009877e-06 
0.158387333154678 -0.000167757534654811 4.16188813687768e-05 -6.54900577501394e-06 
0.151796236634254 -0.0001356605644105 4.78411093354225e-05 -5.8735813581734e-06 
0.145489111542702 -0.000105547864222899 5.53934223717079e-05 -6.74047623760998e-06 
0.138779982924461 -6.16508550592698e-05 5.63851790502667e-05 -8.48644413053989e-06 
0.132013559341431 -2.2569633074454e-05 6.62569364067167e-05 -9.93261164694559e-06 
0.125011965632439 9.43061240832321e-06 7.02304241713136e-05 -1.20687045637169e-05 
0.11800279468298 4.63594078610186e-05 7.66717494116165e-05 -1.33456305775326e-05 
0.111001953482628 8.64056273712777e-05 8.43753878143616e-05 -1.17179770313669e-05 
0.103987082839012 0.000116449002234731 9.18553851079196e-05 -8.57369650475448e-06 
0.0963011607527733 0.000152651817188598 9.54654897213914e-05 -5.27000202055206e-06 
0.0888463631272316 0.000190594655578025 0.000100442273833323 -2.15112436308118e-06 
0.0813091024756432 0.000211569538805634 0.000106644503830466 1.59991282089322e-06 
0.0737115368247032 0.000234338542213663 0.000107972475234419 2.89469744529924e-06 
0.0661533921957016 0.000249337637796998 0.000112116198579315 5.82702386964229e-06 
0.0590720139443874 0.00026556703960523 0.000113399590190966 7.73549072619062e-06 
0.0520004779100418 0.000269626616500318 0.000111773362732492 9.77089803200215e-06 
0.0453997924923897 0.000273970334092155 0.000108010812255088 1.15478305815486e-05 
0.0391506403684616 0.000266818999079987 0.000104237544292118 1.3546782611229e-05 
0.0334337763488293 0.000255088816629723 9.88108076853678e-05 1.33298672153614e-05 
0.0280281081795692 0.000236861436860636 9.13200929062441e-05 1.32409395519062e-05 
0.0231454931199551 0.000212164712138474 8.26829054858536e-05 1.26654504128965e-05 
0.0187212135642767 0.000182606425369158 7.25025020074099e-05 1.22821738841594e-05 
0.0147586110979319 0.000147609243867919 6.20088030700572e-05 1.13377927846159e-05 
0.0113383717834949 0.000111826288048178 5.06179349031299e-05 1.01660498330602e-05 
0.00855481252074242 7.49102691770531e-05 4.14368550991639e-05 8.81143569131382e-06 
0.00634279660880566 4.06330364057794e-05 3.34432697854936e-05 7.57233601689222e-06 
0.0045763966627419 9.46471573115559e-06 2.6506384529057e-05 6.27870167591027e-06 
0.00320797087624669 -1.50765054058866e-05 2.08869623747887e-05 4.94052756039309e-06 
0.0021695455070585 -3.40489204972982e-05 1.63927670655539e-05 3.87037607652019e-06 
0.00141120224725455 -4.63722353742924e-05 1.22507408377714e-05 3.092110318903e-06 
0.000852863129694015 -5.46045230294112e-05 9.2668587967637e-06 2.40547819885251e-06 
0.000467942707473412 -5.85172638238873e-05 6.75737328492687e-06 1.9042889789489e-06 
0.000192488718312234 -6.06081885052845e-05 4.76033574159374e-06 1.58833142904768e-06 
1.88802587217651e-05 -6.04800734436139e-05 3.19341643262305e-06 1.41134148634592e-06 
-9.79746619123034e-05 -5.98567567067221e-05 2.22307699004887e-06 1.24249606869853e-06 
-0.00016703043365851 -5.77907485421747e-05 1.39349492656038e-06 1.10696146293776e-06 
-0.000210128011531197 -5.55977021576837e-05 7.58130113354127e-07 1.00131296676409e-06 
-0.000234111532336101 -5.30101133335847e-05 2.57122422908651e-07 9.4268375505635e-07 
-0.000250999844865873 -5.07662916788831e-05 -9.34452728529322e-08 9.17545037282252e-07 
-0.000259472319157794 -4.81755487271585e-05 -5.10052814206574e-07 8.09192783890467e-07 
-0.000261476845480502 -4.54778964922298e-05 -7.50483877709485e-07 7.37606285383663e-07 
-0.000256769126281142 -4.25336875196081e-05 -1.02873343621468e-06 7.58885619234206e-07 
-0.000244590803049505 -4.01015167881269e-05 -1.27040812003543e-06 7.41056226161163e-07 
-0.000236621955991723 -3.7594058085233e-05 -1.44439172800048e-06 7.11833990862942e-07 
-0.000226700081839226 -3.53488358086906e-05 -1.49549407524319e-06 7.12890368959052e-07 
-0.000217063512536697 -3.37777273671236e-05 -1.61615810156945e-06 7.27917779386189e-07 
-0.000210349258850329 -3.24920692946762e-05 -1.66775078014325e-06 7.2021947516987e-07 
-0.000202744820853695 -3.12889569613617e-05 -1.74628769400442e-06 7.18030094049027e-07 
-0.000202060953597538 -3.02707849186845e-05 -1.75465004303987e-06 6.62456557165569e-07 
0 0 0 0 
0 0 0 0 
0 0 0 0 
0 0 0 0 
0 0 0 0 
0 0 0 0 
0 0 0 0 
0 0 0 0 
0 0 0 0 
0 0 0 0 
0 0 0 0 
0 0 0 0 
0 0 0 0 
0 0 0 0 
99.665885925293 0.273028939962387 0.0514218918979168 0.00678790872916579 
