0 0 0 0 
0 0 0 0 
0 0 0 0 
0 0 0 0 
0 0 0 0 
0 0 0 0 
0 0 0 0 
0 0 0 0 
0 0 0 0 
0 0 0 0 
0.00179873453453183 4.37908147432609e-06 -8.23314860731728e-10 8.19864128301893e-14 
0.00290944101288915 8.22911715658847e-06 3.27786295883925e-07 1.807935845477e-08 
0.005289392080158 1.43908009704319e-05 6.42930260141839e-08 -2.79581868767309e-08 
0.0103945545852184 1.99655169126345e-05 -3.18685266620378e-07 6.7255012670131e-10 
0.0206315703690052 2.31698486459209e-05 1.61628577188822e-07 5.96593663360068e-09 
0.0352307073771954 2.37439817283303e-05 -5.26044772186651e-08 7.66946239849631e-09 
0.05223498493433 2.01276197913103e-05 6.94419100000232e-09 1.99063094896701e-08 
0.0705347880721092 1.29162399389315e-05 2.52409892986805e-09 3.56575604598675e-08 
0.0873071700334549 4.01637089453288e-06 1.56192370148744e-09 -7.51404058974003e-08 
0.100252814590931 -1.14231363568251e-06 -6.41396802336658e-09 -7.51635980122956e-08 
0.109389543533325 -5.37569576408714e-07 -1.02062980289475e-08 2.95945966399813e-07 
0.116585455834866 2.30571822612546e-06 6.6054534064719e-10 -2.49466950208443e-07 
0.122245453298092 9.99326584860682e-06 -1.60664850312742e-08 5.84337556119863e-08 
0.126936838030815 1.84283890121151e-05 3.72148478700041e-10 -1.05219584156657e-08 
0.131136208772659 2.51951114478288e-05 -2.79671508174317e-09 1.00636530220299e-08 
0.135094732046127 2.66857550741406e-05 -3.86903975524433e-09 -3.32480154519033e-09 
0.139012038707733 3.05991015920881e-05 1.15955904600451e-10 4.26409130227512e-09 
0.142940506339073 2.70788314082893e-05 1.11441638139809e-08 -5.42580957940686e-09 
0.147144839167595 2.4194263460231e-05 1.43910732219865e-08 -1.18697354167807e-08 
0.151021838188171 1.98880388779799e-05 1.92773752516473e-09 -8.68710703372244e-09 
0.15484955906868 1.73621883732267e-05 6.94560053915438e-09 8.30260915574144e-10 
0.15813584625721 1.18765765364515e-05 -5.9811990915648e-09 3.02065172874677e-09 
0.160895198583603 9.64866467256797e-06 -2.22945040206923e-09 6.66489929912473e-09 
0.162892311811447 6.15950602878002e-06 8.16947931525647e-09 9.39668787225401e-10 
0.164259061217308 2.44327338805306e-06 -1.12628271153881e-08 5.56086598990646e-09 
0.165032014250755 -2.53127359428618e-06 -1.40263756165382e-08 1.0378879089501e-08 
0.165323451161385 -6.84883116264245e-06 -8.00060989680773e-11 3.26053051225017e-09 
0.165588811039925 -1.15537595775095e-05 -1.07274891192333e-08 -5.62178525953527e-10 
0.165634125471115 -1.62590258696582e-05 7.34490379628028e-09 -2.33480960259991e-11 
0.16554693877697 -1.79409616976045e-05 -7.81643194613935e-09 -2.73525535554597e-09 
0.165517777204514 -1.78624377440428e-05 -5.57693224934042e-09 7.92002285976423e-09 
0.165208116173744 -1.71430692716967e-05 9.37496036357288e-09 -5.77418068914426e-09 
0.164517238736153 -1.84191012522206e-05 3.04741409884457e-09 -2.6731747926334e-09 
0.163750156760216 -1.68017722899094e-05 1.57269735012733e-08 8.84857964678076e-09 
0.162660583853722 -1.85368990059942e-05 -2.56057752778815e-09 7.88730147860406e-09 
0.161231815814972 -1.67895705089904e-05 5.57119328448152e-09 -3.45001055501726e-10 
0.159609004855156 -1.95883203559788e-05 -4.77639128249052e-09 2.2315904679715e-09 
0.157649874687195 -1.59856699610827e-05 5.08548536615194e-09 -1.18936700488348e-08 
0.154997885227203 -1.52694192365743e-05 3.48277584549805e-09 -3.93343846383232e-09 
0.152254700660706 -1.26202858155011e-05 1.24834712011967e-10 1.83437354195348e-09 
0.149142429232597 -1.45415779115865e-05 5.36441113752062e-09 -1.18885834510252e-09 
0.145697832107544 -9.48038905335125e-06 -2.09319517274764e-09 -4.19381773753003e-09 
0.14181937277317 -8.77660659170942e-06 1.99904914843785e-09 5.51950263272261e-09 
0.137375190854073 -7.65347249398474e-06 7.06631952951398e-09 -2.87905965734581e-09 
0.132494270801544 -5.54490043214173e-06 -9.56393275686196e-09 3.18849346925276e-09 
0.127247348427773 -3.80462438442919e-06 3.43941120029001e-09 -1.30684192356512e-08 
0.122195914387703 -4.54385963166715e-06 5.05632924419075e-10 5.20438403484036e-09 
0.117318488657475 -3.04866989608854e-06 -1.27929036253249e-08 9.03556873765865e-09 
0.112683936953545 -3.49365177498839e-06 5.31096899791805e-09 -1.04600648143105e-08 
0.108076751232147 -5.20378762303153e-06 8.20869872075747e-10 4.4571981661079e-09 
0.103559419512749 -4.37195376434829e-06 8.97170249203327e-09 -4.26119184382401e-09 
0.0986599177122116 -3.67958500646637e-06 -3.10122683089276e-09 6.9203220931513e-09 
0.0936626344919205 -1.6973637002593e-06 -1.99913485765535e-09 -1.92734983528453e-09 
0.0885909274220467 3.19323839903518e-06 -2.60307952970606e-09 -1.82096837608725e-09 
0.0831919610500336 5.42436100658961e-06 -1.57452850757522e-09 2.02365502133262e-09 
0.0777909755706787 6.55649864711449e-06 8.34017477302496e-09 -5.51508172463855e-09 
0.0725716948509216 7.45645411370788e-06 -4.18711953997786e-09 3.94245702750595e-09 
0.0674385577440262 6.18279500486096e-06 5.57748180973761e-10 -2.23851337466385e-09 
0.0627276450395584 5.10893050886807e-06 -3.11929615470774e-09 -4.88208762305931e-09 
0.0586334466934204 6.40502685200772e-06 -2.21041318582138e-09 -1.36699418451514e-09 
0.0548681803047657 6.05682771492866e-06 1.49498979862273e-09 -3.47458728455763e-09 
0.0514568537473679 6.51358095637988e-06 8.52617254576415e-10 -2.5800428460343e-09 
0.0485783815383911 6.65797324472805e-06 5.46375722443315e-10 -1.61101298967736e-09 
0.0459965318441391 5.24709685123526e-06 4.78612038889992e-09 -1.12688558484564e-09 
0.0437221527099609 5.57098246645182e-06 -1.37756539508871e-09 -3.10801773206748e-10 
0.0417579635977745 6.56988640912459e-06 -2.56954013622135e-09 2.73956302088152e-10 
0.0400855094194412 6.95666676620021e-06 -4.77842876378531e-09 1.99974770076494e-09 
0.038347315043211 6.53667166261584e-06 -1.85409676500825e-09 1.8979531279939e-09 
0.0367507748305798 7.98708242655266e-06 3.41985856300298e-10 1.21589316393056e-09 
0.0350865796208382 7.19619220035383e-06 -2.49689002806974e-09 1.95419280757392e-09 
0.0334759727120399 6.94810523782508e-06 -5.32751454063174e-10 1.33679867175829e-09 
0.0318554453551769 6.5320823523507e-06 -4.23234475244172e-10 -1.20375731604838e-09 
0.0303178541362286 6.47991737423581e-06 -9.41102196172494e-10 4.24795865150429e-10 
0.0286884624511003 6.25342454441125e-06 -3.98865274142679e-10 8.70318372925283e-10 
0.0271912552416325 5.34997479917365e-06 1.54955270836865e-09 -4.33981212077938e-10 
0.0256856735795736 5.67951201446704e-06 2.1112003256718e-09 -1.55519830347117e-09 
0.0242447555065155 5.81758240514318e-06 2.54572973812373e-10 2.16349249626546e-09 
0.0227922480553389 6.51443997412571e-06 1.18264531501211e-09 -9.70993618842897e-10 
0.021561237052083 6.33512854619767e-06 1.03485509050927e-09 -1.29741328791511e-09 
0.0204237215220928 7.70272436056985e-06 -2.54351067985326e-10 2.69328170876548e-10 
0.0194744467735291 6.46409716864582e-06 7.62847451873938e-10 -1.07956821260302e-09 
0.0186486877501011 6.1777336668456e-06 1.93656246594287e-09 -9.61798862775254e-10 
0.0180342458188534 5.73498618905433e-06 -1.39394062959042e-09 4.8038018007901e-10 
0.0175281334668398 5.95244455325883e-06 2.14756906702362e-10 -9.12849074108379e-10 
0.0171136241406202 5.72276940147276e-06 6.97942537097873e-10 -2.35001573756222e-10 
0.0167477577924728 5.98111273575341e-06 1.20643017798017e-09 -1.3791566777499e-09 
0.0165456533432007 5.5879240790091e-06 4.02847977198917e-10 -8.39906866278994e-10 
0.016332009807229 5.56312716071261e-06 -4.86005069522122e-10 3.65994012874182e-10 
0.0161547213792801 4.80217295262264e-06 6.68810118398255e-10 -3.79398457095448e-10 
0.0160537678748369 4.13196312365471e-06 -1.55381618682782e-09 -3.49614504013829e-10 
0.0159523021429777 3.95926372220856e-06 -9.05573116494196e-11 -1.55526841405518e-10 
0.0158171318471432 4.59921329820645e-06 1.67488778402003e-09 -2.90570123517853e-10 
0.0157163795083761 4.27883196607581e-06 5.70792302312384e-10 -1.03189179423424e-09 
0.0156047744676471 4.8117722144525e-06 -2.98587071734246e-10 -1.28500443619117e-09 
0.0154084293171763 5.30801798959146e-06 1.23780674599061e-09 -1.59468971361321e-09 
0.0152131142094731 5.43078886039439e-06 -1.4589961183642e-10 -6.08173178484606e-10 
0.014895805157721 4.98179724672809e-06 1.23138754748453e-09 -3.82217923977635e-10 
0.014580418355763 4.76263903692598e-06 1.03611286217387e-09 -2.58659593743715e-10 
0.0141722531989217 4.3011928028136e-06 -2.71101648074978e-11 -9.08371600161217e-10 
0.013768283650279 3.76398020307533e-06 -4.21669893446719e-10 6.64630572799751e-10 
0.0132619738578796 3.16327077598544e-06 1.08099607043499e-09 -4.17979956202075e-10 
0.0127629498019814 2.59112835010455e-06 -4.909048167967e-10 -1.87480933555584e-10 
0.0122372452169657 2.63171159531339e-06 -7.83616838084811e-10 -1.89101484471266e-10 
0.0117491511628032 2.18850618693978e-06 6.78288869515598e-10 -4.13933276544043e-10 
0.0113000283017755 2.09133099815517e-06 2.61150129299281e-10 -7.91234508468186e-11 
0.0108670312911272 2.16601756619639e-06 5.10812052378906e-11 6.43686492995954e-12 
0.0104944100603461 2.12362851925718e-06 1.56072876844604e-09 -3.53506307559925e-10 
0.0101981684565544 2.10360417440825e-06 5.7449628387829e-10 -3.16771914254943e-10 
0.00991828646510839 2.17405954572314e-06 -4.20938367495793e-10 1.94916013884772e-10 
0.00966372434049845 2.20867013922543e-06 1.85410062303326e-10 -1.80177872621812e-10 
0.00951873045414686 2.51609981205547e-06 3.64908464556279e-10 -8.99420704580933e-10 
0.00940899830311537 3.00706142297713e-06 3.94715649054689e-10 -4.08501926729699e-10 
0.00931863859295845 3.20922026730841e-06 7.61705587493111e-10 -5.79555403668053e-10 
0.00929887965321541 3.12056181428488e-06 5.97664251422714e-10 -3.04642533421884e-10 
0.00927239004522562 3.20683079735318e-06 8.50121695261663e-10 -7.28705915054029e-11 
0.00928506162017584 3.01740578834142e-06 7.35256411310559e-10 -3.73398423292315e-10 
0.00932865962386131 2.45894716499606e-06 7.03807234714304e-10 -8.33425620183625e-11 
0.00937347486615181 2.37721042140038e-06 1.24795296319036e-09 -1.73671271808118e-10 
0.00939608085900545 2.19148046198825e-06 1.15382403631514e-09 -7.29205806848654e-10 
0.00946956779807806 1.80280812855926e-06 7.9675860353845e-10 -5.63253776952877e-10 
0.00947730150073767 1.56890985181235e-06 -2.04075825682715e-10 -5.92139445115825e-12 
0.00949083175510168 1.84930377145065e-06 -2.6057217147879e-11 4.83923290328647e-10 
0.00950596947222948 1.66247173183365e-06 1.74774972272473e-10 -6.20484441604674e-10 
0.00945863034576178 1.29705858853413e-06 4.55958257261635e-11 3.67661900924077e-10 
0.00941649079322815 1.09185270957823e-06 2.14530482267605e-09 -1.23240351257436e-09 
0.00941909570246935 5.46680325896887e-07 -8.39833758092823e-12 1.69840599917315e-10 
0.00940037798136473 2.31502411907059e-07 6.3208144274185e-10 -1.06427269774834e-10 
0.00940121430903673 -4.4805724996877e-07 -6.35469843413006e-10 2.22177651276745e-10 
0.0094805620610714 -3.63864046448725e-07 -2.87397883269591e-10 5.41169276058184e-10 
0.00945825967937708 -4.85355656110187e-07 3.9902378623502e-10 8.20719950334059e-11 
0.00945400260388851 -2.88238510393057e-07 -1.49660353554459e-10 3.30413751914449e-11 
0.00940468814224005 -3.51839673840004e-07 6.52231546549586e-10 6.71057783993567e-12 
0.00929186213761568 3.97025843312804e-07 -1.01543606856325e-10 3.57409761508887e-11 
0.00916368328034878 6.6292807332502e-07 5.04722409699898e-11 4.94821295049519e-10 
0.00902939401566982 7.49766115859529e-07 -6.13091022394485e-10 2.90743762398904e-10 
0.00886660628020763 9.07973458197375e-07 -1.31930327773588e-10 3.53067367009352e-11 
0.00864727608859539 1.82698812523086e-07 -1.84597337415937e-10 -3.29434708679077e-11 
0.00838766619563103 -6.33451691101072e-07 1.46506473619468e-10 -1.2540615768053e-10 
0.00801830273121595 -1.33681362513016e-06 9.25242313321029e-11 4.0066640977221e-11 
0.00759855518117547 -1.99294595404353e-06 -2.65814176225732e-10 3.85429119176273e-11 
0.00700475974008441 -2.71445242105983e-06 6.73637534642779e-10 -1.96768989990659e-10 
0.00637156702578068 -2.86793670056795e-06 1.31392202673553e-10 -1.85222170934196e-10 
0.00564670469611883 -3.38873155669717e-06 -1.30535873776871e-10 1.86330933321655e-11 
0.00488865282386541 -3.66488507097529e-06 -2.47126152874699e-10 4.64165289537632e-10 
0.00410174718126655 -3.64721176993044e-06 -1.94298382938385e-10 1.24770888065839e-10 
0.00336138368584216 -3.59169257535541e-06 -3.13083475811382e-10 1.24897828190917e-10 
0.00267884996719658 -3.29615136251959e-06 -2.16493031834908e-10 -5.34159739010165e-12 
0.00206355773843825 -2.46449098995072e-06 -9.93413892813599e-11 4.93675586521469e-11 
0.00154290394857526 -1.84925102075795e-06 -9.56677792540717e-11 5.14798030593067e-11 
0.00112011178862303 -1.21221046356368e-06 -1.3835509127258e-10 1.01903312177409e-10 
0.000802107446361333 -6.85536178934854e-07 -4.15783449336793e-11 2.28973142529787e-11 
0.000550060358364135 -1.493362731253e-07 -5.71440846031113e-11 6.85200091110616e-11 
0.000385550607461482 4.92708984722867e-09 3.19092105169339e-12 -4.39945090991226e-13 
0.00027345385751687 2.53020829177331e-07 3.56019796976526e-11 -2.197866888487e-11 
0.000206529337447137 2.79679795767152e-07 2.80380978850969e-11 -1.3738689873255e-11 
0.000162438824190758 3.47600149552818e-07 3.29638052964931e-11 -2.84817655571423e-11 
0.000137496695970185 2.64808392103077e-07 1.59368785529468e-11 -1.09456896671412e-11 
0.00011884772538906 2.78676793641353e-07 1.38382760112021e-11 -1.75053704171146e-11 
0.000103023521660361 2.05591575763719e-07 1.65846537891756e-11 -9.40089325829341e-12 
9.32486509555019e-05 2.29346952096421e-07 7.72974349458333e-13 -8.02167533786591e-12 
7.84585936344229e-05 1.97447533878403e-07 7.38811789524618e-12 -9.32752139415349e-12 
0 0 0 0 
0 0 0 0 
0 0 0 0 
0 0 0 0 
0 0 0 0 
0 0 0 0 
0 0 0 0 
0 0 0 0 
0 0 0 0 
0 0 0 0 
0 0 0 0 
0 0 0 0 
0 0 0 0 
0 0 0 0 
99.9870071411133 0.011625912040472 4.94702144351322e-05 4.11342844017781e-05 
