0 0 0 0 
0 0 0 0 
0 0 0 0 
0 0 0 0 
0 0 0 0 
0 0 0 0 
0 0 0 0 
0 0 0 0 
0 0 0 0 
0 0 0 0 
0.0127753000706434 0.000130121377878822 3.38599784299731e-05 5.40639666724019e-06 
0.0174562688916922 0.000187658893992193 3.69423432857729e-05 6.20604077994358e-06 
0.0221483167260885 0.000252369878580794 3.68017608707305e-05 6.47899105388205e-06 
0.0273079164326191 0.000322771928040311 3.55621923517901e-05 6.43877547190641e-06 
0.0334993079304695 0.000411703484132886 3.03973902191501e-05 5.78886283619795e-06 
0.0403483510017395 0.000510915648192167 2.22862126975087e-05 4.58569002148579e-06 
0.0475447215139866 0.00060211424715817 1.26487202578573e-05 2.87760258288472e-06 
0.0550829991698265 0.000682443962432444 2.3760658223182e-06 1.01784496564505e-06 
0.0628384277224541 0.000743988435715437 -7.26155985830701e-06 -2.87690170353017e-07 
0.0702837109565735 0.000765565666370094 -1.32350705825957e-05 -1.02378589872387e-06 
0.0777700170874596 0.000756181892938912 -1.62374180945335e-05 -1.38200846322434e-06 
0.0855965912342072 0.000722419878002256 -1.80421557161026e-05 -1.3686983493244e-06 
0.0937436297535896 0.000666988955345005 -1.74476463143947e-05 -7.163937993937e-07 
0.101622022688389 0.000597422884311527 -1.65441815624945e-05 -4.54909525160474e-07 
0.109185822308064 0.000520739587955177 -1.60864947247319e-05 -3.47308997561413e-07 
0.116393178701401 0.000442506192484871 -1.38713457999984e-05 -6.17848741057969e-07 
0.123248785734177 0.000373077025869861 -1.00934921647422e-05 -8.76666945259785e-07 
0.129845768213272 0.000307754438836128 -9.20175716601079e-06 -1.0542263453317e-06 
0.136195793747902 0.000249889882979915 -4.7224857553374e-06 -1.24157907066547e-06 
0.142127990722656 0.000200190945179202 -1.01612863545597e-06 -1.74115189111035e-06 
0.147537112236023 0.000158384384121746 -3.97394117612748e-08 -1.81392351805698e-06 
0.152370229363441 0.000122376994113438 -1.92837603663065e-07 -1.72061584180483e-06 
0.156365990638733 9.42055557970889e-05 1.04474247564212e-06 -2.09387962968322e-06 
0.159525543451309 7.65708682592958e-05 -3.98127758671762e-06 -1.7070121884899e-06 
0.162243992090225 5.98922233621124e-05 -9.44909879763145e-06 -4.61760578218673e-07 
0.164881438016891 3.85576240660157e-05 -1.23410472951946e-05 7.46068792523147e-07 
0.167530491948128 1.30551461552386e-05 -1.1343589903845e-05 1.48226797591633e-06 
0.170213401317596 -1.74848100868985e-05 -7.51002880861051e-06 1.58149509843497e-06 
0.173085659742355 -5.92807664361317e-05 1.82047494945436e-06 9.80077629719744e-07 
0.175638288259506 -9.15963391889818e-05 1.28265191960963e-05 -5.34282946773601e-07 
0.177494764328003 -0.000123723802971654 2.301889253431e-05 -2.27870623348281e-06 
0.178506836295128 -0.000150866428157315 2.63018810073845e-05 -3.49855190506787e-06 
0.178797423839569 -0.000162779178936034 2.79761297861114e-05 -3.14379485644167e-06 
0.17820979654789 -0.000172456682776101 2.89159197564004e-05 -2.85718465420359e-06 
0.176976129412651 -0.000187755867955275 2.70947130047716e-05 -2.72295505965303e-06 
0.175276458263397 -0.000200997776119038 2.38859174714889e-05 -1.6603435142315e-06 
0.173281863331795 -0.000204095849767327 2.38428656302858e-05 -1.24022119507572e-06 
0.170636266469955 -0.000212957602343522 2.3402306396747e-05 -1.98987663679873e-06 
0.167462185025215 -0.000219229084905237 1.93672312889248e-05 -1.42669944125373e-06 
0.164345070719719 -0.000220718764467165 1.53760975081241e-05 -1.22369999644434e-06 
0.160754278302193 -0.000216085434658453 1.28923766169464e-05 -8.91277025516501e-08 
0.156646072864532 -0.000224494593567215 1.1879319572472e-05 3.13585928779503e-07 
0.152244403958321 -0.000220039859414101 7.58232044972829e-06 1.86208967534185e-06 
0.147269055247307 -0.000218222237890586 6.13365182289272e-06 1.98503903448e-06 
0.141639649868011 -0.000209461126360111 7.07540539224283e-06 2.712358309509e-06 
0.135636210441589 -0.000210511672776192 5.82259372094995e-06 1.99011310542119e-06 
0.129382058978081 -0.000200368143850937 3.21065931530029e-06 2.51832511821704e-06 
0.12300106883049 -0.000197204310097732 1.25987173760223e-06 2.18303694055066e-06 
0.116934262216091 -0.000191732353414409 -1.61402385856491e-06 1.95570669347944e-06 
0.110802158713341 -0.000191153361811303 -5.61203978577396e-06 2.06541335501242e-06 
0.10472472012043 -0.000180588816874661 -1.02085687103681e-05 1.83818667665037e-06 
0.0985866785049438 -0.000172026542713866 -1.42705539474264e-05 1.77749348040379e-06 
0.0923568457365036 -0.000167266727657989 -1.84721811820054e-05 1.65004541941016e-06 
0.0859572365880013 -0.000158852591994219 -2.29380657401634e-05 1.80528650162159e-06 
0.0794576406478882 -0.000151818341691978 -2.49841414188268e-05 1.87930913853052e-06 
0.0729900300502777 -0.000145374477142468 -2.61405239143642e-05 2.3115853764466e-06 
0.0667261779308319 -0.00013976996706333 -2.7709580535884e-05 2.16862417801167e-06 
0.0608670972287655 -0.000131931185023859 -2.7272730221739e-05 2.4464609396091e-06 
0.0555880255997181 -0.000123995458125137 -2.58261370618129e-05 2.70336136054539e-06 
0.0508855395019054 -0.000115141847345512 -2.56988623732468e-05 2.87879538518609e-06 
0.0468098223209381 -0.000107721163658425 -2.58443324128166e-05 2.83572080661543e-06 
0.0432609878480434 -9.89701511571184e-05 -2.61020904872566e-05 3.40793440045672e-06 
0.0402163900434971 -9.21654063859023e-05 -2.6603156584315e-05 3.42206135428569e-06 
0.0375543795526028 -8.38174382806756e-05 -2.67331706709228e-05 3.04084801427962e-06 
0.0352018959820271 -8.01569040049799e-05 -2.6366980819148e-05 2.83366284747899e-06 
0.0330944918096066 -7.41883632144891e-05 -2.54903170571197e-05 2.83914459942025e-06 
0.031264029443264 -7.00731980032288e-05 -2.43256672547432e-05 2.61307195614791e-06 
0.0295729320496321 -6.77661664667539e-05 -2.21622449316783e-05 2.46953209170897e-06 
0.0280288606882095 -6.64668332319707e-05 -2.12703725992469e-05 2.79047026197077e-06 
0.0265842620283365 -6.35085525573231e-05 -2.04137832042761e-05 2.86766953649931e-06 
0.0251753609627485 -5.94371413171757e-05 -1.9892628188245e-05 2.66178449237486e-06 
0.023811299353838 -5.81157437409274e-05 -1.9155248082825e-05 2.34494859796541e-06 
0.0224899314343929 -5.47783602087293e-05 -1.87524328794098e-05 2.14381680052611e-06 
0.0211756639182568 -5.32332778675482e-05 -1.79416019818746e-05 1.76108574123646e-06 
0.0199243258684874 -4.8975085519487e-05 -1.80339284270303e-05 1.46130048506166e-06 
0.01873510889709 -4.74513944936916e-05 -1.73376429302152e-05 1.38494772272679e-06 
0.0175680108368397 -4.4568267185241e-05 -1.68234982993454e-05 1.3111623502482e-06 
0.0165158752351999 -4.13723901147023e-05 -1.65085675689625e-05 1.11350107090402e-06 
0.0155838271602988 -3.89295710192528e-05 -1.61668649525382e-05 1.02663796042179e-06 
0.0147788384929299 -3.71214700862765e-05 -1.53025393956341e-05 9.20427680739522e-07 
0.0140977576375008 -3.58269171556458e-05 -1.48448871186702e-05 9.0582409484341e-07 
0.013564920052886 -3.45519620168488e-05 -1.48304125104914e-05 9.20445984320395e-07 
0.013132062740624 -3.42187486239709e-05 -1.44661107697175e-05 8.56914027735911e-07 
0.0127980057150126 -3.31752598867752e-05 -1.41748423629906e-05 6.4372181896033e-07 
0.0125473337247968 -3.25296605296899e-05 -1.40985885082046e-05 5.6838081263777e-07 
0.0123900175094604 -3.15321631205734e-05 -1.40865549838054e-05 2.8685170150311e-07 
0.0122988875955343 -3.11907642753795e-05 -1.41775635711383e-05 8.37392164498851e-08 
0.0122787486761808 -3.21761872328352e-05 -1.42696562761557e-05 8.62120064226701e-09 
0.0123298102989793 -3.30638431478292e-05 -1.44879595609382e-05 5.71839002816432e-08 
0.0124223502352834 -3.36617595166899e-05 -1.50033274621819e-05 -1.9487007563157e-08 
0.0125606236979365 -3.46557462762576e-05 -1.53342880366836e-05 -1.47803177696915e-07 
0.0127049200236797 -3.51795970345847e-05 -1.53382825374138e-05 -1.72613908944186e-07 
0.0128637598827481 -3.48395078617614e-05 -1.548870386614e-05 -2.48525424240142e-07 
0.0130109284073114 -3.35987933794968e-05 -1.57880131155252e-05 -4.3489515633155e-07 
0.0131381824612617 -3.41476006724406e-05 -1.51812137119123e-05 -4.14368287238176e-07 
0.0131754036992788 -3.41522063536104e-05 -1.45989115480916e-05 -3.4032240137094e-07 
0.0131858130916953 -3.34834985551424e-05 -1.37820870804717e-05 -4.31138005296816e-07 
0.0131555879488587 -3.25619366776664e-05 -1.34131360027823e-05 -3.79053631149873e-07 
0.0130811603739858 -3.1605435651727e-05 -1.30254575196886e-05 -3.49959179857251e-07 
0.0129891568794847 -3.02378794003744e-05 -1.30984462884953e-05 -4.3052756382167e-07 
0.0129430675879121 -2.91369924525497e-05 -1.27755929497653e-05 -4.19572103282917e-07 
0.0129001634195447 -2.85590376734035e-05 -1.24262542158249e-05 -3.80531616883673e-07 
0.012840149924159 -2.79657888313523e-05 -1.22500587167451e-05 -4.64991956050653e-07 
0.0128116672858596 -2.7391088224249e-05 -1.13883970698225e-05 -6.08720824857301e-07 
0.0127917202189565 -2.73465502687031e-05 -1.07492278402788e-05 -6.42515828985779e-07 
0.0127832377329469 -2.69920074060792e-05 -1.07537689473247e-05 -6.95768392233731e-07 
0.0127935102209449 -2.60141005128389e-05 -1.09651264210697e-05 -8.2251739286221e-07 
0.0128160146996379 -2.54595543083269e-05 -1.08461290437845e-05 -9.54792994889431e-07 
0.0128374332562089 -2.47893221967388e-05 -1.12997659016401e-05 -9.35035700422304e-07 
0.012825015000999 -2.34275703405729e-05 -1.13114347186638e-05 -9.81821813184069e-07 
0.012806162238121 -2.17232463910477e-05 -1.09717184386682e-05 -1.12394218376721e-06 
0.0127801457419991 -2.04653879336547e-05 -1.05989020084962e-05 -1.18133800697251e-06 
0.0127321155741811 -1.82625644811196e-05 -1.02965232144925e-05 -1.40745260068798e-06 
0.0126345064491034 -1.71599349414464e-05 -9.98816904029809e-06 -1.55373481902643e-06 
0.0125450575724244 -1.51614758578944e-05 -9.85257338470547e-06 -1.80361814727803e-06 
0.0124128004536033 -1.32318591568037e-05 -1.00430333986878e-05 -1.97541703528259e-06 
0.0122600197792053 -1.07850719359703e-05 -1.00597671917058e-05 -2.16839634958887e-06 
0.0120689226314425 -9.06912464415655e-06 -9.82763231149875e-06 -2.11085421142343e-06 
0.0118546048179269 -7.15061105438508e-06 -9.83097288553836e-06 -2.19400703826977e-06 
0.0116278259083629 -5.4559059208259e-06 -9.82973506324925e-06 -2.41688621827052e-06 
0.0113694965839386 -4.39993846157449e-06 -9.51991114561679e-06 -2.56917383012478e-06 
0.0110322684049606 -3.521215148794e-06 -9.43497525440762e-06 -2.77843059848237e-06 
0.0106987450271845 -2.24099426304747e-06 -9.78197567746975e-06 -3.1338327062258e-06 
0.0103234257549047 -2.22178435649312e-08 -9.67866799328476e-06 -3.43550777870405e-06 
0.0099059222266078 1.22280641789985e-06 -9.72922316577751e-06 -3.4889480957645e-06 
0.00944306328892708 2.88642831947072e-06 -9.56894837145228e-06 -3.83095766665065e-06 
0.00898004230111837 4.57632859252044e-06 -9.7106449175044e-06 -4.09005497203907e-06 
0.00844001956284046 6.16543229625677e-06 -9.51941819948843e-06 -4.22857237936114e-06 
0.00789202284067869 7.34253308110056e-06 -9.5233053798438e-06 -4.39616314906743e-06 
0.00730352103710175 9.03650561667746e-06 -9.19347530725645e-06 -4.61017953057308e-06 
0.00668972311541438 1.13675805550884e-05 -8.88793601916404e-06 -4.60857063444564e-06 
0.00600713165476918 1.32599434436997e-05 -8.01101759861922e-06 -4.48577702627517e-06 
0.00531317293643951 1.52941411215579e-05 -6.80519360685139e-06 -4.34170851804083e-06 
0.00460117729380727 1.67580983543303e-05 -5.16283034812659e-06 -4.12666895499569e-06 
0.00388906849548221 1.84511845873203e-05 -3.369038040546e-06 -3.82619873562362e-06 
0.00320614874362946 1.94280710275052e-05 -1.35049481286842e-06 -3.41108966495085e-06 
0.00258790026418865 2.11325204872992e-05 5.82019367811881e-07 -3.04733498524001e-06 
0.00204480392858386 2.19854555325583e-05 2.5014026050485e-06 -2.63696529145818e-06 
0.00156316836364567 2.26209085667506e-05 4.22610264649848e-06 -2.1957262106298e-06 
0.0011517918901518 2.25333333219169e-05 5.590106411546e-06 -1.75109084921132e-06 
0.000814392347820103 2.18173045141157e-05 6.56513111607637e-06 -1.36726589516911e-06 
0.000555137346964329 1.97152075998019e-05 7.28131863070303e-06 -1.01880516467645e-06 
0.000345086154993623 1.80257156898733e-05 7.68838162912289e-06 -7.24380072369968e-07 
0.000187194105819799 1.6027352103265e-05 8.03304828878026e-06 -4.68407563403161e-07 
6.6921224060934e-05 1.45621997944545e-05 8.38916730572237e-06 -2.52402685418929e-07 
-1.85269291250734e-05 1.32353734443313e-05 8.70084113557823e-06 -9.38156361485198e-08 
-8.75831974553876e-05 1.25060951177147e-05 8.86307407199638e-06 3.62871901415929e-08 
-0.000132977773318999 1.16319351946004e-05 9.04066473594867e-06 1.14193539957341e-07 
-0.000166470432304777 1.11064919110504e-05 9.08190668269526e-06 1.78668599915e-07 
-0.000183740674401633 1.04226755865966e-05 8.93853484740248e-06 2.01307813085805e-07 
-0.000194139953237027 9.82699020823929e-06 8.7172420535353e-06 2.15386194213352e-07 
-0.000194740205188282 9.24199230212253e-06 8.45735667098779e-06 2.29527003625662e-07 
-0.000194668740732595 8.81366395333316e-06 7.98408927948913e-06 2.36965590261207e-07 
-0.000187165656825528 8.12612961453851e-06 7.51785546526662e-06 2.1908148539751e-07 
-0.000178480404429138 7.49373884900706e-06 7.09910182195017e-06 2.18592845158128e-07 
-0.000169328646734357 6.85515215081978e-06 6.68378061163821e-06 2.10022832902723e-07 
-0.000162215161253698 6.36711229162756e-06 6.30030763204559e-06 1.99713198867357e-07 
-0.000153621556819417 5.90894978813594e-06 6.04358001510263e-06 1.867694976454e-07 
-0.000145508616697043 5.49725200471585e-06 5.82110897084931e-06 1.79045684944867e-07 
-0.000140827949508093 5.24582219441072e-06 5.64071251574205e-06 1.83055433922164e-07 
-0.000138684175908566 5.03694764120155e-06 5.43609712622128e-06 1.82610918386672e-07 
0 0 0 0 
0 0 0 0 
0 0 0 0 
0 0 0 0 
0 0 0 0 
0 0 0 0 
0 0 0 0 
0 0 0 0 
0 0 0 0 
0 0 0 0 
0 0 0 0 
0 0 0 0 
0 0 0 0 
0 0 0 0 
99.718147277832 0.255499720573425 0.0198751054704189 0.00285764271393418 
