0 0 0 0 
0 0 0 0 
0 0 0 0 
0 0 0 0 
0 0 0 0 
0 0 0 0 
0 0 0 0 
0 0 0 0 
0 0 0 0 
0 0 0 0 
0.0164218991994858 4.55687222711276e-05 4.44289582901547e-09 2.41468378625598e-09 
0.0229424126446247 6.06618486926891e-05 -2.6202843628198e-07 -1.23920983696735e-07 
0.0297002177685499 7.13385961716995e-05 -5.65905615701467e-08 2.93465740597298e-09 
0.0371109060943127 7.95511150499806e-05 2.85654692788739e-07 6.65008386135924e-08 
0.046140443533659 8.3712067862507e-05 -1.54715152689278e-07 1.03589925970482e-07 
0.0561577714979649 8.296879241243e-05 1.02033425264381e-07 -2.10695034752462e-07 
0.0662926807999611 7.83812720328569e-05 -4.18805896629237e-08 2.36278111742649e-07 
0.0764222666621208 7.11128450348042e-05 2.62516071103391e-08 -1.55089551867604e-07 
0.0861642509698868 6.48348286631517e-05 7.45449213468419e-09 4.96707883712588e-08 
0.0943161398172379 5.93311087868642e-05 2.33489716450208e-09 -8.05957078853226e-09 
0.101515367627144 5.46526971447747e-05 1.20005161363679e-08 4.59050381040882e-10 
0.108251638710499 4.92284016218036e-05 6.6213505789392e-09 -2.49648812733483e-09 
0.114567019045353 4.46147860202473e-05 4.56602089471403e-09 8.15658740549452e-09 
0.12017235159874 3.65558953490108e-05 3.78376263654445e-09 2.01202166039138e-09 
0.125250622630119 2.62502308032708e-05 1.0098454517049e-08 -9.63720925284406e-09 
0.129947274923325 1.51378899317933e-05 -1.61232749373852e-09 6.75952316342432e-09 
0.134588375687599 6.3943216446205e-06 -5.2395701111152e-09 -5.24530685552804e-09 
0.1391561627388 -7.62891886552097e-07 1.89733939670589e-09 -1.17311582670254e-09 
0.143689304590225 -2.35377251556201e-06 5.54531842666961e-09 -3.53186391244265e-09 
0.148092925548553 -5.67342431168072e-06 6.1386127292451e-09 -5.89091930791596e-09 
0.152236878871918 -6.21970229985891e-06 5.89000714867893e-09 8.19184831080122e-10 
0.155960649251938 -7.03482965036528e-06 2.73827049923625e-09 3.12649484079941e-09 
0.159118622541428 -7.10973881723476e-06 -8.00882027363059e-09 9.10884700999759e-10 
0.161746859550476 -1.21526172733866e-05 2.51012183261068e-10 5.16490983315521e-09 
0.163884237408638 -1.49139605127857e-05 1.6814419856459e-09 5.02162589288702e-10 
0.165788501501083 -1.75817567651393e-05 -1.0786881388114e-09 -4.77043160529433e-09 
0.167607203125954 -1.79969629243715e-05 -4.26863611124872e-09 -1.26699415403664e-08 
0.169305682182312 -1.97244426090037e-05 -7.70775457348272e-11 -1.55119994627029e-09 
0.170886799693108 -1.7975689843297e-05 -5.36498134806607e-09 -1.85448967293667e-09 
0.172565251588821 -1.24395328384708e-05 -5.41582834134857e-10 -5.42659384095145e-09 
0.173537224531174 -8.20731656858698e-06 -5.52873613557381e-09 1.00460217922205e-08 
0.173772990703583 -1.10191731437226e-05 5.04987474059249e-09 5.58334445344144e-09 
0.173707976937294 -6.91670402375166e-06 5.67101787751767e-09 -3.97736288348938e-09 
0.172793045639992 -6.85188115312485e-06 1.94460469948865e-09 -3.80541820277358e-09 
0.171048805117607 -8.71118027134798e-06 4.86283546763389e-09 5.84707615658431e-09 
0.168831452727318 -8.68393271957757e-06 -7.6682944438744e-09 1.60570767793189e-09 
0.16672571003437 -5.61042861590977e-06 -1.10694333699257e-08 3.88509890925093e-09 
0.163780897855759 -1.3946024409961e-05 -3.50020967765374e-09 -1.00317745221901e-08 
0.160392478108406 -1.45122094181716e-05 -1.3574013912887e-08 1.94584792723163e-09 
0.157248497009277 -1.85613298526732e-05 -4.94275198548166e-09 1.89367543868002e-09 
0.153757765889168 -1.76661487785168e-05 5.70507530106568e-10 -2.25101159934127e-09 
0.149379283189774 -1.62052438099636e-05 3.96596799845383e-09 3.89245613519051e-09 
0.145067825913429 -1.22372339319554e-05 -5.72607428139804e-09 8.02553223877567e-09 
0.140179336071014 -1.03141010185936e-05 5.75396308377663e-09 -2.15152295979237e-09 
0.13480219244957 -5.5000255088089e-06 1.22162480131749e-09 6.93006985130751e-09 
0.128868818283081 -6.78644073559553e-06 -5.09772890566751e-09 -2.72021072333928e-09 
0.122940093278885 -5.13029681314947e-06 3.4539642257414e-09 2.16241824446683e-09 
0.116741612553596 -3.29501926898956e-06 -4.81810191743648e-09 1.30430299893902e-09 
0.11090462654829 -3.71532428289356e-06 -4.59889903936528e-09 8.41258529504785e-09 
0.104805469512939 -4.3572363210842e-06 3.32458438556671e-09 -1.11425713100743e-09 
0.0991032347083092 -6.42439727016608e-06 -6.97986946018858e-11 -1.86239579313963e-09 
0.0932468175888062 -9.41430971579393e-06 -2.68734146047223e-09 -3.24432902765182e-09 
0.0871784090995789 -1.23029094538651e-05 3.03236907805982e-10 -3.31222116400909e-09 
0.0810261890292168 -1.5561026884825e-05 -3.70981756425692e-09 4.44378400743517e-09 
0.0747421905398369 -1.56600926857209e-05 1.09852515972619e-09 -2.25244112250778e-09 
0.0684400200843811 -1.35436339405715e-05 1.61656854569259e-09 1.76545011942864e-09 
0.0623594261705875 -1.34570409500157e-05 -8.46556214018079e-10 -4.62661331468439e-09 
0.0567448250949383 -9.37881031859433e-06 1.20870669029216e-09 -3.79935816141597e-09 
0.051711093634367 -5.02237526234239e-06 8.25795487546799e-10 1.40093370237793e-09 
0.0472743958234787 -3.09704319079174e-06 -3.76777803401396e-10 4.09300060510986e-09 
0.0434493273496628 -1.9730132407858e-06 -1.37795597154877e-09 2.77566913897687e-10 
0.0401508435606956 7.42366353279067e-07 1.36073069478826e-10 1.76894454639864e-09 
0.0373223498463631 3.39754677725068e-07 1.4805523473882e-09 4.12090583878921e-10 
0.0349525585770607 -1.29109355384571e-06 1.405251470743e-09 -1.32614874637227e-09 
0.0327335596084595 -2.01375314645702e-06 -1.67134917017364e-10 -2.73588707244699e-10 
0.0308068450540304 -2.21101549868763e-06 4.81884476766226e-10 -4.66446437030754e-10 
0.0291230026632547 -1.87273678875499e-06 7.96079202558531e-10 -6.32111030185456e-10 
0.0275010876357555 -1.0660243106031e-06 -1.27803656546632e-09 -1.80253789672236e-09 
0.0259753633290529 1.15603825179278e-06 -8.76822725537352e-10 8.94038398868702e-10 
0.0246075019240379 1.86907607258036e-06 -7.95236043682479e-10 9.15285791602827e-10 
0.0233293101191521 1.14148076590936e-06 1.38951494754735e-09 5.54000623154138e-10 
0.0220121722668409 -3.09852055124793e-07 4.56025911477198e-10 8.34215752032463e-10 
0.020804338157177 -8.94672609774716e-07 1.22050880513314e-09 2.76373784968698e-10 
0.0195594895631075 -1.60391812187299e-06 -4.19542095508874e-10 1.44110978705925e-09 
0.018469151109457 -2.56753878602467e-06 9.12213693471386e-10 5.33540656100229e-10 
0.0173428673297167 -1.85393719220883e-06 2.44362891033134e-10 3.06669745153698e-10 
0.016284104436636 -1.28919873532141e-06 -5.08632580498158e-11 -8.14609657506793e-10 
0.0153567576780915 -2.02648288905038e-06 1.98111718002769e-11 -1.28337326876782e-10 
0.0145199364051223 -2.29294232667598e-06 -3.22785270734371e-10 7.53339890469107e-11 
0.0137867964804173 -2.29372517424054e-06 -2.64757642892688e-11 1.17756845940953e-10 
0.0131486933678389 -2.64312097897346e-06 4.62462845796097e-10 -4.49428383397787e-10 
0.0126628614962101 -2.42720307142008e-06 -3.1367514141678e-10 -2.93804036655132e-10 
0.012249119579792 -1.96894302462169e-06 -1.12294074039454e-09 -4.0074266127732e-10 
0.0119630889967084 -2.2374958916771e-06 -6.62196852907471e-10 -5.53779577749935e-10 
0.0117315584793687 -2.6892457754002e-06 -7.19582241015537e-11 -4.96656105131166e-10 
0.011623359285295 -3.58278339263052e-06 -1.04470121442546e-09 -9.654049087926e-11 
0.0115598356351256 -3.96531004298595e-06 3.35687422303721e-10 -3.59798607574291e-10 
0.0115144029259682 -4.1739449443412e-06 -4.89055240748826e-10 -5.29100097068635e-10 
0.0115355020388961 -4.24858581027365e-06 -5.0628506942374e-10 1.06110273345728e-10 
0.0116274384781718 -4.07346897191019e-06 -5.32368094052771e-10 -6.06335481823095e-10 
0.0117448316887021 -4.81314737044158e-06 -7.66542107566437e-10 1.47399800698444e-10 
0.0118742370977998 -5.2002305892529e-06 -8.25134016668727e-10 -7.18128612131608e-10 
0.0120556904003024 -5.33778302269639e-06 -4.6530043706916e-10 -7.05177721771477e-11 
0.0122654652222991 -5.80092955715372e-06 -1.66621971775527e-09 -2.44456677123139e-10 
0.0123802265152335 -5.21694300914533e-06 -2.08080275232447e-10 -7.09041547697353e-10 
0.0124143427237868 -4.41969632447581e-06 -5.28313615077991e-10 2.45081926975033e-10 
0.012451427988708 -4.2780793592101e-06 -6.74314548643196e-10 -1.06703545998954e-09 
0.0124425319954753 -4.31962644142914e-06 -1.18541143567796e-09 -4.08732991896699e-10 
0.0123898861929774 -4.37181097368011e-06 -3.88311216514836e-10 2.5823509997025e-10 
0.0123456502333283 -4.63619880974875e-06 -2.33611879840723e-10 -2.70263894597278e-10 
0.0123356701806188 -4.53950906376122e-06 -7.61221363720921e-10 -8.47864972675083e-11 
0.0123051451519132 -4.30419549957151e-06 -6.9927058587993e-10 -8.12494849178336e-10 
0.012263523414731 -4.8340330067731e-06 -8.62718174676758e-10 -9.61327822901481e-11 
0.0122605338692665 -5.29901626578066e-06 -2.79491707555479e-10 -7.37360394964526e-10 
0.0122462352737784 -5.54895495952223e-06 -1.12072184865752e-09 -3.23882920483243e-10 
0.012256795540452 -6.09470271228929e-06 -9.44230693633585e-10 1.17962431489538e-10 
0.0123083051294088 -7.32643457013182e-06 -6.09298445031214e-10 6.61188812034474e-11 
0.0123689258471131 -7.44461203794344e-06 -1.50410894850239e-09 1.45633213821661e-10 
0.0124125611037016 -7.79760011937469e-06 -1.23833288068198e-09 9.36146507535263e-11 
0.0124494722113013 -7.81743165134685e-06 1.89492324609297e-10 -5.06616415485439e-10 
0.0125001892447472 -7.32339367459645e-06 -7.04288016795118e-10 -7.34755978282209e-10 
0.0125244623050094 -6.46371654511313e-06 -7.77353403869085e-10 -6.05506478290607e-10 
0.0125598385930061 -6.60477144265315e-06 -6.22675466743772e-10 -2.05405498165945e-10 
0.0125069664791226 -5.97470625507412e-06 -3.08404302096221e-10 -1.06093545060304e-09 
0.012491250410676 -6.76685385769815e-06 -8.41475389368185e-10 -6.93808732687984e-10 
0.0124240657314658 -7.54750772102852e-06 -9.44167299898879e-10 -7.34447919148451e-11 
0.0123622762039304 -7.92710761743365e-06 -6.11948380857541e-10 -4.62468785489278e-10 
0.0122208725661039 -6.99221845934517e-06 -1.07355146994337e-09 1.12770057181244e-10 
0.012069339863956 -7.09066534909653e-06 -3.84271670039738e-10 -3.49817314004852e-10 
0.0119114639237523 -7.11300390321412e-06 5.25842216991812e-11 -3.20633242179014e-10 
0.0116963470354676 -6.50199444862665e-06 -9.54794909802104e-10 -5.53438073147561e-10 
0.0114065837115049 -6.38255278317956e-06 -7.05780045517912e-10 -3.06210112821503e-10 
0.0111468229442835 -7.15765463610296e-06 -6.03877503557726e-10 3.38571781721697e-10 
0.0108804339542985 -7.27137103240239e-06 -5.04264574541224e-10 -1.08430309175844e-09 
0.0105168428272009 -6.36885806670762e-06 -8.10919553728695e-10 -4.31128938105374e-10 
0.0101433983072639 -6.62944285068079e-06 -2.11127809679468e-10 1.74499692473518e-10 
0.00974837690591812 -6.67237191009917e-06 -5.44883860253975e-10 3.77317038724456e-10 
0.00927180331200361 -6.00640623815707e-06 -4.25024959671561e-10 -4.89059903685529e-10 
0.00876675918698311 -5.57003750145668e-06 -6.91817825249075e-10 6.80034500932791e-11 
0.00824045669287443 -5.58384181204019e-06 -1.04993047589375e-09 -3.96220056764207e-10 
0.00768986437469721 -5.20694356964668e-06 -2.46513587320862e-10 -2.01213906647624e-10 
0.00705178175121546 -4.48273385700304e-06 -7.35477012625552e-10 7.12115089118726e-11 
0.00638799695298076 -4.45190471509704e-06 -1.10047117252154e-10 2.42600384225966e-10 
0.00567733636125922 -4.37272274211864e-06 -4.11864375937654e-10 -2.90372337286016e-10 
0.0049629220739007 -4.38024881077581e-06 -3.5215533267241e-10 -2.33689845252627e-10 
0.00424355128780007 -4.28391740570078e-06 -5.07028752316785e-10 -1.57074547812996e-10 
0.0036102884914726 -4.78824676974909e-06 -6.15044681850918e-10 -8.23726573062622e-11 
0.00302638625726104 -5.01155818710686e-06 -5.11494846477945e-10 -2.54694376700115e-10 
0.00249883416108787 -5.18617116540554e-06 -6.28243124189964e-10 -3.54192855600566e-11 
0.00202416931279004 -5.36445713805733e-06 -5.99065463902093e-10 -1.76140158014704e-10 
0.00161244033370167 -5.64905849387287e-06 -6.14587269964773e-10 -1.44380188360493e-10 
0.00124261539895087 -5.70542715649935e-06 -6.62136734330687e-10 -6.42592576372003e-11 
0.000944194907788187 -5.89716319154832e-06 -6.44986508646639e-10 -9.67884522529161e-11 
0.000700479664374143 -5.91140405958868e-06 -6.14748807414855e-10 -1.17030524160455e-10 
0.000513770733959973 -5.90270565226092e-06 -6.60762333737352e-10 -1.2378413571934e-10 
0.000367150962119922 -5.89631736147567e-06 -6.42886910373619e-10 -1.21987753232133e-10 
0.000266612158156931 -5.93558297623531e-06 -6.32538577072239e-10 -1.00253937096451e-10 
0.000185320575837977 -6.06276898906799e-06 -6.63526955602123e-10 -1.10377866568978e-10 
0.000127892417367548 -6.208771992533e-06 -6.83619494346033e-10 -1.10517116291842e-10 
8.17185500636697e-05 -6.19210732111242e-06 -6.79633349598419e-10 -1.03161132414265e-10 
5.16658838023432e-05 -6.10069173490047e-06 -6.6799565878739e-10 -1.07787521963498e-10 
2.57963365584146e-05 -5.97735697738244e-06 -6.55718701558783e-10 -1.01157714149647e-10 
1.21248895084136e-05 -5.71408327232348e-06 -6.24487128675355e-10 -9.62745716481805e-11 
-1.32126581320335e-06 -5.35091248821118e-06 -5.86899639998251e-10 -8.79953748755824e-11 
-8.79586059454596e-06 -5.04179797644611e-06 -5.53801393632369e-10 -8.14632458712161e-11 
-1.60292729560751e-05 -4.71223165732226e-06 -5.1739174056209e-10 -7.95256707708525e-11 
-2.1245883544907e-05 -4.42113514509401e-06 -4.82309081561993e-10 -7.3710676451455e-11 
-2.31869289564202e-05 -4.1859475459205e-06 -4.57845039658622e-10 -6.86148013406829e-11 
-2.69313077296829e-05 -4.03045578423189e-06 -4.40700920201209e-10 -6.67698049627852e-11 
-3.10588075080886e-05 -3.9324045246758e-06 -4.27252233592412e-10 -6.58217022553309e-11 
-3.31652045133524e-05 -3.73226725969289e-06 -4.1059664002141e-10 -6.11314471266056e-11 
0 0 0 0 
0 0 0 0 
0 0 0 0 
0 0 0 0 
0 0 0 0 
0 0 0 0 
0 0 0 0 
0 0 0 0 
0 0 0 0 
0 0 0 0 
0 0 0 0 
0 0 0 0 
0 0 0 0 
0 0 0 0 
99.9727401733398 0.0260233115404844 4.37821145169437e-05 3.98187439714093e-05 
