0 0 0 0 
0 0 0 0 
0 0 0 0 
0 0 0 0 
0 0 0 0 
0 0 0 0 
0 0 0 0 
0 0 0 0 
0 0 0 0 
0 0 0 0 
-0.000193516985746101 6.18741478319862e-06 -1.46370462061896e-06 1.27521246895412e-07 
0.000650899717584252 1.21994935398106e-05 -1.88739051054654e-07 1.26316297155427e-06 
0.00328165106475353 2.45843402808532e-05 2.05003311748442e-06 2.12041345548641e-06 
0.00925696827471256 3.7688540032832e-05 4.40854228145326e-06 1.71901547219022e-06 
0.0219734329730272 4.92724466312211e-05 6.31913007964613e-06 -2.99292594263534e-07 
0.0394494384527206 5.40492001164239e-05 7.29165685697808e-06 -2.54749102168716e-06 
0.0585748329758644 5.20527246408165e-05 7.07103708919021e-06 -4.37540393249947e-06 
0.077589638531208 4.36681621067692e-05 6.46579155727522e-06 -5.5578393585165e-06 
0.0937744081020355 3.14120989060029e-05 5.14107432536548e-06 -5.35760909770033e-06 
0.10409127920866 1.9768076526816e-05 4.61302579424228e-06 -3.25019277624961e-06 
0.110238164663315 1.20836302812677e-05 4.02274372390821e-06 -1.50382038555108e-06 
0.115130074322224 8.73736644280143e-06 4.19540765506099e-06 -5.01210706715938e-07 
0.119520761072636 8.00188718130812e-06 4.00115595766692e-06 -2.47401374053879e-07 
0.123588673770428 7.68727204558672e-06 4.76148943562293e-06 7.4452639609035e-09 
0.127460524439812 9.80768891167827e-06 4.2085712266271e-06 -2.6891436277765e-07 
0.13109202682972 1.20173044706462e-05 3.77502237824956e-06 -6.23865332727291e-08 
0.134686797857285 1.40371230372693e-05 2.94400274469808e-06 -7.95974699485669e-08 
0.138442933559418 1.57638987730024e-05 1.4375865475813e-06 5.59328725557862e-07 
0.142111748456955 1.54080571519444e-05 -8.03265947979526e-07 1.80664312665613e-06 
0.145623996853828 1.26525137602584e-05 -1.46709294313041e-06 3.16473347083956e-06 
0.149090260267258 1.12133075163001e-05 -2.53811595030129e-06 5.20215871802066e-06 
0.152101948857307 9.54113056650385e-06 -2.80206813840778e-06 7.32667513148044e-06 
0.154625833034515 6.65274774291902e-06 -2.12169561564224e-06 8.77553611644544e-06 
0.15684562921524 5.58945976081304e-06 -2.19655544242414e-06 8.58423391036922e-06 
0.158799335360527 3.81021868633979e-06 -2.84164480035543e-06 7.86478722147876e-06 
0.160666078329086 1.72914735685481e-06 -2.65269613919372e-06 5.69695703234174e-06 
0.162480279803276 -1.36306312015222e-06 -3.37935784955334e-06 3.22683240483457e-06 
0.164372980594635 -1.47159153129905e-06 -3.85929160984233e-06 1.18948366889526e-06 
0.166180118918419 -1.58534533056809e-06 -4.94457026434247e-06 -3.92913392488481e-07 
0.167688697576523 -9.55971700022928e-07 -6.95682820150978e-06 -1.65019866926741e-06 
0.168640360236168 4.94577079734881e-07 -7.26367807146744e-06 -2.92686831926403e-06 
0.169159486889839 3.33650496031623e-06 -7.39641654945444e-06 -3.00365786642942e-06 
0.168969660997391 5.51591756448033e-06 -7.89239584264578e-06 -3.44868635693274e-06 
0.168321087956429 7.38644894227036e-06 -7.73012015997665e-06 -2.73316277343838e-06 
0.166924491524696 9.0363719209563e-06 -7.04639842297183e-06 -2.72464899353508e-06 
0.165166676044464 7.57972566134413e-06 -8.02101840235991e-06 -1.48097808505554e-06 
0.163194462656975 6.3995512391557e-06 -8.11049903859384e-06 -8.94486390734528e-07 
0.161034896969795 2.27098507821211e-06 -6.59672605252126e-06 4.39546681718639e-07 
0.15856060385704 -1.87570208254328e-06 -4.98671397508588e-06 8.3667544004129e-07 
0.156241536140442 -6.23107644059928e-06 -2.94093865704781e-06 1.87345256108529e-06 
0.15342304110527 -9.45772353588836e-06 -5.75013643810962e-07 2.03555305233749e-06 
0.150006651878357 -1.54539666255005e-05 6.93133586082695e-07 2.17452702599985e-06 
0.146460577845573 -1.7906017092173e-05 1.21886239412561e-06 9.3622446684094e-07 
0.141907840967178 -1.96883247554069e-05 1.40613951771229e-06 -6.02526938564552e-07 
0.136951938271523 -1.9114522729069e-05 1.98544285012758e-06 -1.75129332546931e-06 
0.131780326366425 -1.7401738659828e-05 1.59184207859653e-06 -3.14322164740588e-06 
0.126465171575546 -1.59724204422673e-05 2.18275135921431e-06 -4.0689096749702e-06 
0.120801255106926 -1.45962903843611e-05 1.5602641951773e-06 -4.03957028538571e-06 
0.115549802780151 -1.43240795296151e-05 1.70381531461317e-06 -4.03482908950537e-06 
0.110090367496014 -1.51682843352319e-05 4.54476678513061e-10 -3.67148163604725e-06 
0.104699984192848 -1.62531723617576e-05 -3.41902875788946e-07 -2.86064187093871e-06 
0.0992729067802429 -1.48624203575309e-05 -9.52840366608143e-07 -2.25311464419065e-06 
0.093519926071167 -1.51217836901196e-05 -8.45168642626959e-07 -1.55027476012037e-06 
0.0876661539077759 -1.57880513143027e-05 -1.17132924515317e-06 -8.53630638175673e-07 
0.0816194489598274 -1.6974128811853e-05 -2.45608134719077e-07 -1.04717219073791e-06 
0.0754677727818489 -1.7929929526872e-05 5.50617812677956e-07 -9.94175934465602e-07 
0.0693511292338371 -1.87494661076926e-05 1.43564102472737e-06 -8.48503646011523e-07 
0.0635430365800858 -1.86924426088808e-05 2.04719344765181e-06 -9.01229043392959e-07 
0.0582266598939896 -1.76493849721737e-05 3.45826424563711e-06 -9.21757475680351e-07 
0.053563304245472 -1.68062742886832e-05 4.49821118309046e-06 -4.75568612046118e-07 
0.0494888760149479 -1.62882388394792e-05 5.04708305015811e-06 -1.77617806684793e-07 
0.0459901466965675 -1.55030138557777e-05 5.16574573339312e-06 -3.84160955491097e-07 
0.0430032834410667 -1.55189445649739e-05 5.85680618314655e-06 -5.65520736017788e-07 
0.0403219573199749 -1.46008178489865e-05 5.47526633454254e-06 -4.95206961659278e-07 
0.0379968769848347 -1.37733140945784e-05 5.73560464545153e-06 -4.14589493402673e-07 
0.0359792932868004 -1.28601095639169e-05 6.23677169642178e-06 -7.97484460690612e-07 
0.0341722518205643 -1.26415834529325e-05 6.79072809361969e-06 -8.45061379095569e-07 
0.0325713418424129 -1.16988039735588e-05 6.84600172462524e-06 -9.13760857201851e-07 
0.0310518499463797 -1.1818136954389e-05 7.66572975408053e-06 -1.11217241283157e-06 
0.0295685678720474 -1.1071369954152e-05 8.20206696516834e-06 -1.38828295348503e-06 
0.0280342698097229 -1.03074889921118e-05 7.90090143709676e-06 -1.12246277694794e-06 
0.0265759229660034 -8.91118816070957e-06 7.8300254244823e-06 -8.26244502150075e-07 
0.0251019299030304 -7.79505899117794e-06 7.66406628827099e-06 -6.91395939611539e-07 
0.0237630233168602 -6.62083130009705e-06 7.52752794141998e-06 -4.65313178210636e-07 
0.0224579125642776 -6.14621512795566e-06 7.90508784120902e-06 -2.1197901389769e-07 
0.0212776325643063 -5.5881832849991e-06 8.46035163704073e-06 -1.01746122638247e-08 
0.0200656540691853 -5.61542947252747e-06 8.65233778313268e-06 -1.22952187098235e-07 
0.0189827810972929 -5.900669748371e-06 9.29118687054142e-06 -2.80792953333275e-08 
0.0179444402456284 -6.05565901423688e-06 9.89116415439639e-06 2.03132994869293e-08 
0.0169917847961187 -6.04630304223974e-06 9.69092070590705e-06 1.96300462107502e-07 
0.0161923822015524 -6.06624098509201e-06 1.01314471976366e-05 1.54615619862852e-07 
0.0155288064852357 -5.53668678549002e-06 1.05037725006696e-05 2.98468108894667e-07 
0.0149594154208899 -5.04345734952949e-06 1.06544757727534e-05 2.69234590177803e-07 
0.0145321004092693 -4.19371735915774e-06 1.07589639810612e-05 4.83723113120504e-07 
0.0142181096598506 -3.95231108996086e-06 1.12112120405072e-05 3.28947919570055e-07 
0.0139793194830418 -3.19345076604804e-06 1.12184725367115e-05 3.81415730998924e-07 
0.013838212005794 -2.60648062067048e-06 1.13504784167162e-05 3.96878647279664e-07 
0.0138055393472314 -2.09884206014976e-06 1.15103593998356e-05 3.1863277172306e-07 
0.0138337584212422 -1.5880373211985e-06 1.14895292426809e-05 2.81408148339324e-07 
0.0139323929324746 -1.12221994186257e-06 1.12991783680627e-05 2.86020622297656e-07 
0.0140684200450778 -1.1192951205885e-06 1.11757926788414e-05 2.751600902684e-07 
0.0142519129440188 -1.37599158733792e-06 1.12833949970081e-05 2.69711023292984e-07 
0.0144198080524802 -9.85100427897123e-07 1.11554218165111e-05 4.58382658052869e-07 
0.0145478378981352 -1.21980053791049e-06 1.13009364213212e-05 4.70970832111561e-07 
0.0146242612972856 -1.00710644801438e-06 1.13922378659481e-05 4.9802258672571e-07 
0.0146562345325947 -5.02394982504484e-07 1.14774657049566e-05 4.54224533541492e-07 
0.0146079314872622 -3.18270537036369e-07 1.13669566417229e-05 3.6845094086857e-07 
0.0144951799884439 -1.64430517202163e-07 1.13914475150523e-05 3.20107830020788e-07 
0.0143788605928421 2.37063531471904e-07 1.12298548629042e-05 2.83110750842752e-07 
0.0142238605767488 6.52149822144565e-07 1.07766381916008e-05 4.11488514373559e-07 
0.0140969445928931 1.15288355573284e-06 1.08326548797777e-05 5.7731756442081e-07 
0.0139924939721823 1.77008450918947e-06 1.07495116026257e-05 6.07517677053693e-07 
0.0139302825555205 2.17918864109379e-06 1.06298120954307e-05 8.02266413302277e-07 
0.0138999670743942 2.54211749961541e-06 1.04295713754254e-05 8.69313907969627e-07 
0.0139261465519667 2.53345751843881e-06 1.06580164356274e-05 9.29345389977243e-07 
0.0139567004516721 2.4821556507959e-06 1.03342690636055e-05 9.85737528935715e-07 
0.0140177458524704 2.34816388910986e-06 1.01569357866538e-05 1.04315836324531e-06 
0.0140943247824907 2.54115252573683e-06 9.59186581894755e-06 8.83436030107987e-07 
0.0141451833769679 2.17731462726078e-06 9.24066080187913e-06 7.34542538793903e-07 
0.0142050329595804 2.35421703109751e-06 8.59528427099576e-06 5.99065629103279e-07 
0.0142764002084732 1.83039639978233e-06 7.95359846961219e-06 2.93272734097627e-07 
0.014287163503468 1.63993263413431e-06 7.53414951759623e-06 -2.75677507488581e-08 
0.0142418332397938 1.16956789497635e-06 7.10176163920551e-06 -3.25319149396819e-07 
0.0142359538003802 1.46765910358226e-06 6.26452583674109e-06 -4.89716910578863e-07 
0.014189338311553 1.31390288515831e-06 5.76763477511122e-06 -6.4961028556354e-07 
0.0140988752245903 1.40798795200681e-06 5.32129934072145e-06 -8.13096733054408e-07 
0.0140487011522055 1.61503305662336e-06 4.72561578135355e-06 -7.77018158260034e-07 
0.0140266045928001 1.7923529185282e-06 4.24705876866938e-06 -7.77234163251705e-07 
0.0139888999983668 1.64646928624279e-06 4.05426635552431e-06 -9.16787939786445e-07 
0.0139577854424715 1.95207280739851e-06 3.60493049811339e-06 -1.01957562037569e-06 
0.0139290411025286 2.18541117646964e-06 3.02988109979196e-06 -1.06227378182666e-06 
0.0139245232567191 2.38143707065319e-06 2.63110678133671e-06 -1.22466849461489e-06 
0.0139014841988683 2.55456529885123e-06 1.97104532162484e-06 -1.47771322644985e-06 
0.0138899171724916 2.80909489447367e-06 1.51787151025928e-06 -1.44781654398685e-06 
0.0138973463326693 2.76822902378626e-06 8.4943286537964e-07 -1.58394129812223e-06 
0.0139291724190116 3.27878638017864e-06 3.27979250869248e-07 -1.67213624990836e-06 
0.0139289181679487 3.61749243893428e-06 -4.8775058303363e-07 -1.67116706961679e-06 
0.0139373447746038 3.82051393899019e-06 -9.58959958552441e-07 -1.55828195147478e-06 
0.0139098111540079 4.05352420784766e-06 -1.49219476952567e-06 -1.64933885571372e-06 
0.0138281397521496 3.8522762224602e-06 -1.77228616848879e-06 -1.6761173355917e-06 
0.0137141197919846 3.93348545912886e-06 -2.06157551474462e-06 -1.7139916508313e-06 
0.0135476524010301 4.39775112681673e-06 -2.28619614972558e-06 -1.93635105460999e-06 
0.0133210374042392 4.21642153014545e-06 -2.46038325713016e-06 -2.23334154725308e-06 
0.0129975024610758 3.9795186239644e-06 -2.79371488431934e-06 -2.39193582274311e-06 
0.012625384144485 3.38998870574869e-06 -3.14054909722472e-06 -2.69401152763749e-06 
0.0121473120525479 1.775491114131e-06 -3.36092648467456e-06 -2.84380644188786e-06 
0.011576103977859 -6.64836875330366e-07 -3.57384692506457e-06 -2.82500718640222e-06 
0.0108556477352977 -2.89107310891268e-06 -3.93802929465892e-06 -2.46829972638807e-06 
0.0100185191258788 -5.51813218407915e-06 -4.35379615737475e-06 -2.19436992665578e-06 
0.00901790894567966 -7.47394915379118e-06 -4.66316578240367e-06 -1.67534540196357e-06 
0.00787293259054422 -9.22296476346673e-06 -5.11391726831789e-06 -1.10846690404287e-06 
0.00661071902140975 -1.00836623460054e-05 -5.56440272703185e-06 -4.73406487344619e-07 
0.00531457783654332 -1.02550566225545e-05 -5.78536082684877e-06 -7.54148743453698e-08 
0.00403894763439894 -9.42508995649405e-06 -5.77407718083123e-06 2.41737495798588e-07 
0.00285869278013706 -8.09546327218413e-06 -5.70523752685403e-06 4.24202312387933e-07 
0.00181003473699093 -5.95968458583229e-06 -5.47381750948261e-06 3.73362070149597e-07 
0.000939369725529104 -3.86793863071944e-06 -5.16649834025884e-06 1.85628152848949e-07 
0.000256811123108491 -1.69462714438851e-06 -4.7608564273105e-06 -5.17711100656015e-08 
-0.00025401622406207 8.47305159368261e-08 -4.39564610132948e-06 -2.65551278744169e-07 
-0.000608039845246822 1.43851832490327e-06 -4.03982176067075e-06 -4.38523187540341e-07 
-0.000826750125270337 2.32006163969345e-06 -3.75452555090305e-06 -5.36763991476619e-07 
-0.000940625846851617 2.86621047962399e-06 -3.48517460224684e-06 -5.88120542488468e-07 
-0.00098951009567827 3.06762672153127e-06 -3.31531236952287e-06 -5.91777848057973e-07 
-0.000997501541860402 3.10705922856869e-06 -3.22371784022835e-06 -5.64226866117679e-07 
-0.00098751240875572 3.15336797029886e-06 -3.04995273836539e-06 -5.35240872068243e-07 
-0.000963052385486662 3.10073687614931e-06 -2.85267219624075e-06 -5.18544823080447e-07 
-0.000944368133787066 2.99559496852453e-06 -2.65308108282625e-06 -5.01091051319236e-07 
-0.000917734170798212 2.91705737254233e-06 -2.51695223596471e-06 -4.74094946412151e-07 
-0.000899684382602572 2.86545127892168e-06 -2.32321167459304e-06 -4.68607680659261e-07 
-0.000877358892466873 2.80509812000673e-06 -2.21516484089079e-06 -4.58524937130278e-07 
-0.000862992135807872 2.74335570793482e-06 -2.16405669561937e-06 -4.32072596368016e-07 
0 0 0 0 
0 0 0 0 
0 0 0 0 
0 0 0 0 
0 0 0 0 
0 0 0 0 
0 0 0 0 
0 0 0 0 
0 0 0 0 
0 0 0 0 
0 0 0 0 
0 0 0 0 
0 0 0 0 
0 0 0 0 
99.9710540771484 0.0157005451619625 0.00812377780675888 0.0026965313591063 
