{
    "resId":"nlu_surname_cn_pron_group_comp",
    "domain":"nlu",
    "district":"china",
    "deviceType":"common",
    "productName":"common",
    "romVersion":"common",
    "osVersion":"common",
    "version":"0x01010000",
    "releaseNotes":"",
    "digest":"",
    "fileName":"",
    "ResMetaData":[
        {
            "origin_id":"0x0000000002001015",
            "res_value":"",
            "res_path":"nlu/wordSegment/core/surname_cn_pron.dat",
            "domain":"nlu",
            "data_version":"0x01010000",
            "encrypt_mode":"0"
        },
        {
            "origin_id":"0x0000000002001016",
            "res_value":"",
            "res_path":"nlu/wordSegment/core/surname_cn_pron.pos",
            "domain":"nlu",
            "data_version":"0x01010000",
            "encrypt_mode":"0"
        }
    ]
}