0 0 0 0 
0 0 0 0 
0 0 0 0 
0 0 0 0 
0 0 0 0 
0 0 0 0 
0 0 0 0 
0 0 0 0 
0 0 0 0 
0 0 0 0 
0.0165400169789791 1.70603252627188e-05 4.67962602002103e-09 4.05456423990813e-09 
0.0201135016977787 1.6825655620778e-05 -2.33402289495643e-07 -1.22314688155711e-07 
0.0224774647504091 1.70283219631528e-05 -2.94993647287356e-08 -1.35089388564325e-08 
0.0248323436826468 1.54070603457512e-05 2.51020082941977e-07 -1.83886985638537e-08 
0.0266823526471853 1.31483493532869e-05 -1.10050045520893e-07 1.83237048645424e-07 
0.0280591379851103 9.47242733673193e-06 3.26204094847071e-08 -1.21357359716967e-07 
0.0290397368371487 5.46027058589971e-06 -2.82794787587193e-09 1.03407316487392e-07 
0.0295772589743137 1.35742823204055e-06 6.59210186437775e-10 -6.99819295846282e-08 
0.029646897688508 -1.07991047570977e-06 -8.34194491261542e-10 9.05331454248426e-09 
0.0292085614055395 -2.96212942885177e-06 -9.78144343299903e-10 5.41286515609585e-10 
0.0283840894699097 -3.9181400097732e-06 -1.04162578562494e-09 -2.25327423386545e-10 
0.0272693801671267 -4.36217942478834e-06 -1.28018318168444e-09 -5.08425079814856e-10 
0.025953521952033 -4.75542674394092e-06 -1.41785516660775e-09 -4.61482296820748e-10 
0.0245151109993458 -5.07909271618701e-06 -1.14143627882868e-09 -9.74726896418865e-11 
0.0230517257004976 -5.15774672749103e-06 -1.99336325223953e-09 -4.55312926250784e-10 
0.0216279719024897 -4.82733594253659e-06 -2.14035722478911e-09 -9.98931604101472e-10 
0.0203051082789898 -5.11800089952885e-06 -2.18418683139987e-09 -8.19952272745894e-10 
0.0190730895847082 -4.65352695755428e-06 -1.88073712159564e-09 -2.45155229450233e-10 
0.0179600901901722 -4.40463918494061e-06 -2.30196439687802e-09 -6.21299733882807e-10 
0.0168827250599861 -4.1160765249515e-06 -1.22807852775964e-09 -6.35889729760919e-10 
0.0159106645733118 -4.09624863095814e-06 -1.5008405629402e-09 -2.29260666007036e-10 
0.0149841578677297 -3.61360685019463e-06 -1.34363553616623e-09 -5.15030830483543e-11 
0.014180482365191 -3.51073686033487e-06 -5.87498050208524e-10 -8.37638236550475e-10 
0.0134333875030279 -3.42745215675677e-06 -1.22595378293511e-09 -4.24494689399424e-10 
0.0127316638827324 -3.37592109644902e-06 -8.91913709555325e-10 -2.16031484367996e-10 
0.0119990445673466 -2.92590880235366e-06 -4.20086493368999e-10 -2.50070353313703e-10 
0.0112678771838546 -2.91171591015882e-06 -1.39781042296505e-09 -5.29712884667077e-10 
0.010588338598609 -2.84347765955317e-06 -6.87933487952819e-10 -5.15145370805214e-10 
0.00995695311576128 -2.64605250777095e-06 -1.12168341281915e-09 -5.00902930244962e-10 
0.00944019947201014 -2.62757293967297e-06 -6.54598708571541e-10 -3.2136165950547e-10 
0.00907378271222115 -2.76570790447295e-06 -5.88244342125677e-10 -2.85820866974262e-10 
0.00883446540683508 -2.67316795543593e-06 -8.51891668318672e-10 -4.26074342474436e-10 
0.00864311493933201 -2.5316946903331e-06 -3.62767454964441e-10 -1.77211384455589e-10 
0.00854985509067774 -2.61673335444357e-06 -7.62599761117144e-10 -3.16656728616138e-10 
0.00855960696935654 -2.4571190806455e-06 -7.00604629866319e-10 -1.98970041831448e-11 
0.00869704410433769 -2.56549446930876e-06 -6.442949507246e-10 -1.50277068566851e-10 
0.00895645841956139 -2.54833935287024e-06 -9.57120604994088e-10 -1.64780758482586e-10 
0.00933985784649849 -2.84592533716932e-06 -1.10323528090817e-09 -4.36198827058476e-10 
0.00978811830282211 -3.06959691442898e-06 -9.25452658950832e-10 -2.81812850833063e-10 
0.0102940564975142 -3.54950884684513e-06 -1.31170874162478e-09 -6.38044062029053e-11 
0.0107966586947441 -3.90850709663937e-06 -1.61241964224956e-09 -3.44806849739143e-10 
0.011253546923399 -4.67452446173411e-06 -1.1256440224372e-09 -4.70458727530598e-10 
0.0116360373795033 -5.08603034177213e-06 -1.68057112670539e-09 -4.70484151637862e-10 
0.0119423512369394 -5.37789492227603e-06 -1.73681291570915e-09 -6.05066441394797e-10 
0.0121605126187205 -5.67419510844047e-06 -1.77197756467962e-09 -3.81099068968993e-10 
0.0123174740001559 -5.90507079323288e-06 -1.6455407036986e-09 -1.04941200174125e-09 
0.0124700162559748 -5.76965931031737e-06 -2.45510278773509e-09 -6.38874508851472e-10 
0.0126292100176215 -5.88886268815259e-06 -1.42837952576969e-09 -2.27223392879061e-10 
0.0127978725358844 -5.85268116992665e-06 -1.38391909043634e-09 -8.66538119037585e-10 
0.0130082331597805 -5.55820042791311e-06 -2.01317540415857e-09 -7.38111127773777e-10 
0.013270259834826 -5.47664922123658e-06 -1.2130454418724e-09 -1.13132125889592e-09 
0.013548519462347 -5.43217038284638e-06 -1.60718127695247e-09 -1.46341452844645e-10 
0.0139149343594909 -5.56870872969739e-06 -2.15237538903068e-09 -5.49424228335482e-10 
0.0143924038857222 -6.12516214459902e-06 -1.21260712582227e-09 -1.14697218389637e-09 
0.0149278603494167 -6.27620556770125e-06 -1.47804790628925e-09 -8.37869884584563e-10 
0.0155920200049877 -6.32905812381068e-06 -1.74354353177364e-09 -1.18894241674106e-10 
0.0164004638791084 -6.28760153631447e-06 -1.95495131194434e-09 3.9202138063521e-11 
0.0172873511910439 -5.91665229876526e-06 -9.14365416715412e-10 -6.08207317842613e-10 
0.0182345174252987 -5.58696910957224e-06 -1.35285305180588e-09 -9.71030589269617e-10 
0.0192350782454014 -5.64645142731024e-06 -1.80524917237079e-09 -3.50881185218199e-10 
0.0201373752206564 -5.23642893313081e-06 -1.89398052796719e-09 -4.44941916644126e-10 
0.0208794791251421 -4.96489383294829e-06 -2.03891503680609e-09 -5.71632463586269e-10 
0.0214884057641029 -4.60024830317707e-06 -5.49588541343127e-10 -7.94428189898611e-10 
0.0217998120933771 -3.74496835320315e-06 -1.19866672143587e-09 -3.69086178286793e-10 
0.0218184925615788 -3.76857678929809e-06 -6.09165606846318e-10 5.04931818579024e-10 
0.0215553939342499 -4.30340014645481e-06 -1.0757350565882e-09 -3.45573958338008e-10 
0.0210522525012493 -4.78046695207013e-06 -1.7694702370008e-09 1.48136260202936e-11 
0.0202627796679735 -4.95052063342882e-06 -1.85105830663446e-09 -8.90454820989817e-10 
0.0194356255233288 -5.90460649618763e-06 -2.04564498673676e-09 -5.88502691023507e-10 
0.0185734424740076 -5.77728587813908e-06 -1.49120038539508e-09 -8.00961463820471e-10 
0.0178197231143713 -5.77658101974521e-06 -1.01592390056027e-09 -2.74320205440048e-10 
0.0172042362391949 -5.7622646636446e-06 -2.21944507217131e-09 -7.31496641037666e-10 
0.016796076670289 -5.94022503719316e-06 -1.28103783136879e-09 -1.1404271971216e-09 
0.0164885520935059 -6.22391007709666e-06 -2.66180344432598e-09 -6.14075401639269e-10 
0.0163782015442848 -6.19006777924369e-06 -2.14416995270028e-09 -1.29751631661179e-09 
0.0164031591266394 -7.24615210856427e-06 -2.29648322580545e-09 -4.53338810935122e-10 
0.016536382958293 -8.09732955531217e-06 -2.86462586984726e-09 -1.18066501020309e-09 
0.0166518054902554 -9.14683641894953e-06 -3.34780581034977e-09 -1.28342814154081e-09 
0.0168802309781313 -9.5192481239792e-06 -2.96772473262763e-09 -1.09582820595477e-09 
0.0171103253960609 -1.07034311440657e-05 -3.31580474188797e-09 -7.5874706517709e-10 
0.0173705406486988 -9.90252374322154e-06 -2.89405055475811e-09 -1.00132024893895e-09 
0.0176301300525665 -9.61601654125843e-06 -2.39854180961174e-09 -9.29857690845637e-10 
0.0180393569171429 -9.22578965401044e-06 -3.64421048892893e-09 -9.72095848261745e-10 
0.0186904259026051 -9.50318826653529e-06 -3.18936344001486e-09 -1.32270638886212e-09 
0.0199570823460817 -9.27755172597244e-06 -2.38090747117781e-09 -1.10753961557464e-09 
0.0227423273026943 -8.7038542915252e-08 -2.08736627982375e-09 -6.44255926385284e-10 
0.0285261701792479 -6.48968534733285e-08 -1.83655401997385e-09 -3.95267790720411e-10 
0.0382730923593044 -3.68739097211801e-08 -1.58164714658682e-09 -1.38194355958632e-09 
0.0535777844488621 1.70893770246039e-08 -8.65950977591012e-10 -1.07751252365063e-09 
0.0750376060605049 9.11532424652251e-08 -1.05943998018887e-09 -1.16068488154042e-09 
0.100957535207272 1.4640977497038e-07 4.9563153581289e-09 -4.03724209618872e-09 
0.129023149609566 1.37102142616641e-07 3.7534295116437e-10 3.10380854351422e-09 
0.155819952487946 1.92676106962608e-07 5.38894751045405e-09 5.38898214941241e-09 
0.179058939218521 1.32460863824235e-07 4.90338747383134e-09 9.28370980091131e-09 
0.196135148406029 6.24720223640907e-08 1.41606992798415e-09 -1.56549995189437e-09 
0.208000987768173 1.58962541263463e-08 1.08090194572696e-08 -3.80489506568438e-09 
0.21402296423912 1.08844301394129e-08 6.55022613926803e-09 9.30160670709057e-10 
0.217078879475594 -1.09563764283394e-09 4.87706808272037e-09 -8.30507929094892e-09 
0.216794714331627 1.12161302467939e-09 -5.63712632128954e-09 5.87570347931887e-09 
0.215424954891205 2.43356566898001e-08 6.21079798701629e-10 -5.15688958202531e-09 
0.211555510759354 5.3338922043622e-08 -3.91904819707634e-09 -2.5794884006558e-09 
0.207202896475792 7.37618665880291e-08 -6.10254247135344e-09 1.74811176645306e-09 
0.202306866645813 2.0552563455567e-08 -4.26593510516327e-10 7.68786811988775e-09 
0.197654739022255 3.28022133544437e-08 5.44549916270398e-09 -8.96564933405841e-10 
0.1932532787323 5.74174862322252e-09 6.73614763968544e-09 8.33523916554668e-09 
0.18866865336895 -3.19009041049867e-08 -6.48704867600713e-10 4.41642500348394e-09 
0.184374079108238 -3.11252983919985e-08 -4.52574200338063e-09 8.18389267465136e-09 
0.180334746837616 -3.19661808134697e-08 -3.12451664541413e-09 9.5720542603317e-10 
0.175493285059929 -2.52532618105761e-08 -7.08069602950445e-10 -6.32269170353084e-09 
0.169950395822525 -1.68115866472363e-08 -2.85858581250409e-09 2.13247375313586e-09 
0.165049478411674 -5.18611250299728e-08 -5.75869529839679e-09 -1.49481382827332e-09 
0.159640684723854 -1.14662861960824e-07 -2.85693912971396e-09 -3.39658323689207e-09 
0.153436556458473 -1.39055691761314e-07 -7.91462340110627e-10 -4.3821049011683e-09 
0.14770282804966 -1.32345476231421e-07 -4.43203829192385e-09 -2.62031751852021e-09 
0.141093641519547 -1.51677222675062e-07 8.91145324199982e-10 -2.33413932626547e-09 
0.134516358375549 -1.26139420899563e-07 -3.79749209855618e-09 -4.03192901288207e-09 
0.127890452742577 -6.08411801295006e-08 -2.78481437909761e-09 -3.83407705584204e-09 
0.121007367968559 -5.21378160556196e-08 2.61180654881343e-09 3.52663520608587e-09 
0.113581225275993 -4.48616037829197e-08 3.38423844503666e-09 -4.62854554683645e-09 
0.106784909963608 -8.4220266671764e-09 1.89997240163109e-09 7.7677608789628e-10 
0.0994072481989861 9.07524054127862e-09 5.73557923377876e-10 1.87920567995548e-09 
0.0922485291957855 -1.72884847415844e-08 -4.90637419581219e-10 -1.02189430528643e-10 
0.0851471647620201 -2.73636970860025e-10 1.36552011018032e-11 -2.50939019563745e-10 
0.0778060778975487 1.8706108448896e-08 -1.30311439416886e-09 -3.34177063798791e-09 
0.0703829005360603 3.56804457624094e-08 -7.11742553782813e-10 -9.14559317166663e-10 
0.0632818415760994 6.96133292876766e-08 3.64079122405769e-09 6.78615941218652e-10 
0.0559306256473064 1.03611082522548e-07 4.57465043623984e-09 -9.78029657261459e-10 
0.0487822331488132 1.37498946060077e-07 4.06151157150703e-09 -1.0584990661755e-09 
0.0424040518701077 1.37503429868957e-07 3.98169497373146e-09 1.01429398213781e-09 
0.0361138321459293 1.40464162541321e-07 3.1248577059273e-09 2.37201080999228e-09 
0.030385373160243 1.33088315124041e-07 4.37334879421769e-09 1.58562096785886e-09 
0.0251557715237141 1.33231824293034e-07 4.35191882530717e-09 1.08801789799884e-09 
0.0203855372965336 1.11386607386521e-07 3.41633499267857e-09 1.73337832976017e-09 
0.0161728616803885 9.67281266639475e-08 3.43629480425989e-09 1.1810761257891e-09 
0.0126327546313405 7.83239920565393e-08 1.9275514517858e-09 1.04009023615959e-09 
0.00964614655822515 5.87616887059994e-08 1.71109348912069e-09 3.16245057918607e-10 
0.00730840070173144 4.26789938501315e-08 1.51394485836676e-09 7.05020486435615e-10 
0.00558133330196142 2.97416954708751e-08 5.71277192218389e-10 2.93865931588755e-10 
0.0043109362013638 1.85612054792728e-08 4.8231119098574e-10 2.83625789521125e-10 
0.003410454839468 7.55537428176467e-09 1.32564237365074e-10 1.08781102181599e-10 
0.00272842426784337 -3.66494901982151e-09 -2.36657499153026e-10 -8.65677945993681e-11 
0.00230176490731537 -1.42790952395444e-08 -4.65728622334183e-10 -1.77996645200906e-10 
0.00199730019085109 -2.03373429030762e-08 -6.30038243798481e-10 -1.96460472889903e-10 
0.00180428160820156 -2.39600672102824e-08 -7.36746497143059e-10 -2.72989242322552e-10 
0.00167258898727596 -2.46696572503424e-08 -6.80220102466933e-10 -3.3431249435445e-10 
0.00160559313371778 -2.30941532208817e-08 -6.26309282214521e-10 -3.32336713704251e-10 
0.00160529196728021 -1.94821836885239e-08 -5.79964465341476e-10 -2.52304066528097e-10 
0.00157331966329366 -2.25348662752367e-08 -6.51500464687871e-10 -2.6544283437957e-10 
0.00153256242629141 -2.3056447844283e-08 -7.08488767653392e-10 -2.72008832125081e-10 
0.0014530885964632 -2.33962646234431e-08 -6.80477674208646e-10 -2.39507885746448e-10 
0.00136243621818721 -2.27514124162553e-08 -6.6212874072491e-10 -3.09683612087497e-10 
0.00120643444824964 -2.61488798969367e-08 -7.45516537392632e-10 -3.18462867188174e-10 
0.00109864166006446 -2.2572844500246e-08 -6.78771316930948e-10 -2.20454807187132e-10 
0.00098860845901072 -2.25410144594207e-08 -7.03468672202945e-10 -2.81211470776199e-10 
0.000924124731682241 -2.10548682844092e-08 -6.27041973899622e-10 -2.71217104330645e-10 
0.00086652731988579 -2.05315927814809e-08 -5.99884142360452e-10 -2.52712406556554e-10 
0.000829200376756489 -1.70354451256571e-08 -4.68945438036883e-10 -1.94854257729027e-10 
0.000795208208728582 -1.53457710894145e-08 -4.37975294920179e-10 -1.88137685985801e-10 
0.000760176277253777 -1.23470999824349e-08 -3.85738607722175e-10 -1.2352217859668e-10 
0.000731251027900726 -1.04752302831912e-08 -3.37100902747522e-10 -1.39000061460948e-10 
0.000691717374138534 -8.84744054019393e-09 -2.41819619883898e-10 -1.23018609188286e-10 
0 0 0 0 
0 0 0 0 
0 0 0 0 
0 0 0 0 
0 0 0 0 
0 0 0 0 
0 0 0 0 
0 0 0 0 
0 0 0 0 
0 0 0 0 
0 0 0 0 
0 0 0 0 
0 0 0 0 
0 0 0 0 
99.9901657104492 0.00871870759874582 3.64052611985244e-05 2.83226509054657e-05 
