0 0 0 0 
0 0 0 0 
0 0 0 0 
0 0 0 0 
0 0 0 0 
0 0 0 0 
0 0 0 0 
0 0 0 0 
0 0 0 0 
0 0 0 0 
0.00272513530217111 1.40358253020167e-07 -1.95871457941976e-10 2.41582753801595e-10 
0.00288340379483998 -4.02852577963131e-07 1.34029519927026e-07 -1.25688387697664e-07 
0.00295026693493128 -1.03639422377455e-06 1.36620303958779e-09 -3.71362496309757e-09 
0.00301024224609137 -1.70471764704416e-06 -1.93185826447007e-07 6.21093647623638e-08 
0.00304251397028565 -2.28479484576383e-06 2.28421541237367e-07 2.11989075182828e-08 
0.00305281672626734 -2.66772121904069e-06 -1.24671231560569e-07 -9.26651395616318e-08 
0.00304426066577435 -2.77471872323076e-06 5.1472685669296e-08 1.34545970809086e-07 
0.00301762716844678 -2.6892882942775e-06 -2.07621528858226e-08 -1.426891031997e-07 
0.00296220229938626 -2.42543615058821e-06 9.338248396773e-09 1.50603739257349e-07 
0.00285114184953272 -2.13443377106159e-06 -3.83969966932796e-09 -9.86068968700238e-08 
0.00269938353449106 -1.92044512914435e-06 8.41016090102897e-10 2.78315557267206e-08 
0.00252438592724502 -1.85781777872762e-06 1.54823220216427e-11 -2.71443112431768e-09 
0.00235513574443758 -1.82032169959712e-06 -4.33021951629087e-11 1.91408291994044e-10 
0.00222240411676466 -1.82884798505256e-06 3.88679678720028e-11 4.12159889551234e-11 
0.0021499814465642 -1.85840724498121e-06 1.49875861721327e-10 -2.3657886413786e-11 
0.00214716489426792 -1.88754438568139e-06 1.74907296979221e-10 9.51800374626721e-11 
0.00221244455315173 -1.86693273462879e-06 5.18070265506654e-12 1.1191624710305e-10 
0.00232727779075503 -1.83226575245499e-06 1.19347323690455e-10 1.60052401887434e-10 
0.00247517786920071 -1.69114582604379e-06 -4.22269233468775e-11 2.0416365820175e-10 
0.00261961715295911 -1.6439641967736e-06 2.44176401320573e-10 9.29850085817918e-11 
0.00274369050748646 -1.60211288857681e-06 2.38909364513873e-10 1.15753739926561e-10 
0.00282268156297505 -1.63131096542202e-06 1.63553320192689e-11 2.14551640342897e-11 
0.00285389390774071 -1.68239739650744e-06 1.63822705401273e-10 1.25714881213379e-11 
0.00282503291964531 -1.92163270185119e-06 -1.73651301671462e-10 3.42753880833158e-11 
0.0027562549803406 -2.13497946788266e-06 1.18493437284428e-10 5.41889345895274e-11 
0.00267688534222543 -2.2904764591658e-06 3.82665704679042e-11 4.89780334345102e-11 
0.00264703040011227 -2.27337932301452e-06 1.66973587734098e-10 7.79970740771851e-11 
0.00269981822930276 -2.18582704292203e-06 1.51180110097293e-10 7.36972843862205e-11 
0.00289273215457797 -1.98482871383021e-06 -7.68262051198398e-11 1.82087036421086e-11 
0.00331612536683679 -1.69668942362478e-06 9.41731206904883e-11 -8.06532965413886e-11 
0.00404665526002645 -1.52472182435304e-06 6.06670824687683e-11 1.74891670590149e-10 
0.00522170681506395 -1.72959482824808e-06 -2.35431590889235e-10 -1.04386672916679e-10 
0.00706430058926344 -1.89336935818574e-06 -4.22656021292767e-10 -4.83038109511114e-10 
0.00978419277817011 -2.48815808845393e-06 6.60333843160998e-10 3.85631887533933e-10 
0.01363829895854 -3.54090570908738e-06 3.84827114618957e-10 -4.26329332947617e-10 
0.0188190583139658 -4.72950705443509e-06 -9.82068981691953e-10 -1.66689118064056e-09 
0.0254883412271738 -6.39127802060102e-06 2.17926743317776e-09 -3.75811437525186e-10 
0.0333428978919983 -9.08239235286601e-06 2.08405848134419e-09 -2.04951011717469e-09 
0.0420334525406361 -1.0569259757176e-05 6.72413735802735e-10 -2.38915376371551e-09 
0.0514596961438656 -1.27085540952976e-05 4.16672252256944e-09 1.36000788408808e-09 
0.0608512125909328 -1.26523418657598e-05 4.03761379885736e-09 -1.78870240841178e-09 
0.0696336030960083 -1.2498088835855e-05 -7.00428071098713e-09 -2.61858468242337e-09 
0.0777963697910309 -1.22018227557419e-05 -6.97288715656441e-09 -3.30128813175179e-09 
0.0853917971253395 -1.01105915746302e-05 -2.01103333985486e-09 -4.41858372113302e-09 
0.0917889028787613 -9.05429806152824e-06 -2.45622744365903e-09 -5.44787215339682e-10 
0.0968914330005646 -1.00856859717169e-05 -3.56893781194856e-09 3.39984551622763e-09 
0.101243533194065 -1.02000212791609e-05 -5.82554093853105e-09 -9.53646939194641e-09 
0.104792349040508 -1.06024599517696e-05 2.31197727629251e-09 2.84310930354081e-09 
0.107370257377625 -1.35062973640743e-05 -5.24426502224173e-09 4.26993684854438e-09 
0.109541080892086 -1.47501295941765e-05 -8.05739741593925e-09 3.86628333515215e-11 
0.111783310770988 -1.64533448696602e-05 1.95076399478467e-09 -3.1592664040403e-09 
0.113709665834904 -1.79336057044566e-05 -8.91814511128075e-10 -1.43195366675286e-09 
0.1153170093894 -1.890339081001e-05 3.78111986165663e-09 -2.72947553447977e-09 
0.116805955767632 -1.96376913663698e-05 2.97541102867172e-09 2.73570410769253e-09 
0.118116714060307 -1.70188577612862e-05 -4.22525125998163e-09 8.66614169314772e-10 
0.119224235415459 -1.25687556646881e-05 -4.1904080205768e-09 6.03127103815382e-09 
0.120237439870834 -1.12046745925909e-05 1.6151893156291e-09 -1.51378110047062e-09 
0.121223099529743 -5.27868814970134e-06 4.30770485948528e-09 -1.44656642220298e-09 
0.122089706361294 7.82615586558677e-07 1.0364770375304e-08 5.8396808222394e-11 
0.122861064970493 4.16176317230565e-06 3.60925955789071e-09 3.70960684392685e-09 
0.123633950948715 7.33829483579029e-06 -1.40166926954066e-08 -4.85233275782093e-09 
0.124498635530472 1.24666121337214e-05 4.00197341932085e-09 -1.05863617871904e-09 
0.125563144683838 1.25915166790946e-05 -4.23562185325466e-10 2.78372574991081e-10 
0.127118900418282 9.30899932427565e-06 3.46632367254074e-09 -3.66712349375575e-09 
0.128063127398491 7.71611576055875e-06 7.10464886921613e-09 3.98307253846042e-09 
0.12909796833992 7.22406048225821e-06 -2.90309798423039e-09 -8.2642896970242e-09 
0.130130752921104 8.27353323984426e-06 -5.17846876491035e-09 -4.10378925286281e-10 
0.130513593554497 1.07914856926072e-05 2.10731432304101e-09 5.66004620949911e-09 
0.130697801709175 1.77622187038651e-05 -1.45758549674468e-09 6.60558940879241e-09 
0.131056532263756 2.0783714717254e-05 -8.57284354616183e-10 8.99143159927007e-09 
0.131607428193092 1.93580399354687e-05 7.20859150149522e-09 -3.47464146344123e-09 
0.131581947207451 1.47535156429512e-05 -7.74811947934495e-09 -5.39873390437151e-09 
0.131776049733162 1.32468012452591e-05 5.0189652434085e-09 1.60266899751349e-09 
0.131427228450775 1.08322983578546e-05 -1.80671904104202e-08 -1.25033281506148e-08 
0.131714910268784 6.07706488153781e-06 -5.66382007960442e-09 6.29934937546039e-10 
0.131312549114227 8.67586459207814e-06 -2.89293877742125e-09 -1.06733484273036e-08 
0.130694299936295 1.01995174190961e-05 6.17367845734407e-09 -3.90682819428889e-09 
0.13041727244854 6.06334378971951e-06 1.79221648632932e-09 2.03289163280829e-09 
0.129843428730965 5.56854001843021e-06 5.94287907773605e-09 -2.64436406105517e-09 
0.12911431491375 5.51319499209058e-06 5.31337907005991e-09 4.10043110576908e-09 
0.128028765320778 4.5215715545055e-06 8.92431106791491e-09 -9.34069488423006e-10 
0.127223983407021 6.47702472633682e-06 -5.50403633781116e-09 -1.19401299958355e-09 
0.126028403639793 9.78926073003095e-06 -3.27611560102525e-09 -4.00315069981616e-09 
0.125119000673294 9.0564308266039e-06 -6.11163919472801e-09 8.92240448191473e-10 
0.123899787664413 7.17927196092205e-06 6.8021184240763e-09 1.05194342125969e-08 
0.123251304030418 2.9442692266457e-06 -3.18347570527067e-09 -2.85862500337686e-10 
0.122443750500679 1.76771413862298e-06 -6.09179418020744e-09 -4.1355625590711e-09 
0.121304355561733 1.4736980347152e-06 -1.62888724730692e-09 -1.37436495517562e-09 
0.120373025536537 1.70819419054169e-06 7.82450770842047e-10 3.09635428408228e-09 
0.119766511023045 3.63927460966806e-06 2.28355023779159e-09 3.2059745969093e-09 
0.119062356650829 -2.7040695016467e-08 -7.78866526829347e-10 1.29745481025623e-09 
0.118249170482159 -1.95933102986601e-06 -7.45613348840379e-09 6.6406919962958e-09 
0.117869183421135 -2.68907206191216e-06 1.35560462855011e-09 3.82027831591358e-09 
0.117723017930984 -5.30030683876248e-06 -1.6653646239817e-09 -1.51583456897697e-09 
0.116695806384087 -2.01534749066923e-06 8.13724554404871e-09 8.02531374688442e-09 
0.115030065178871 2.66218762590142e-06 -3.37017502793913e-09 -7.39350536349548e-09 
0.113494507968426 3.61312413588166e-06 6.98959912170949e-09 4.83598672218477e-09 
0.111585684120655 3.80844471692399e-06 1.48070056216199e-09 2.47068854264398e-09 
0.109368219971657 3.58035254066635e-06 -1.42111933332245e-09 2.30102226161932e-09 
0.107264198362827 1.95540133063332e-06 -6.60797994100903e-09 5.47644507520317e-09 
0.105408944189548 2.47235516326327e-06 6.19857498662668e-09 2.25898766359478e-09 
0.103381901979446 3.77992887479195e-06 -5.57252022304056e-09 -3.79151199325634e-09 
0.101184494793415 1.42993610552367e-06 3.70822195172593e-09 3.18651638409051e-09 
0.0990416407585144 -7.86652094575402e-08 2.53917997738995e-09 7.97488575177141e-10 
0.0966737568378448 -8.21177593479661e-07 8.88124951359259e-09 2.42752018486669e-09 
0.0944100320339203 -3.13563100462488e-06 -4.31636371089894e-09 -4.12481515610352e-09 
0.0922941789031029 -8.11283916846151e-06 3.65300567573001e-09 5.01271690822591e-10 
0.0900871604681015 -7.63959360483568e-06 -3.19061710385427e-09 -4.38131797508845e-09 
0.0875829309225082 -7.84160329203587e-06 -2.49254838990964e-09 -3.65983487959909e-09 
0.0849146395921707 -7.14770203558146e-06 -2.05750583237574e-10 -5.0894057856965e-09 
0.0821676477789879 -4.58378963230643e-06 2.2720496595241e-09 1.60056445874801e-09 
0.079131156206131 -1.53999440044572e-06 2.17944662317393e-09 -2.48426418325565e-10 
0.0761467814445496 -2.79291111837665e-06 5.05429609276575e-09 3.55833340570655e-09 
0.0726014375686646 -1.48528511090262e-06 8.11479605733467e-10 -1.81333947857354e-09 
0.0693046376109123 -4.81870074509061e-06 7.08254610515269e-09 1.95474725295242e-09 
0.0658575147390366 -6.83298685544287e-06 7.69559882485282e-09 4.34331770549079e-09 
0.0623405948281288 -8.51173081173329e-06 -8.84689155267182e-10 1.82512149837777e-09 
0.0585016869008541 -6.6200104811287e-06 1.77631187536775e-09 2.65152189093953e-09 
0.054715383797884 -7.82944789534668e-06 1.88874338391543e-09 -9.57481760543999e-10 
0.0509448386728764 -8.65487800183473e-06 4.34779812152897e-09 -2.78922440699603e-10 
0.0469335876405239 -8.95725497684907e-06 -3.78994480243477e-09 -1.00383860945907e-10 
0.0428154431283474 -9.01317253010347e-06 -1.23212529068439e-09 -5.54779111539005e-10 
0.0389447063207626 -1.0858984751394e-05 2.58406562814173e-09 3.46263506756372e-09 
0.0351971797645092 -1.05906619864982e-05 -4.70332162105791e-10 1.17668319532527e-09 
0.03133949264884 -8.23115169623634e-06 1.22924626033694e-09 7.98175969762838e-10 
0.0276747550815344 -8.33800004329532e-06 -1.13682718794195e-09 6.94788671040669e-10 
0.0242489296942949 -8.24701146484585e-06 1.63143359498824e-12 -1.60275714922165e-09 
0.020895155146718 -7.35129970053094e-06 6.67280342092624e-10 1.50600687476299e-09 
0.0177979730069637 -6.75309456710238e-06 -3.83189979746845e-10 1.41667244601962e-09 
0.0150227546691895 -6.61542026136885e-06 1.35086775099325e-09 7.34907187188716e-12 
0.0125558758154511 -5.87176509725396e-06 2.8671615082132e-10 6.19065965157262e-10 
0.0102902529761195 -4.7848920985416e-06 3.40153682998334e-10 -1.05708351794132e-10 
0.00833278801292181 -4.33106288255658e-06 8.93234028409573e-11 5.52188350599891e-10 
0.00659676874056458 -3.75198965230084e-06 7.41394445835653e-11 3.87510024069115e-10 
0.00511314300820231 -3.2925772757153e-06 -3.43431588722964e-10 -1.11497325261389e-10 
0.00386571511626244 -2.80796098195424e-06 7.49672268707258e-11 4.66735807988505e-12 
0.00292629259638488 -2.78066613645933e-06 -7.53562351407666e-11 4.26732260638829e-11 
0.00220431527122855 -2.76279229183274e-06 -8.37783523111035e-11 1.33349456477028e-10 
0.00164884200785309 -2.76445871350006e-06 8.91788934365145e-11 1.09797969327641e-10 
0.00122298742644489 -2.8518143153633e-06 1.99253016863743e-10 9.97028432037084e-11 
0.000893375719897449 -2.99726025332347e-06 8.89107468204919e-11 8.56713242014528e-11 
0.000630633498076349 -3.13249915961933e-06 7.70194810706393e-11 8.60487028853107e-11 
0.000431534746894613 -3.28641658597917e-06 1.38689143502901e-10 1.16135101535519e-10 
0.00027005875017494 -3.39486405209755e-06 1.36792480120995e-10 1.17114068443058e-10 
0.000137395865749568 -3.46842148246651e-06 1.24547691604526e-10 1.14991002830855e-10 
3.08099151880015e-05 -3.50531581716496e-06 1.362144702588e-10 1.18512019642303e-10 
-5.47024319530465e-05 -3.5207772270951e-06 1.37193534310853e-10 1.18313941976922e-10 
-0.000126041093608364 -3.52098822986591e-06 1.43353037773686e-10 1.15931576838424e-10 
-0.000181739233084954 -3.50739878740569e-06 1.30212757243342e-10 1.14232699688355e-10 
-0.000221868278458714 -3.41748977916723e-06 1.32473032543601e-10 1.06078104633589e-10 
-0.000244319729972631 -3.30984676111257e-06 1.22260701562737e-10 9.30328938886227e-11 
-0.000256663450272754 -3.19094601763936e-06 1.20130086433967e-10 1.14845445653433e-10 
-0.000259234540862963 -3.03606566376402e-06 1.26320467974672e-10 1.20405518888589e-10 
-0.000256077153608203 -2.86536715066177e-06 8.18401041380312e-11 9.32099258887931e-11 
-0.000248879921855405 -2.71282578978571e-06 1.2702336404935e-10 1.0527522603665e-10 
-0.000244314142037183 -2.56280304711254e-06 9.08624009365866e-11 8.0511666777916e-11 
-0.000236368432524614 -2.40416466112947e-06 7.86283954612443e-11 6.58601159719829e-11 
-0.000227949407417327 -2.30053751693049e-06 9.75717145967891e-11 8.28064214419832e-11 
-0.000223683891817927 -2.21503364628006e-06 8.32701824160509e-11 6.94097210263145e-11 
-0.000217161868931726 -2.1425780687423e-06 7.61632493184727e-11 7.49485959405938e-11 
-0.000217913737287745 -2.06762865673227e-06 7.36459365713316e-11 6.10914999144008e-11 
0 0 0 0 
0 0 0 0 
0 0 0 0 
0 0 0 0 
0 0 0 0 
0 0 0 0 
0 0 0 0 
0 0 0 0 
0 0 0 0 
0 0 0 0 
0 0 0 0 
0 0 0 0 
0 0 0 0 
0 0 0 0 
99.9895629882813 0.00932391826063395 3.58507895725779e-05 3.19153477903455e-05 
