0 0 0 0 
0 0 0 0 
0 0 0 0 
0 0 0 0 
0 0 0 0 
0 0 0 0 
0 0 0 0 
0 0 0 0 
0 0 0 0 
0 0 0 0 
0.016502995043993 0.000250922399573028 3.33447424054611e-05 9.03810416730266e-07 
0.0213061776012182 0.000331665185512975 3.25724940921646e-05 9.01804924069438e-07 
0.0257926769554615 0.00041135138599202 2.89582221739693e-05 5.69242445180862e-07 
0.0306665860116482 0.000496756925713271 2.52072895818856e-05 3.2509257152924e-07 
0.0363683141767979 0.000597154314164072 1.83387801371282e-05 3.16694475088752e-08 
0.0425981916487217 0.000704924284946173 1.08837630250491e-05 -2.65624976236722e-07 
0.0492026321589947 0.000803099770564586 3.69416397916211e-06 -1.22548030390135e-07 
0.0562169179320335 0.000886921247001737 -4.27720260631759e-06 2.15460772778897e-07 
0.0635399892926216 0.000946981250308454 -1.19711339721107e-05 4.55753649930557e-07 
0.0706585198640823 0.000960796838626266 -1.60991512530018e-05 7.70445581110835e-07 
0.0778954178094864 0.000938734970986843 -1.8591254047351e-05 1.07755909084517e-06 
0.0854782536625862 0.000886959955096245 -2.0795983800781e-05 9.53616734022944e-07 
0.0934236422181129 0.000812156940810382 -2.00141930690734e-05 9.04266883594573e-08 
0.101206548511982 0.000723990553524345 -1.85807402885985e-05 -7.62983802360395e-07 
0.108765669167042 0.000631482456810772 -1.71638512256322e-05 -1.77678725776786e-06 
0.116068951785564 0.00054004491539672 -1.38805535243591e-05 -2.28241515287664e-06 
0.123062744736671 0.000459559640148655 -9.36661308514886e-06 -2.40874442170025e-06 
0.129790425300598 0.000383591512218118 -7.93976869317703e-06 -2.00606518774293e-06 
0.136119365692139 0.00030725184478797 -3.49685819855949e-06 -9.69785560300807e-07 
0.14206825196743 0.000246829353272915 -2.10623497309825e-07 2.6328490321248e-07 
0.147452279925346 0.000194350344827399 5.76646179695217e-08 1.11635768007545e-06 
0.15224501490593 0.000147995277075097 -3.0591925792578e-07 1.3551800748246e-06 
0.156220287084579 0.00011064005229855 1.08852361790923e-06 1.93839741768898e-06 
0.159466758370399 9.13711701286957e-05 -2.83607005258091e-06 1.02693650205765e-06 
0.16227088868618 6.3598869019188e-05 -6.74706052450347e-06 -5.51376160728978e-07 
0.165043920278549 3.13324271701276e-05 -8.02031354396604e-06 -1.91440585695091e-06 
0.167876005172729 -1.92768766282825e-06 -5.85324823987321e-06 -2.282692321387e-06 
0.170708984136581 -3.85925413866062e-05 -1.71657666214742e-06 -2.22091421164805e-06 
0.173691973090172 -8.45062240841798e-05 6.94324126015999e-06 -1.02339492968895e-06 
0.176237985491753 -0.000117015137220733 1.62720571097452e-05 1.29363570522401e-06 
0.177997320890427 -0.000148806924698874 2.43779559241375e-05 3.26666304317769e-06 
0.178854867815971 -0.000178046218934469 2.59242369793355e-05 3.86699412047165e-06 
0.179013073444366 -0.000193164058146067 2.63200818153564e-05 3.62314744961623e-06 
0.17835558950901 -0.000207277771551162 2.66615370492218e-05 2.99733278552594e-06 
0.177138462662697 -0.000228881384828128 2.45230494329007e-05 2.6208163035335e-06 
0.175513386726379 -0.00024895987007767 2.14490846701665e-05 1.78317486643209e-06 
0.173617154359818 -0.000255435064900666 2.15877626033034e-05 1.75435002347513e-06 
0.171080753207207 -0.000265543698333204 2.18781096918974e-05 1.66072584306676e-06 
0.168015211820602 -0.000270944088697433 1.81907998921815e-05 1.1783376976382e-06 
0.164965435862541 -0.000268006057012826 1.47193131851964e-05 4.79504024042399e-07 
0.161397874355316 -0.00025749221094884 1.25938986457186e-05 -6.19285856373608e-07 
0.157239377498627 -0.000262630492215976 1.15612619993044e-05 -6.57087639410747e-07 
0.152712151408195 -0.000254640472121537 6.89819489707588e-06 -1.67857172073127e-06 
0.147441819310188 -0.000257745996350423 4.89017793370294e-06 -1.5320637203331e-06 
0.141529083251953 -0.000250277138547972 5.63017965760082e-06 -1.64401478741638e-06 
0.135234490036964 -0.000255002814810723 4.10342272516573e-06 -9.82968572316167e-07 
0.128700911998749 -0.000248718104558066 1.36112532800325e-06 -1.4430036117119e-06 
0.122068464756012 -0.000251094927079976 -6.30846216154168e-07 -9.93410139926709e-07 
0.11587381362915 -0.000244038412347436 -3.23088534059934e-06 -9.40511995395354e-07 
0.109588079154491 -0.000247602758463472 -7.17255989002297e-06 -1.35939467327262e-06 
0.103377267718315 -0.000238751003053039 -1.11971057776827e-05 -1.52406778397562e-06 
0.0971592292189598 -0.000231579528190196 -1.45261155921617e-05 -1.85166959454364e-06 
0.0908939763903618 -0.000227311931666918 -1.76204757735832e-05 -1.90662865406921e-06 
0.0845078453421593 -0.000217705441173166 -2.08761939575197e-05 -2.23303459279123e-06 
0.0780654698610306 -0.000208296405617148 -2.19943376578158e-05 -2.07760717785277e-06 
0.0717058107256889 -0.000198900757823139 -2.23965598706855e-05 -2.05331093638961e-06 
0.0655734688043594 -0.000188985868589953 -2.31802023336058e-05 -1.75796003532014e-06 
0.0598563365638256 -0.000176371118868701 -2.25456624320941e-05 -1.61790853780985e-06 
0.0547116994857788 -0.000164046825375408 -2.09601330425357e-05 -1.46164040870644e-06 
0.0501271486282349 -0.00015130388783291 -2.04192438104656e-05 -1.48831418300688e-06 
0.0461476258933544 -0.000140884309075773 -2.03134331968613e-05 -1.35738457629486e-06 
0.0426664650440216 -0.000129594875033945 -2.02374958462315e-05 -1.68589690474619e-06 
0.0396662019193172 -0.000120505967061035 -2.04094267246546e-05 -1.78137474904361e-06 
0.0370362102985382 -0.000109825989056844 -2.03358140424825e-05 -1.68335134276276e-06 
0.0347099117934704 -0.000104127917438745 -2.00674912775867e-05 -1.64071457220416e-06 
0.0326169952750206 -9.59703174885362e-05 -1.94221192941768e-05 -1.83596625902283e-06 
0.0308005791157484 -9.01486637303606e-05 -1.8931603335659e-05 -1.6907263216126e-06 
0.0291210282593966 -8.63416280481033e-05 -1.74502001755172e-05 -1.59970045388036e-06 
0.0275829844176769 -8.42635563458316e-05 -1.7413949535694e-05 -1.71229112311266e-06 
0.0261354967951775 -8.06836760602891e-05 -1.7327292880509e-05 -1.77356560016051e-06 
0.0247228890657425 -7.61015471653081e-05 -1.76592293428257e-05 -1.67767325365276e-06 
0.0233518220484257 -7.4468829552643e-05 -1.76537050720071e-05 -1.54100575855409e-06 
0.0220223050564528 -7.11024331394583e-05 -1.79859598574694e-05 -1.42403746394848e-06 
0.0207019671797752 -6.96428542141803e-05 -1.78913396666758e-05 -1.12691736831039e-06 
0.0194451734423637 -6.54280447633937e-05 -1.86356392077869e-05 -9.60639454206103e-07 
0.0182525180280209 -6.42410741420463e-05 -1.84900745807681e-05 -8.21692026420351e-07 
0.0170867461711168 -6.19932616245933e-05 -1.85690678335959e-05 -6.89491571392864e-07 
0.0160364899784327 -5.94480989093427e-05 -1.87440600711852e-05 -5.82607754040509e-07 
0.0151104433462024 -5.7720229960978e-05 -1.88652502401965e-05 -5.23687788245297e-07 
0.0143136158585548 -5.67913994018454e-05 -1.84245272976113e-05 -3.89342659445902e-07 
0.0136462990194559 -5.67380593565758e-05 -1.84137606993318e-05 -3.80680035050318e-07 
0.0131269805133343 -5.67092392884661e-05 -1.88278609130066e-05 -3.26366375702491e-07 
0.0127122094854712 -5.79558400204405e-05 -1.89209422387648e-05 -1.43809515407156e-07 
0.0123880207538605 -5.82363427383825e-05 -1.90025639312807e-05 8.36934574977022e-08 
0.0121435448527336 -5.90473428019322e-05 -1.92743264051387e-05 1.30302495904289e-07 
0.0119875650852919 -5.91794268984813e-05 -1.9602479369496e-05 3.53744951553381e-07 
0.0118876053020358 -5.98097394686192e-05 -2.00602171389619e-05 5.82364066303853e-07 
0.0118418233469129 -6.13144584349357e-05 -2.05192282010103e-05 6.87998749526741e-07 
0.0118554076179862 -6.28111665719189e-05 -2.10248508665245e-05 6.8637365302493e-07 
0.0119013097137213 -6.38960555079393e-05 -2.1937485144008e-05 8.86082034412539e-07 
0.0119817983359098 -6.53183669783175e-05 -2.27065520448377e-05 1.02717478966952e-06 
0.0120634594932199 -6.60927908029407e-05 -2.30754903896013e-05 1.08412712052086e-06 
0.0121596716344357 -6.6051259636879e-05 -2.36950127145974e-05 1.2314882269493e-06 
0.0122503750026226 -6.50327565381303e-05 -2.44535076490138e-05 1.45685135066742e-06 
0.0123276235535741 -6.56082629575394e-05 -2.42293372139102e-05 1.56666021666751e-06 
0.0123261073604226 -6.55425392324105e-05 -2.38159991567954e-05 1.63423158028309e-06 
0.0123076550662518 -6.48814238957129e-05 -2.31274643738288e-05 1.76476874003129e-06 
0.0122602181509137 -6.39756472082809e-05 -2.26661122724181e-05 1.7403597212251e-06 
0.0121782021597028 -6.28053530817851e-05 -2.20893725781934e-05 1.69881445799547e-06 
0.0120859323069453 -6.1229060520418e-05 -2.19705980271101e-05 1.74459296431451e-06 
0.0120399314910173 -5.98086044192314e-05 -2.1449970518006e-05 1.7097116824516e-06 
0.0120004052296281 -5.89160445088055e-05 -2.081169259327e-05 1.66504730714223e-06 
0.0119433887302876 -5.79585830564611e-05 -2.03141753445379e-05 1.66145196089929e-06 
0.0119085088372231 -5.68517498322763e-05 -1.92252737178933e-05 1.69336772160023e-06 
0.0118727376684546 -5.62970126338769e-05 -1.82251333171735e-05 1.63808988418168e-06 
0.0118358666077256 -5.53875652258284e-05 -1.7872062016977e-05 1.56608098222932e-06 
0.0118041336536407 -5.38556232640985e-05 -1.77650999830803e-05 1.49308868913067e-06 
0.0117753902450204 -5.29243043274619e-05 -1.73414337041322e-05 1.55820964664599e-06 
0.0117334648966789 -5.20847024745308e-05 -1.73947591974866e-05 1.45676597185229e-06 
0.0116569306701422 -5.04523377458099e-05 -1.71022857102798e-05 1.41858026836417e-06 
0.0115667264908552 -4.84168776893057e-05 -1.64364537340589e-05 1.49700520069018e-06 
0.0114638842642307 -4.6611632569693e-05 -1.56995902216295e-05 1.48012622958049e-06 
0.011336418800056 -4.36248265032191e-05 -1.50732785186847e-05 1.47119851590105e-06 
0.0111744925379753 -4.20289034082089e-05 -1.44374225783395e-05 1.51817437199497e-06 
0.0110161462798715 -3.94820272049401e-05 -1.39129961098661e-05 1.53135545133409e-06 
0.0108155542984605 -3.77374635718297e-05 -1.38070299726678e-05 1.4827862742095e-06 
0.0106101930141449 -3.48354587913491e-05 -1.35799518830026e-05 1.57165823111427e-06 
0.01037532184273 -3.2858060876606e-05 -1.31411934489734e-05 1.61031402967637e-06 
0.0101113123819232 -3.04794430121547e-05 -1.28127703646896e-05 1.66629774867033e-06 
0.00982761476188898 -2.83777208096581e-05 -1.24527668958763e-05 1.85638657512754e-06 
0.00951221026480198 -2.63114961853717e-05 -1.16114770207787e-05 2.08572669180285e-06 
0.0091030253097415 -2.47774987656157e-05 -1.09689726741635e-05 2.30271484724653e-06 
0.00867684371769428 -2.26318588829599e-05 -1.05633944258443e-05 2.53877260547597e-06 
0.00820526294410229 -1.98560737771913e-05 -9.9456465250114e-06 2.77822459793242e-06 
0.00769127253443003 -1.80829156306572e-05 -9.49220793700079e-06 2.8988811209274e-06 
0.00713761756196618 -1.59244154929183e-05 -8.96414803719381e-06 3.10538757730683e-06 
0.00658442778512836 -1.43514607771067e-05 -8.57461418490857e-06 3.22457231050066e-06 
0.00597883015871048 -1.27980702018249e-05 -7.95216510596219e-06 3.27245243170182e-06 
0.00538061978295445 -1.16605706352857e-05 -7.23603579899645e-06 3.30663146996812e-06 
0.00477318884804845 -9.9868429970229e-06 -6.30018257652409e-06 3.29767613038712e-06 
0.0041787214577198 -7.64301785238786e-06 -5.20002095072414e-06 3.12474185193423e-06 
0.00357139529660344 -4.98830195283517e-06 -3.76305752070039e-06 2.86849490294117e-06 
0.00299836951307952 -2.03019794753345e-06 -2.03459967451636e-06 2.51937717621331e-06 
0.0024484118912369 9.79597075456695e-07 -4.80754245302251e-08 2.11992460208421e-06 
0.00193376245442778 4.12544886785327e-06 2.03605418391817e-06 1.63995650837023e-06 
0.00147302728146315 6.74964940117206e-06 3.88112221116899e-06 1.14371312065487e-06 
0.00108041695784777 9.70436940406216e-06 5.6053922889987e-06 6.73583087973384e-07 
0.000753655040170997 1.2205555321998e-05 7.29072689864552e-06 2.35507272350333e-07 
0.00047404327779077 1.49735951708863e-05 8.69553241500398e-06 -2.04203118414625e-07 
0.000246220326516777 1.79965227289358e-05 1.00231909527793e-05 -6.09407095453207e-07 
5.70395641261712e-05 2.10306934604887e-05 1.12556508611306e-05 -9.68756125985237e-07 
-7.71431150496937e-05 2.27251221076585e-05 1.22499113786034e-05 -1.24662778944185e-06 
-0.000186402554390952 2.44319380726665e-05 1.29209556689602e-05 -1.47965215546719e-06 
-0.000255924620432779 2.5216135327355e-05 1.33247867779573e-05 -1.63193885782675e-06 
-0.00029935734346509 2.51581168413395e-05 1.33551802719012e-05 -1.69096313129558e-06 
-0.000315570912789553 2.43323956965469e-05 1.3144933291187e-05 -1.6974655636659e-06 
-0.000326434150338173 2.368506284256e-05 1.28099809444393e-05 -1.68175711223739e-06 
-0.000323376239975914 2.24942978093168e-05 1.23248501040507e-05 -1.64159325777291e-06 
-0.000315242243232206 2.12448285310529e-05 1.18556772576994e-05 -1.58557122631464e-06 
-0.000309281778754666 2.01837501663249e-05 1.13914138637483e-05 -1.52524989971425e-06 
-0.00030484568560496 1.90055779967224e-05 1.09348811747623e-05 -1.47292303154245e-06 
-0.000294009107165039 1.76497906068107e-05 1.04437249319744e-05 -1.435506078451e-06 
-0.000287183909676969 1.65797810041113e-05 9.85514179774327e-06 -1.38319705911272e-06 
-0.000280785170616582 1.53419859998394e-05 9.27442670217715e-06 -1.31397234781616e-06 
-0.000267495750449598 1.40715965244453e-05 8.72136206453433e-06 -1.26076440665202e-06 
-0.000254026963375509 1.29359068523627e-05 8.20379318611231e-06 -1.18476850730076e-06 
-0.000243419781327248 1.21254943223903e-05 7.76171145844273e-06 -1.11521967482986e-06 
-0.000229971468797885 1.12757425085874e-05 7.42347219784278e-06 -1.04905234366015e-06 
-0.000217601729673333 1.0610872777761e-05 7.14903080734075e-06 -1.01115597317403e-06 
-0.000208046607440338 1.00663137345691e-05 6.88123554937192e-06 -9.7770418960863e-07 
-0.000204930154723115 9.79312972049229e-06 6.65850029690773e-06 -9.6098335689021e-07 
0 0 0 0 
0 0 0 0 
0 0 0 0 
0 0 0 0 
0 0 0 0 
0 0 0 0 
0 0 0 0 
0 0 0 0 
0 0 0 0 
0 0 0 0 
0 0 0 0 
0 0 0 0 
0 0 0 0 
0 0 0 0 
99.6466598510742 0.327454149723053 0.0206537246704102 0.00210788729600608 
