{
	"centerX" : 0.5,
	"centerY" : 0.5,
	"angle" : 0,
	"scale" : 1,
	"width" : 120,
	"height" : 115,
	"contents" : [
	       {
			"type" : "image",
			"resource" : {
				"type" : "static",
				"path" : "res/bg.png"
			},
			"centerX" : 0.5,
			"centerY" : 0.5,
			"width" : 120,
			"height" : 115,
			"angle" : 0,
			"zorder" : 1
        },
		{
            "type": "text",
            "centerX": 0.5,
            "centerY" : 0.4,
            "width": 55,
            "height": 55,
            "angle": 0,
            "color": "#ffffffff",
            "isVertical": 0,
            "alignment": 3,
            "font":"robotothin",
			"text": "{TEMPERATURE}",
            "zorder": 2
        },
		{
			"type" : "image",
			"resource":{
                "type":"dynamic",
                "resKey":"{TEMPERATURE_UNIT}",
                "resources":[
                    {
                        "key":"du",
                        "path":"res/du.png"
                    },
                    {
                        "key":"du_en",
                        "path":"res/du_en.png"
                    },{
                        "key":"du_arabic",
                        "path":"res/du_arabic.png"
                    }
                ]
            },
			"centerX" : 0.8,
			"centerY" : 0.2,
			"width" : 20,
			"height" : 20,
			"angle" : 0,
			"zorder" : 1
		},
		{
            "type": "text",
            "centerX": 0.5,
            "centerY": 0.65,
            "width": 40,
            "height": 16,
            "angle": 0,
            "color": "#ffffffff",
            "isVertical": 0,
            "alignment": 0,
            "font":"roboto",
			"text": "{WEATHER}",
            "zorder": 2
		}
	]
}
