0 0 0 0 
0 0 0 0 
0 0 0 0 
0 0 0 0 
0 0 0 0 
0 0 0 0 
0 0 0 0 
0 0 0 0 
0 0 0 0 
0 0 0 0 
0.0212057884782553 1.72081599885132e-05 -4.53509185760481e-09 0 
0.024172306060791 1.49639963638037e-05 2.73188277333247e-07 4.86239937202981e-09 
0.0259084142744541 1.37120059662266e-05 1.16780602965605e-08 1.33499407084514e-08 
0.0277952123433352 9.93924277281621e-06 -1.80985267661526e-07 1.19816645494097e-08 
0.0293030422180891 6.44626834400697e-06 4.77741721738312e-08 1.04074961981837e-08 
0.0305068604648113 1.72444231338886e-06 3.63330410202423e-09 -2.92683499658608e-09 
0.0313969366252422 -2.59630905929953e-06 2.87252865938115e-09 1.85678157293978e-08 
0.0318768061697483 -6.29642772764782e-06 1.3689313016485e-09 2.02988097441903e-08 
0.0318208858370781 -7.28066106603364e-06 -9.81409953304535e-10 -6.93356527747824e-09 
0.0311597343534231 -7.93622075434541e-06 6.31397878425588e-10 2.60666110918351e-09 
0.0300224684178829 -7.39993402021355e-06 3.14632409015303e-09 7.88662135597917e-10 
0.028618611395359 -6.7234773268865e-06 3.46261852524066e-10 2.57127297231818e-08 
0.0269842557609081 -6.37485436527641e-06 1.38115108239134e-09 1.96495353321779e-09 
0.0252886526286602 -6.02576619712636e-06 4.90057494584306e-10 -6.16790840624049e-09 
0.0236471928656101 -5.86054466111818e-06 -3.19546944460569e-10 -6.71821140940665e-08 
0.0221220981329679 -5.45995226275409e-06 3.59579988007397e-09 1.61984345936617e-07 
0.0207309946417809 -5.75985950490576e-06 7.65896734922222e-10 -1.12936398011243e-07 
0.0194655749946833 -5.28060581928003e-06 2.27045182654706e-09 -3.48322620746799e-10 
0.0183251816779375 -5.19159675604897e-06 2.35105890311615e-09 1.16887860501791e-10 
0.0172153320163488 -4.79100617667427e-06 7.8195361297162e-10 1.29060061249131e-11 
0.0161964148283005 -4.56384759672801e-06 3.00873548297886e-10 1.19647169949388e-09 
0.0152214728295803 -3.99060400013695e-06 8.32180435672569e-10 -1.19088716665772e-09 
0.014379401691258 -3.86827059628558e-06 1.1900297414158e-09 -1.2654164383008e-09 
0.0136199332773685 -3.8055936784076e-06 9.91557502771911e-10 -3.15339476752996e-10 
0.0129092168062925 -3.91647381547955e-06 7.69864172411872e-10 3.65374092092807e-10 
0.0121936649084091 -3.8721277633158e-06 7.61879781485675e-10 -3.05544006762304e-10 
0.0114884488284588 -4.11076462114579e-06 1.78885395385464e-09 -1.77033485093681e-10 
0.0108313020318747 -4.17715909861727e-06 1.56734270007064e-09 1.9840169784846e-10 
0.0101819345727563 -3.94904327549739e-06 8.73941891077479e-11 1.58037430364466e-10 
0.00965357385575771 -3.74686032955651e-06 1.1184441151002e-09 1.81516815467297e-10 
0.00926073174923658 -3.6374067349243e-06 5.68875502260369e-10 1.65721377592964e-11 
0.00901137664914131 -3.34230026055593e-06 2.32458566284954e-10 -4.79416173426728e-10 
0.00881374441087246 -2.95747349809972e-06 8.54704917951921e-10 3.5654793006934e-10 
0.00875173602253199 -2.86068552668439e-06 4.82383355482341e-10 3.52473300546663e-10 
0.00878150295466185 -2.5982426450355e-06 9.25155119180232e-10 -4.67698768602531e-10 
0.00896146707236767 -2.63052402260655e-06 2.71935335360851e-10 -2.03618857885779e-10 
0.0092548681423068 -2.54219594353344e-06 1.12870957025279e-09 -3.02961628007026e-10 
0.0096799423918128 -2.85420173895545e-06 9.83293557688114e-10 -1.15416443069449e-09 
0.0101579027250409 -3.05385856336216e-06 2.13511069935279e-10 2.01014344058947e-10 
0.0107038058340549 -3.39010762218095e-06 4.0987754856836e-10 3.67737812423385e-10 
0.0112529341131449 -3.55905194737716e-06 1.23953136643706e-09 -4.40615044450254e-10 
0.0117716239765286 -4.21746199208428e-06 9.11011488469171e-10 4.81696016407795e-10 
0.0122250057756901 -4.38874712926918e-06 1.64859736973e-09 -1.01135722019308e-09 
0.0126272430643439 -4.46067315351684e-06 1.61980684421081e-09 -3.64810182063025e-10 
0.0129376100376248 -4.56500765722012e-06 9.95052151786524e-10 -5.15245734966641e-10 
0.0131744602695107 -4.4960765990254e-06 8.49583903228535e-10 -4.1486616919606e-10 
0.013383281417191 -3.96362474930356e-06 1.95907423616859e-09 -8.82951281533373e-11 
0.0135778868570924 -3.90945842809742e-06 2.00396865768226e-10 1.11398418267683e-10 
0.0137431146577001 -3.63035655936983e-06 1.52979340306558e-09 1.01060278201448e-10 
0.0139204561710358 -3.04765899272752e-06 1.20161713912381e-10 1.5012826537486e-09 
0.0141257178038359 -2.82645942206727e-06 8.94252172312093e-11 4.94760732383526e-10 
0.0143188387155533 -2.75228103419067e-06 1.02509278843144e-09 -5.57207280316163e-10 
0.0145878037437797 -2.81856273431913e-06 2.7132912583383e-10 -5.13877662644546e-10 
0.0149500370025635 -3.4605300243129e-06 9.28563281821226e-10 5.54172541189502e-10 
0.0153774041682482 -3.68424343832885e-06 8.79452288771176e-10 -4.69228267352406e-10 
0.0159226860851049 -3.82515963792684e-06 1.2746136368591e-09 -6.38406827402349e-10 
0.0166057050228119 -3.85229259336484e-06 2.20442428200407e-10 2.82357748293549e-10 
0.0173561330884695 -3.58020656676672e-06 3.06899283764039e-10 -2.18458640066643e-10 
0.0181867815554142 -3.28949658978672e-06 1.07839825957967e-09 3.3727051707011e-10 
0.0190864559262991 -3.54298799720709e-06 7.85866816066516e-10 2.65333893745279e-10 
0.0199518091976643 -3.31894239025132e-06 8.54062265354116e-10 -5.64141355158254e-12 
0.0207414552569389 -3.30398142978083e-06 1.46400669365221e-09 3.69368230446199e-10 
0.0214838441461325 -3.30836951434321e-06 8.88927875752898e-10 2.06481831632743e-09 
0.0219791289418936 -2.75239199254429e-06 9.79984760007824e-10 1.54826429454857e-10 
0.0222392771393061 -3.21909533340659e-06 5.2171988951244e-10 -1.22533871937947e-09 
0.0222147684544325 -4.34103867519298e-06 1.46780410048564e-09 1.19028786826902e-09 
0.0219444539397955 -5.16836553288158e-06 8.85958584273538e-10 1.14859377564613e-09 
0.0213663745671511 -5.59234968022793e-06 1.92113969177399e-09 9.04647301513961e-10 
0.0207492858171463 -7.03043770045042e-06 1.24894761199812e-09 1.13234144283325e-09 
0.0200695469975471 -7.23499306332087e-06 5.87146109509717e-10 3.84666326569416e-10 
0.0195048842579126 -7.4951467468054e-06 1.0026660612894e-09 -1.12637676963345e-10 
0.0190714839845896 -7.87558201409411e-06 2.57244248125232e-09 9.25445886590381e-10 
0.0188288241624832 -8.30513454275206e-06 1.46844814086222e-09 -5.78760261937816e-10 
0.0186612699180841 -8.81437972566346e-06 2.4299549039597e-09 -4.34174723951131e-10 
0.0186789855360985 -8.59886858961545e-06 1.49237311397599e-09 -7.54498630239908e-10 
0.018802722916007 -9.61033038038295e-06 1.9315637977968e-09 6.82506773319602e-10 
0.0189935322850943 -1.01143996289466e-05 1.52544699094648e-09 -1.30079991222942e-09 
0.0191079806536436 -1.07276082417229e-05 1.69757063961384e-09 -1.41518019525222e-09 
0.0192900262773037 -1.04566097434144e-05 3.80181974790617e-09 9.30171217827791e-10 
0.0194315873086452 -1.12527268356644e-05 3.85270126912474e-09 -3.37131211836095e-10 
0.019554877653718 -9.52619302552193e-06 1.78500159098149e-09 2.0465460923158e-11 
0.0196524690836668 -8.839437214192e-06 1.0517454684944e-09 9.26260568245851e-10 
0.0198921356350183 -8.02783961262321e-06 1.9578076937421e-09 5.79607861705966e-10 
0.0204006694257259 -8.25009374239016e-06 2.83910184251113e-09 -1.1611933636857e-09 
0.0215346720069647 -8.02764952823054e-06 2.41425435199005e-09 1.66172642313001e-09 
0.0241188183426857 -7.79091078584315e-08 2.25453611335524e-09 -1.15830423030872e-09 
0.0298173502087593 -5.19209061167203e-08 1.70302202895378e-10 2.06744665831593e-09 
0.0397647470235825 -2.62705111708783e-08 2.81813267166697e-10 -1.27148391815268e-09 
0.055312629789114 2.87482475869183e-08 -3.24403615081792e-09 2.8022573150821e-09 
0.0772043168544769 1.06726884041564e-07 -2.31376717785281e-09 2.17191975515618e-09 
0.103745147585869 1.61045099957846e-07 4.41177094856471e-09 -4.84811613077341e-09 
0.132399901747704 1.36271264636889e-07 8.21555179442157e-09 -6.59543397674156e-09 
0.159537941217422 1.94743024621857e-07 4.8016740583634e-10 1.14349125723834e-08 
0.183088451623917 1.17828803922748e-07 6.90103663103514e-09 -9.03758667902821e-09 
0.200272604823112 3.00690999210929e-08 -5.42627498489878e-10 -2.84774065439919e-10 
0.212127819657326 -2.94503138320579e-08 1.42968259453369e-08 2.80525469520398e-09 
0.218028128147125 -4.52106996817747e-08 -1.28389352482827e-08 5.80215209211588e-09 
0.220903947949409 -7.06377704773331e-08 -6.35147268113201e-09 -3.61561958150958e-09 
0.220442399382591 -8.11085737950634e-08 -4.58026239158471e-09 -8.79625794425465e-09 
0.218901231884956 -6.91367904437357e-08 -5.62535795722852e-09 -6.72485889197105e-09 
0.214855745434761 -4.71660951006925e-08 8.22458420812744e-11 -1.19267806741874e-09 
0.210350096225739 -3.19595983455656e-08 -5.7312528056741e-09 -1.04416502111349e-08 
0.205301776528358 -1.00460201792885e-07 4.70189709389501e-09 4.49230075361129e-09 
0.200415849685669 -8.66720074554905e-08 -1.04904254172311e-08 -2.61904692377968e-10 
0.195711851119995 -1.12790821731323e-07 -1.87052573430435e-09 5.22805887470668e-09 
0.19074259698391 -1.47249875226407e-07 1.59217794504229e-08 1.99508676246296e-09 
0.185955002903938 -1.2925655937579e-07 3.67039154625104e-09 7.35641858540248e-09 
0.181301429867744 -1.1002050996467e-07 6.02944849603659e-09 -7.7079782556666e-09 
0.175736084580421 -7.18049568604329e-08 1.15642651010717e-08 -1.03580948263016e-08 
0.169342964887619 -2.76900073004072e-08 -1.15366063369038e-08 1.55500128329322e-08 
0.163528650999069 -2.93528160000278e-08 1.00856736295896e-08 -1.80015269357625e-09 
0.157149985432625 -6.61731519358e-08 6.54362075636072e-09 2.91814128416945e-10 
0.149969637393951 -5.80597998123267e-08 -4.37576774814374e-09 5.62430280126591e-09 
0.143284127116203 -2.060462747977e-08 1.57348056806228e-09 -8.41074054847013e-09 
0.135894566774368 -1.72306374679465e-08 -7.31335170200964e-09 1.31720856444417e-08 
0.128636673092842 3.00488818538724e-08 -6.60249543926739e-09 1.01850117228963e-09 
0.121465526521206 1.19588139568805e-07 -1.37592843785228e-08 2.38485031722746e-09 
0.114135533571243 1.37052584250341e-07 -6.28710861150239e-09 -8.63702709352765e-09 
0.106355383992195 1.50706564454595e-07 -4.64756277906986e-09 1.02091313181063e-09 
0.0991313233971596 1.99528640223434e-07 -1.20262590996845e-08 1.9428936237631e-09 
0.0912566930055618 2.24888208322227e-07 -4.56952742311501e-09 -4.00528010757739e-09 
0.0835044682025909 2.04266707442002e-07 -2.9033915271981e-09 -1.95471838715378e-09 
0.0758583396673203 2.30644491239218e-07 -8.07865774277161e-10 1.55109347588223e-09 
0.0680545121431351 2.47644002229208e-07 -6.52772813580782e-09 5.14462861200826e-10 
0.0602355189621449 2.53996877290774e-07 -2.60600763191121e-09 -2.92947244240338e-09 
0.052933607250452 2.73798123089364e-07 -1.9170058873641e-09 -2.35854802355107e-09 
0.0456305369734764 2.85593523585703e-07 -7.06148384210792e-09 -5.40202826915248e-10 
0.038672149181366 2.94665587716736e-07 -6.38311181688778e-09 -7.39505123803497e-10 
0.0326096266508102 2.70092859864235e-07 -7.0593686452014e-09 1.46600198647207e-09 
0.0268945433199406 2.45732881012373e-07 -7.695652115558e-09 -1.4264729397695e-09 
0.02187305316329 2.10871930903522e-07 -4.29488311581849e-09 -1.15453917259867e-10 
0.0175686031579971 1.81684990820941e-07 -3.71709973912004e-09 1.79318296322784e-10 
0.0138970352709293 1.33201092467061e-07 -2.66419886152391e-09 6.48265718883323e-10 
0.0108825312927365 9.56958683673292e-08 -2.67299093970053e-09 6.13641082392036e-12 
0.00852464232593775 6.24735594101367e-08 -1.23772414539758e-09 2.31728580768475e-10 
0.0066834157332778 3.08963649331417e-08 -8.15539136223009e-10 3.45837636306356e-10 
0.00532734021544456 1.2090978316337e-08 -4.74156047758356e-10 -5.28998823912108e-11 
0.00440080789849162 -2.32070533456863e-09 1.03934368056446e-10 1.21199980607223e-10 
0.00372962141409516 -1.15861257654615e-08 1.64820809778199e-10 -1.11676834446683e-10 
0.00324819097295403 -2.20023730435059e-08 5.11323483554094e-10 1.73628361688216e-10 
0.00286110164597631 -3.07763207274547e-08 1.001809191159e-09 2.0792322724672e-11 
0.00258503179065883 -3.82595317205414e-08 9.53358614275146e-10 -2.31837007924618e-10 
0.00234869285486639 -4.11983273806982e-08 1.11390496826402e-09 -2.22491178258899e-10 
0.00219427281990647 -4.55451436209842e-08 1.03151798214185e-09 1.44264974966113e-10 
0.00205487315542996 -4.61545732832747e-08 1.25931010064306e-09 -7.29748622640969e-11 
0.00195415713824332 -4.08386586059351e-08 1.07874287280652e-09 -1.18769938328711e-10 
0.00195857160724699 -3.57974704456865e-08 9.77027569959432e-10 -5.46488895802888e-11 
0.00190738076344132 -4.05947503168136e-08 9.65971191924098e-10 -4.22802834409985e-11 
0.00183087284676731 -3.87289128411794e-08 1.06642306096916e-09 -5.51230762424471e-11 
0.00175579078495502 -3.8160592339409e-08 8.12394096438851e-10 -5.45030028054061e-11 
0.00168233213480562 -4.13765246776165e-08 1.03470598755706e-09 -6.8827811505745e-11 
0.00146813807077706 -4.80729067930952e-08 1.23212495761749e-09 4.43286969631362e-11 
0.00133631157223135 -4.24473682869575e-08 9.88272463864348e-10 3.05050811000296e-11 
0.00120428681839257 -4.39563746112981e-08 1.08542519416943e-09 -8.43598108035692e-11 
0.00111755344551057 -4.03003559767967e-08 9.81609682426665e-10 -2.17616133446619e-11 
0.00104716175701469 -3.65376740774082e-08 8.98345065003525e-10 -1.8008291038929e-11 
0.0010464295046404 -2.90032971861365e-08 6.34475472161e-10 3.37997303756499e-11 
0.00102485273964703 -2.63335073213966e-08 6.37289943039576e-10 -7.58288154489861e-11 
0.000989955966360867 -2.18306490751274e-08 5.65276936370651e-10 -7.69091873520367e-11 
0.000969872402492911 -2.0901122752548e-08 5.02049957162853e-10 -3.27775155108123e-12 
0.000873743440024555 -2.38736424762465e-08 5.39059907822548e-10 -1.58397882484007e-12 
0 0 0 0 
0 0 0 0 
0 0 0 0 
0 0 0 0 
0 0 0 0 
0 0 0 0 
0 0 0 0 
0 0 0 0 
0 0 0 0 
0 0 0 0 
0 0 0 0 
0 0 0 0 
0 0 0 0 
0 0 0 0 
99.98681640625 0.012079413048923 3.3523374440847e-05 2.1686344553018e-05 
