0 0 0 0 
0 0 0 0 
0 0 0 0 
0 0 0 0 
0 0 0 0 
0 0 0 0 
0 0 0 0 
0 0 0 0 
0 0 0 0 
0 0 0 0 
0.0159317031502724 3.4839325962821e-05 5.62610980026079e-09 -8.86461126725635e-09 
0.0194876082241535 3.68594810424838e-05 -2.06839544603099e-07 1.70061738913319e-07 
0.0219945088028908 3.89002198062371e-05 -3.6983685447467e-08 1.0193654809143e-08 
0.0243978761136532 3.82482467102818e-05 2.60489144920939e-07 6.9641160393985e-08 
0.0262992233037949 3.65564046660438e-05 -1.10813580533886e-07 -1.67541188034193e-07 
0.027709424495697 3.29335598507896e-05 1.7153428899519e-08 2.96420274992215e-08 
0.0287089068442583 2.84885209111962e-05 2.86092682877381e-09 -5.70334890426238e-09 
0.0292900037020445 2.34852705034427e-05 3.71617758787579e-09 -7.18035364499769e-09 
0.0294697526842356 2.06877830351004e-05 1.42321032736703e-09 -3.84227227812062e-09 
0.0291823651641607 1.80971637746552e-05 2.59885735154342e-09 -3.83628462330421e-09 
0.028479902073741 1.64492830663221e-05 1.84395765323586e-09 -1.45976453147512e-09 
0.0274645909667015 1.54141489474569e-05 2.26716823092943e-09 -4.0112224652944e-09 
0.0262046754360199 1.42673770824331e-05 -7.37701132819124e-12 -1.86050586048481e-09 
0.0247749611735344 1.31522856463562e-05 1.45765899350891e-09 -1.67960623187469e-09 
0.0233093909919262 1.24286898426362e-05 1.61706655010807e-11 -1.7859217438243e-09 
0.0218792781233788 1.24239595606923e-05 1.52689005883389e-09 -3.35333227852175e-09 
0.0205372627824545 1.14714994197129e-05 1.90464488625253e-09 -3.72293107453459e-09 
0.0192999225109816 1.17469553515548e-05 2.67555474303682e-11 -6.37963570859768e-10 
0.0181800238788128 1.17366525955731e-05 2.04068206777208e-09 -3.05005576350936e-09 
0.0170953925698996 1.17082181532169e-05 6.34895469531216e-10 -2.6277515718931e-09 
0.0161212608218193 1.12517009256408e-05 2.0950912116291e-09 -3.0031914732831e-09 
0.0151828518137336 1.14515623863554e-05 1.84580273288049e-09 -2.71420130815159e-09 
0.0143497763201594 1.10501905510318e-05 2.47598630487289e-09 -3.31828231558973e-09 
0.0135571639984846 1.06597080957727e-05 2.80512502115471e-09 -4.34148850203542e-09 
0.0127842836081982 1.01079567684792e-05 7.38033301139751e-10 -1.78873515999101e-09 
0.0119803017005324 1.0069427844428e-05 1.88084814389811e-09 -2.30324537220383e-09 
0.0112142274156213 9.55970790528227e-06 1.05591779764325e-09 -2.20545803841787e-09 
0.0105215692892671 9.17960733204382e-06 7.23913595734871e-10 -1.48546064338007e-09 
0.00990285165607929 9.02079500519903e-06 1.0835844443946e-09 -2.1090496016285e-09 
0.00942605640739202 8.80356947163818e-06 1.03168806830922e-09 -1.48198420202306e-09 
0.00910220202058554 8.44386431708699e-06 7.79489250923859e-10 -1.80500114854709e-09 
0.00888113584369421 8.39566018839832e-06 5.78344649948548e-10 -1.23180510236409e-09 
0.00870748795568943 8.41179007693427e-06 1.0646484804866e-09 -2.11348294421043e-09 
0.00862696394324303 8.24013295641635e-06 7.37723826471637e-10 -1.92572024992899e-09 
0.00864284485578537 8.52571520226775e-06 3.74538039471517e-10 -1.59420066037086e-09 
0.00878431834280491 8.61832631926518e-06 8.33450142234682e-10 -1.17839560331845e-09 
0.00904822256416082 9.05497472558636e-06 1.61974944568044e-09 -2.62626143054945e-09 
0.00942885130643845 9.37812365009449e-06 7.16195103223072e-10 -1.48563294999349e-09 
0.0098677622154355 9.88076044450281e-06 1.11928322166222e-09 -2.33238872660024e-09 
0.0103601301088929 1.02345111372415e-05 9.7741970073173e-10 -2.06392902768471e-09 
0.0108538046479225 1.07278265204513e-05 8.41719138833241e-10 -1.66669245071915e-09 
0.011286080814898 1.06102997960988e-05 2.13757966882611e-09 -3.21380300150054e-09 
0.0116483718156815 1.0763914360723e-05 1.08075237648109e-09 -1.26957788726401e-09 
0.0119394166395068 1.08168287624721e-05 1.37493461060956e-09 -2.72554112612511e-09 
0.0121466852724552 1.05671451819944e-05 9.7823305011957e-10 -2.2117618847517e-09 
0.0122875617817044 1.0155456038774e-05 2.76845213420529e-10 -1.95051108597966e-09 
0.0124384704977274 1.01319164969027e-05 7.29281912636992e-10 -1.96514848838092e-09 
0.0125838285312057 9.6698640845716e-06 1.46788248223118e-09 -2.26791940782789e-09 
0.0127407135441899 9.42707811191212e-06 1.393755111323e-09 -1.78877423984147e-09 
0.012927464209497 9.57322208705591e-06 1.50500878426385e-09 -2.95316771037335e-09 
0.0131577923893929 9.57094289333327e-06 1.62173974249669e-09 -2.36971953171405e-09 
0.0133970025926828 9.55260657065082e-06 1.09212128229785e-09 -1.74520353724006e-09 
0.0137212192639709 9.3814624051447e-06 7.41251560132383e-10 -1.80792991688605e-09 
0.0141489785164595 8.78358605405083e-06 1.57136126333057e-09 -2.21923945886715e-09 
0.0146512165665627 8.88260819920106e-06 1.82363668610463e-09 -2.70707700700257e-09 
0.015289019793272 9.2417203632067e-06 7.21905424327929e-10 -2.16297291188994e-09 
0.0160757955163717 9.99008352664532e-06 1.18486997990885e-09 -2.23981033720122e-09 
0.0169446561485529 1.12867364805425e-05 1.04846420434512e-09 -2.60053578671204e-09 
0.0178721994161606 1.2616483218153e-05 1.18980247876266e-09 -3.26010729523318e-09 
0.0188447125256062 1.33491657834384e-05 2.3411648175653e-09 -3.84122644803142e-09 
0.0197198670357466 1.45550338856992e-05 3.68664343497471e-09 -5.23205301306007e-09 
0.020431749522686 1.52396150951972e-05 3.48269324490502e-09 -5.91448090503377e-09 
0.0210114121437073 1.58666171046207e-05 1.82158033101842e-09 -4.83691042774126e-09 
0.0213025175035 1.69175546034239e-05 8.94962937092458e-10 -2.7460635987353e-09 
0.0212878733873367 1.65656601893716e-05 2.91156077025789e-09 -4.51045556459917e-09 
0.0209789704531431 1.52644206536934e-05 1.94556104560206e-09 -3.60922780551221e-09 
0.0204322300851345 1.39338126246003e-05 2.23705609592173e-09 -3.11829184695966e-09 
0.0196019504219294 1.26819313663873e-05 3.08413738991931e-10 -2.33506614044643e-09 
0.0187254641205072 1.03174452306121e-05 1.80501813495937e-09 -3.66761399028803e-09 
0.0178284458816051 9.24094365473138e-06 4.50690568198908e-10 -1.64578251027336e-09 
0.0170572027564049 8.13894257589709e-06 7.88379361793545e-10 -1.80283787898361e-09 
0.0164210107177496 7.09012783772778e-06 1.70698621904108e-09 -2.98771651863206e-09 
0.0159985590726137 6.07930451224092e-06 9.15359121833603e-10 -1.43067802049757e-09 
0.0156694278120995 5.18749129696516e-06 5.86668602586826e-10 -1.69309366526704e-09 
0.0155430138111115 5.02547618452809e-06 1.60497970469464e-09 -1.728731269246e-09 
0.0155275659635663 3.71481360161852e-06 -2.31501706693393e-10 -9.97023463789048e-10 
0.0156283229589462 2.78499624073447e-06 4.69185468254807e-10 -2.29972763055031e-10 
0.0157148148864508 1.63934441843594e-06 3.96016164305735e-10 -9.11052289165326e-10 
0.0159206800162792 1.43908675909188e-06 6.94387602973023e-10 -1.78225734170923e-09 
0.0161296166479588 1.83004033260659e-07 -2.71550032460155e-10 3.73605396619681e-10 
0.0164060033857822 1.43946670050354e-06 4.2457612425828e-10 -1.07115294412097e-09 
0.016683416441083 1.93271785065008e-06 4.49807118635404e-12 -8.90833351530063e-10 
0.0171271450817585 2.55861345976882e-06 1.60029045570553e-10 1.7740484081763e-10 
0.01784473285079 1.76091089088004e-06 -8.1014757402631e-11 -7.16221304486453e-10 
0.019217586144805 1.40828910843993e-06 2.257474901457e-10 -3.46066425516156e-10 
0.022145438939333 7.19377055702353e-09 -5.02470509644581e-10 -3.23299415017075e-10 
0.0281437989324331 8.09682831004466e-09 -1.9532687967061e-10 4.65055799425684e-10 
0.0381379388272762 -1.02548234792721e-09 -3.20014875709873e-10 -8.31091861996924e-10 
0.0537105016410351 9.4788964588588e-09 2.60423860254377e-09 -1.87093174286446e-10 
0.0754189044237137 3.50057098330581e-08 5.3851265668925e-09 -6.01858252124998e-09 
0.101496942341328 3.8022067201382e-08 3.59236218550052e-09 -4.24249124719722e-09 
0.129592910408974 -3.10187488139491e-08 -3.71270947319147e-09 -6.74454520011025e-11 
0.156328946352005 1.49700701967959e-08 8.26917556651097e-09 -9.73799885173321e-09 
0.179401502013206 -7.56401914259186e-08 5.1297974756892e-09 1.00476222897328e-08 
0.196284517645836 -1.60807740030577e-07 -1.74000831520971e-08 7.3743362527523e-09 
0.207998558878899 -2.08127348741982e-07 -5.32317967483209e-09 7.58795870581253e-09 
0.213940963149071 -1.97967838175828e-07 6.24077278743584e-09 -3.81029652274378e-09 
0.216996625065804 -2.040303661488e-07 6.50045739458704e-10 1.80396519944281e-09 
0.216754391789436 -1.93243486137362e-07 -6.2296572345133e-09 -6.49133546914982e-09 
0.215494304895401 -1.5800304026925e-07 -6.81476652886204e-09 1.33518029965529e-09 
0.211714684963226 -1.07414225567481e-07 -5.17688825141249e-09 9.91880888534524e-09 
0.207420408725739 -6.66282949168817e-08 -4.51106529908429e-09 -3.43888917342383e-09 
0.202504873275757 -1.22331130114617e-07 1.96875991065326e-08 -3.60013818756499e-09 
0.197823897004128 -8.47080536914291e-08 2.89287438448582e-09 -3.67142816148913e-10 
0.193272992968559 -9.33891897147987e-08 1.27113999326411e-08 -6.05219785398958e-09 
0.188534498214722 -1.15039611046086e-07 -1.37841409397765e-08 6.71938948926254e-09 
0.184096455574036 -7.75422358856304e-08 -3.03823077807408e-09 7.26863724764826e-09 
0.179897889494896 -4.17886258219369e-08 -1.40043328045181e-08 2.3568697216092e-08 
0.174918532371521 3.20833464684256e-09 -7.23228310572921e-10 5.15843723292164e-09 
0.169283255934715 4.65385301140486e-08 -4.02605193627892e-09 -7.68349328605922e-10 
0.164340898394585 3.01411887448921e-08 -1.32700717081491e-09 -6.60577414990371e-09 
0.158903658390045 -3.07515415443049e-08 1.22119123702191e-08 -1.41842066980757e-08 
0.152760237455368 -4.32692286267411e-08 -2.40894326708485e-09 4.25715818153094e-09 
0.147119417786598 -1.6083855598481e-08 -6.39669539559407e-10 -2.49749398939514e-09 
0.140628933906555 -2.88706814899342e-08 7.86794362994669e-09 -5.53518653134688e-09 
0.134172528982162 1.14542183382582e-08 -4.20908508047546e-09 -3.36650529675353e-09 
0.127721041440964 1.04320024547633e-07 -7.15080161750592e-10 4.72071759460846e-09 
0.120986178517342 1.14765052785515e-07 1.61766866568769e-09 6.69442667966536e-10 
0.11368964612484 1.17851250251988e-07 -3.3363827256494e-09 4.42531566946514e-09 
0.107027813792229 1.56309524754761e-07 -3.37716410392375e-10 3.23743831742718e-09 
0.0997982770204544 1.63486638484756e-07 2.03096672812819e-09 -3.78377640330996e-09 
0.0927506536245346 1.10629953269381e-07 5.69323654886489e-09 -2.09475103929435e-09 
0.0858248323202133 1.19435735541629e-07 -1.47004208805868e-09 -1.50335421889025e-09 
0.0786919966340065 1.33154844661476e-07 4.07753963926893e-09 -6.2594089911272e-09 
0.0714768096804619 1.45101012094528e-07 5.15365394804235e-09 -8.31622948282984e-09 
0.0645719617605209 1.81610575964442e-07 2.97977797991678e-09 -2.80629008919675e-09 
0.0573987849056721 2.13945131690707e-07 2.56619747673881e-09 -5.15738385331588e-09 
0.0503743402659893 2.49385357165011e-07 5.21787013596509e-09 -4.56584459129772e-09 
0.0440634340047836 2.41737780015683e-07 2.12321449311048e-09 -3.83858633767886e-09 
0.0377860404551029 2.41218804148957e-07 2.42451481113903e-09 -2.53025489449499e-09 
0.0319740362465382 2.27364307647804e-07 2.48081288845015e-09 -4.21769508207603e-09 
0.0265906378626823 2.26694210141432e-07 2.8826165898721e-09 -5.64700641803029e-09 
0.0215619467198849 1.9292614524602e-07 2.08104378174312e-09 -5.25748200530529e-09 
0.017064917832613 1.68256028700853e-07 1.47912015968643e-09 -2.75739653332607e-09 
0.0132126035168767 1.41466853165184e-07 1.61891544614434e-09 -3.11068637515177e-09 
0.00992672238498926 1.11613489934825e-07 2.18398432672018e-09 -3.58709395520407e-09 
0.00731280911713839 8.69895029609324e-08 1.05761865931697e-09 -1.97561900172616e-09 
0.00535339768975973 6.56528709441773e-08 8.26907431417112e-10 -1.3311950430861e-09 
0.00387275964021683 4.75965543955681e-08 6.90024426486247e-10 -9.83192638415176e-10 
0.00280336127616465 2.74204967354308e-08 5.39969569057774e-10 -9.74287872601565e-10 
0.00199649366550148 9.73812120719231e-09 3.1106707487627e-11 -1.20931459290929e-10 
0.00147978309541941 -8.81943606145796e-09 1.92001241294815e-11 7.14146320204834e-12 
0.00113415170926601 -1.98066231860139e-08 -2.44050030184795e-10 3.7202357860977e-10 
0.000928217545151711 -2.8662427666859e-08 -3.25610899354345e-10 5.16889864243808e-10 
0.000806032039690763 -3.16275895784202e-08 -3.53272855413422e-10 6.02572269858825e-10 
0.000764173455536366 -3.07802133647783e-08 -3.47729428584742e-10 6.69694577570823e-10 
0.000807008298579603 -2.74748981610173e-08 -2.94795521327273e-10 5.27486998525006e-10 
0.000811354257166386 -3.20360459227231e-08 -3.67389341171531e-10 7.0657207862368e-10 
0.000819364737253636 -3.16997352456383e-08 -3.79790421334292e-10 6.91254775642136e-10 
0.000792503939010203 -3.07863206217007e-08 -4.20972617876103e-10 6.49901354954352e-10 
0.000754311331547797 -3.01201407637564e-08 -3.61189689268571e-10 6.55366427793069e-10 
0.000639435253106058 -3.35597019329725e-08 -3.94839327899632e-10 6.89478363291585e-10 
0.000570966338273138 -2.86173735730699e-08 -3.46649070559479e-10 6.3998978339086e-10 
0.000501856906339526 -2.77489220934513e-08 -3.10558523342053e-10 5.46277467705636e-10 
0.000466236000647768 -2.56750945482054e-08 -3.00625774274366e-10 5.54046308831602e-10 
0.000438061746535823 -2.43236354435794e-08 -2.84085172053139e-10 5.14826070663332e-10 
0.000429665262345225 -1.86463466889109e-08 -2.22430102114757e-10 3.93977489521191e-10 
0.000427456339821219 -1.60669640081323e-08 -1.91245186353939e-10 3.32706640016056e-10 
0.000405438710004091 -1.28517513076076e-08 -1.55476020946566e-10 2.7332097696231e-10 
0.000398537522414699 -1.16756461920886e-08 -1.43343503733462e-10 2.5150886928671e-10 
0.000369241577573121 -1.23205654745107e-08 -1.50630397044438e-10 2.58830012977995e-10 
0 0 0 0 
0 0 0 0 
0 0 0 0 
0 0 0 0 
0 0 0 0 
0 0 0 0 
0 0 0 0 
0 0 0 0 
0 0 0 0 
0 0 0 0 
0 0 0 0 
0 0 0 0 
0 0 0 0 
0 0 0 0 
99.9823608398438 0.0165684707462788 3.56149903382175e-05 2.55826435022755e-05 
