0 0 0 0 
0 0 0 0 
0 0 0 0 
0 0 0 0 
0 0 0 0 
0 0 0 0 
0 0 0 0 
0 0 0 0 
0 0 0 0 
0 0 0 0 
0.00780783873051405 -0.000275953731033951 3.236064731027e-05 -3.58371539732616e-06 
0.00886488053947687 -0.000297501712338999 3.67015018127859e-05 -4.85951704831677e-06 
0.00947706215083599 -0.000313864991767332 3.9288501284318e-05 -6.63539685774595e-06 
0.010106323286891 -0.000334981275955215 4.17474475398194e-05 -7.4222230068699e-06 
0.0105407508090138 -0.000351592432707548 4.36147456639446e-05 -8.79114486451726e-06 
0.0108768753707409 -0.000361146114300936 4.49042127002031e-05 -1.02365465863841e-05 
0.0112303616479039 -0.0003646886034403 4.53989705420099e-05 -1.06443021650193e-05 
0.0115675702691078 -0.000361980084562674 4.48789032816421e-05 -1.05599810922286e-05 
0.0118319550529122 -0.000350529706338421 4.27213199145626e-05 -1.07380919871503e-05 
0.0120459068566561 -0.000336484110448509 3.84416707674973e-05 -9.32430612010648e-06 
0.012118392623961 -0.000322528212564066 3.25907858496066e-05 -7.34426430426538e-06 
0.0120348753407598 -0.000308978516841307 2.55247268796666e-05 -5.33119009560323e-06 
0.011869153007865 -0.000294710975140333 1.76001703948714e-05 -3.14887074637227e-06 
0.0116000827401876 -0.000278635969152674 1.0288031262462e-05 -1.00893487342546e-06 
0.0112635353580117 -0.000261320412391797 3.95012239096104e-06 7.0262245799313e-07 
0.0108782341703773 -0.000243860748014413 -1.18554373784718e-06 2.14838587453414e-06 
0.0104640508070588 -0.000226793345063925 -4.97118708153721e-06 3.32781610268285e-06 
0.0100024314597249 -0.000209439851460047 -7.76225624576909e-06 4.03042395191733e-06 
0.00953507795929909 -0.000193420186406001 -9.49331933952635e-06 4.64244976683403e-06 
0.00905122049152851 -0.000178258123924024 -1.06112556750304e-05 5.04617628394044e-06 
0.00856157671660185 -0.000163983160746284 -1.14120812213514e-05 5.22902428201633e-06 
0.00807808060199022 -0.000151585758430883 -1.20343738672091e-05 5.30216993865906e-06 
0.00761224050074816 -0.000142094999318942 -1.21241919259774e-05 5.50996628589928e-06 
0.00715052196756005 -0.00013530850992538 -1.24642574519385e-05 5.68932227906771e-06 
0.00666916277259588 -0.000131184875499457 -1.27168677863665e-05 6.00553858021158e-06 
0.00617854855954647 -0.000125295235193335 -1.28575002236175e-05 6.24007134319982e-06 
0.0057388860732317 -0.000117016330477782 -1.2805059668608e-05 6.35809465165948e-06 
0.00535464799031615 -0.000106444909761194 -1.2569176760735e-05 6.20676246398943e-06 
0.00504144886508584 -9.34960335143842e-05 -1.21237162602483e-05 5.93485628996859e-06 
0.00484091648831964 -7.92097343946807e-05 -1.14006325020455e-05 5.52968322153902e-06 
0.00473334826529026 -6.73993708915077e-05 -1.09027987491572e-05 5.18441220265231e-06 
0.00466453982517123 -5.7522007409716e-05 -1.04374321381329e-05 4.8947958930512e-06 
0.00463480921462178 -4.94081250508316e-05 -1.01104287750786e-05 4.76595550935599e-06 
0.00465766061097383 -4.23980272898916e-05 -9.96970265987329e-06 4.69727501695161e-06 
0.00474373437464237 -3.58805591531564e-05 -9.930411579262e-06 4.58069780506776e-06 
0.00491685140877962 -2.96795806207228e-05 -9.95688787952531e-06 4.52389167548972e-06 
0.00516273593530059 -2.44865186687093e-05 -1.00264978755149e-05 4.43712178821443e-06 
0.00546284904703498 -2.01849416043842e-05 -1.00879624369554e-05 4.37226708527305e-06 
0.00579382432624698 -1.62527849170147e-05 -1.01535397334374e-05 4.23549317929428e-06 
0.00615894049406052 -1.26490667753387e-05 -1.02168251032708e-05 4.11504834119114e-06 
0.006500035058707 -1.01583891591872e-05 -1.03311631391989e-05 3.94004473491805e-06 
0.00680162152275443 -7.60964076107484e-06 -1.02311323644244e-05 3.88118814953486e-06 
0.00706105912104249 -4.6053182813921e-06 -1.02515314210905e-05 3.69202666661295e-06 
0.00729584926739335 3.33658761064726e-07 -1.00699198810617e-05 3.5194734664401e-06 
0.00747864972800016 6.19902175458265e-06 -9.86693794402527e-06 3.28265377902426e-06 
0.0076379207894206 1.4192373782862e-05 -9.67426149145467e-06 3.10210884890694e-06 
0.00778356567025185 2.32498605328146e-05 -9.6393932835781e-06 2.81109214483877e-06 
0.00792994722723961 3.40624719683547e-05 -9.50382218434243e-06 2.54002225119621e-06 
0.00807716138660908 4.47749516752083e-05 -9.48767683439655e-06 2.3581651475979e-06 
0.00824488699436188 5.61656379431952e-05 -9.62635658652289e-06 2.2321617052512e-06 
0.00843760091811419 6.809041951783e-05 -9.46596082940232e-06 2.06054733098426e-06 
0.00866512954235077 7.98367182142101e-05 -9.47161788644735e-06 1.97111739907996e-06 
0.00893373414874077 9.17893412406556e-05 -9.54861934587825e-06 1.91866524801299e-06 
0.00926580745726824 0.000104868740891106 -9.79317337623797e-06 1.79021242274757e-06 
0.00968344230204821 0.00011878468649229 -9.98334144242108e-06 1.77382412402949e-06 
0.0102059077471495 0.00013460083573591 -1.04132404885604e-05 1.7210253417943e-06 
0.0108313597738743 0.000153200744534843 -1.06985917227576e-05 1.63488357429742e-06 
0.0115510672330856 0.000173250722582452 -1.11765466499492e-05 1.53812641201512e-06 
0.0123203136026859 0.000192272185813636 -1.16311202873476e-05 1.54674989971681e-06 
0.0131082935258746 0.000211145030334592 -1.1972194442933e-05 1.51702488437877e-06 
0.0139071587473154 0.000230094025027938 -1.22506426123437e-05 1.59996898219106e-06 
0.0146250808611512 0.000244403927354142 -1.28182500702678e-05 1.60559136475058e-06 
0.015229825861752 0.000256511440966278 -1.30305488710292e-05 1.62824380822713e-06 
0.0156308803707361 0.000262503599515185 -1.26601844385732e-05 1.68083499829663e-06 
0.0157768111675978 0.000263025111053139 -1.25141723401612e-05 1.86337967988948e-06 
0.0156235005706549 0.00025603361427784 -1.22544142868719e-05 1.79920573373238e-06 
0.0152533119544387 0.000245262694079429 -1.16563105621026e-05 1.80828294560342e-06 
0.0146788889542222 0.000228746313950978 -1.11943354568211e-05 1.95943448488833e-06 
0.0140444496646523 0.000213051156606525 -1.12148791231448e-05 1.79689470769517e-06 
0.0134157799184322 0.000197286179172806 -1.10204073280329e-05 1.57176725679165e-06 
0.0128549113869667 0.00018311376334168 -1.03321553979185e-05 1.37264169097762e-06 
0.0124001391232014 0.000171604187926278 -9.95087066257838e-06 1.28285546452389e-06 
0.0120747974142432 0.000162486205226742 -9.63558159128297e-06 1.04480159279774e-06 
0.0118695413693786 0.000156193709699437 -9.22585786611307e-06 1.08457061287481e-06 
0.0117961578071117 0.000153050277731381 -8.75151999935042e-06 8.20079151253594e-07 
0.0118223940953612 0.000151256084791385 -8.90988667379133e-06 7.89097271081118e-07 
0.0118968011811376 0.000150446314364672 -8.95666744327173e-06 7.21546655313432e-07 
0.0120438300073147 0.000151493164594285 -8.88956492417492e-06 5.73276508930576e-07 
0.0122412741184235 0.000154019013280049 -9.12231644178974e-06 3.97652911487967e-07 
0.0124779688194394 0.000156511727254838 -9.14544489205582e-06 4.25291830197239e-07 
0.0127649875357747 0.000161665127961896 -9.61095975071657e-06 2.52029252578723e-07 
0.0131783848628402 0.000172353597008623 -1.00470215329551e-05 -5.76057814782871e-08 
0.0137633746489882 0.000188246616744436 -1.02660915217712e-05 -1.36938623995775e-07 
0.0147256003692746 0.000216079701203853 -1.01506493592751e-05 -4.00015949253429e-07 
0.0164943113923073 0.00026381848147139 -1.10495684566558e-05 -1.23248230465833e-06 
0.019905673339963 0.000344010390108451 -1.15392822408467e-05 -2.56632119999267e-06 
0.0260689109563828 0.000462950760265812 -1.32265167849255e-05 -4.5386027522909e-06 
0.0362056940793991 0.00060367223341018 -1.86442503036233e-05 -6.3013167164172e-06 
0.0513083152472973 0.000736506306566298 -2.74301619356265e-05 -8.53244819154497e-06 
0.0718218311667442 0.000844108522869647 -3.26026056427509e-05 -1.06675042843563e-05 
0.0966895818710327 0.000884713837876916 -3.7780191632919e-05 -1.07535825009109e-05 
0.123349830508232 0.000836554041597992 -4.68285179522354e-05 -9.50854428083403e-06 
0.149625986814499 0.000717590330168605 -5.19031418662053e-05 -6.20646142124315e-06 
0.173132732510567 0.000566497910767794 -4.71936727990396e-05 -3.47568948200205e-06 
0.191851288080215 0.000375626405002549 -5.45629372936673e-05 2.14770830098132e-06 
0.204597890377045 0.000199302739929408 -6.12368094152771e-05 5.93476624999312e-06 
0.212879821658134 4.12148401665036e-05 -6.01721658313181e-05 1.11556919364375e-05 
0.217297852039337 -7.86268647061661e-05 -6.67638669256121e-05 1.02842159321881e-05 
0.218673214316368 -0.000165415636729449 -6.93870752002113e-05 7.52898131395341e-06 
0.218056961894035 -0.000199654343305156 -6.20127248112112e-05 3.99109376303386e-06 
0.216542273759842 -0.000243422167841345 -5.99278719164431e-05 1.22392827961448e-06 
0.213776290416718 -0.00027749314904213 -5.79567822569516e-05 -1.46744002904597e-06 
0.210017368197441 -0.000289616349618882 -5.00569221912883e-05 -2.71941667051578e-06 
0.205826848745346 -0.000327983725583181 -4.04163147322834e-05 9.02730903362681e-07 
0.201080992817879 -0.000357469805749133 -3.58435718226247e-05 2.22943572225631e-06 
0.196190685033798 -0.000353953626472503 -2.76153004961088e-05 1.26375380204991e-06 
0.191344052553177 -0.0003345291770529 -1.70624298334587e-05 -4.73509402354466e-07 
0.1862982660532 -0.000312635791487992 -2.65391713583085e-06 3.44304709187782e-07 
0.181091457605362 -0.00027270580176264 1.97165695681178e-06 -2.30886394092522e-06 
0.175214856863022 -0.000242531721596606 1.11641065814183e-05 -3.35524123329378e-06 
0.168977200984955 -0.000218455636058934 2.5930008632713e-05 -2.86090721601795e-06 
0.16248793900013 -0.000196883760509081 3.41346676577814e-05 -2.88962951344729e-06 
0.155779376626015 -0.000178576723556034 4.70705635962076e-05 -3.01114505418809e-06 
0.148472309112549 -0.000147249113069847 5.47930721950252e-05 -2.67717359747621e-06 
0.141480043530464 -0.000119029449706431 6.4708037825767e-05 -3.36596554006974e-06 
0.134335771203041 -7.69047765061259e-05 7.16410359018482e-05 -5.39084703632398e-06 
0.12701603770256 -3.2293832191499e-05 8.1346370279789e-05 -6.74171315040439e-06 
0.119446322321892 7.0861656240595e-06 8.41940782265738e-05 -7.75331136537716e-06 
0.111881077289581 5.10044737893622e-05 9.11286915652454e-05 -7.80259051680332e-06 
0.104313045740128 9.86010127235204e-05 0.000101369951153174 -6.03313355895807e-06 
0.0965455397963524 0.00013996462803334 0.000108148771687411 -2.25167264034098e-06 
0.0883564278483391 0.000181101961061358 0.000115761125925928 5.55078088382288e-07 
0.0804939493536949 0.000224280272959732 0.00012354577484075 2.62807043327484e-06 
0.0726028606295586 0.000246438226895407 0.000130614644149318 4.7547000576742e-06 
0.0647422298789024 0.00026692810934037 0.000129679741803557 5.31138402948272e-06 
0.0570699945092201 0.000275116297416389 0.000131821259856224 6.84287851981935e-06 
0.0499909557402134 0.000283094879705459 0.000130345564684831 7.52013693272602e-06 
0.0430827662348747 0.000276978622423485 0.000125950376968831 8.25085044198204e-06 
0.0368427224457264 0.000273020763415843 0.000119653945148457 8.75880414241692e-06 
0.031107421964407 0.000257920008152723 0.000112985297164414 9.31462182052201e-06 
0.0259829387068748 0.000236393170780502 0.000103059857792687 8.42854660731973e-06 
0.0212733000516891 0.000206132724997588 9.14201300474815e-05 7.82570805313298e-06 
0.0171246211975813 0.000167954829521477 7.92878927313723e-05 7.243960226333e-06 
0.0134368995204568 0.000125026141176932 6.65829866193235e-05 6.93775746185565e-06 
0.0102191967889667 7.90115227573551e-05 5.45102557225619e-05 6.35883998256759e-06 
0.00753297796472907 3.71873175026849e-05 4.28875682700891e-05 5.73700572203961e-06 
0.00542627554386854 2.16421426557645e-07 3.39042780979071e-05 4.98175268148771e-06 
0.00381673988886178 -2.98834256682312e-05 2.66150727838976e-05 4.35645233665127e-06 
0.00257675931788981 -5.35878571099602e-05 2.06439090106869e-05 3.72832823813951e-06 
0.00165541702881455 -6.95320995873772e-05 1.58669827214908e-05 3.16055661642167e-06 
0.00100104243028909 -7.82693678047508e-05 1.22833353088936e-05 2.82483870250871e-06 
0.000557996216230094 -8.08854892966338e-05 9.16181124921422e-06 2.71802878160088e-06 
0.000242921887547709 -8.07707692729309e-05 6.82272093399661e-06 2.63072206507786e-06 
2.85616988549009e-05 -7.99862173153087e-05 4.77369485452073e-06 2.72839338322228e-06 
-0.000123805642942898 -7.87065364420414e-05 3.29622707795352e-06 2.85765781882219e-06 
-0.000236809602938592 -7.82661663834006e-05 2.04563048100681e-06 3.05461480820668e-06 
-0.000332960742525756 -7.82009010436013e-05 1.08745985016867e-06 3.13506438942568e-06 
-0.000410662847571075 -7.79414040152915e-05 1.84538336611695e-07 3.19154082717432e-06 
-0.000453670072602108 -7.71260893088765e-05 -4.05503016054354e-07 3.31346905113605e-06 
-0.000481256924103945 -7.52190899220295e-05 -9.62708213592123e-07 3.27592988469405e-06 
-0.000490483245812356 -7.2704569902271e-05 -1.28997874071501e-06 3.2168054531212e-06 
-0.000484552612761036 -6.98591684340499e-05 -1.67948337548296e-06 3.14469798468053e-06 
-0.000468628946691751 -6.66382838971913e-05 -1.75965749349416e-06 3.02485841530142e-06 
-0.000451846106443554 -6.26828841632232e-05 -1.82359121936315e-06 2.86647127722972e-06 
-0.000429444888141006 -5.93807599216234e-05 -1.85072690328525e-06 2.7760193006543e-06 
-0.000407758285291493 -5.57800885871984e-05 -1.88005515155965e-06 2.67718746727041e-06 
-0.000388046290026978 -5.26798503415193e-05 -1.80451036158047e-06 2.56175462709507e-06 
-0.000363834318704903 -5.00671776535455e-05 -1.77697449998959e-06 2.51420192398655e-06 
-0.000344914704328403 -4.76234090456273e-05 -1.85936346497328e-06 2.42365172198333e-06 
-0.000330652866978198 -4.59690199932083e-05 -1.93973960449512e-06 2.36324399338628e-06 
-0.000329524598782882 -4.45602017862257e-05 -1.95549660020333e-06 2.24684049499047e-06 
0 0 0 0 
0 0 0 0 
0 0 0 0 
0 0 0 0 
0 0 0 0 
0 0 0 0 
0 0 0 0 
0 0 0 0 
0 0 0 0 
0 0 0 0 
0 0 0 0 
0 0 0 0 
0 0 0 0 
0 0 0 0 
99.6234588623047 0.311467975378036 0.0558701455593109 0.00614894321188331 
