0 0 0 0 
0 0 0 0 
0 0 0 0 
0 0 0 0 
0 0 0 0 
0 0 0 0 
0 0 0 0 
0 0 0 0 
0 0 0 0 
0 0 0 0 
0.0321619994938374 4.75421948067378e-05 1.08846514024208e-08 1.94688585253289e-08 
0.0432760678231716 4.79912450828124e-05 -1.51618905874784e-07 -2.38043213585115e-07 
0.0511511862277985 4.66134661110118e-05 -3.26284173013391e-08 -1.55520627487249e-08 
0.0595782846212387 4.26967708335724e-05 2.10954837598365e-07 2.39854699657371e-07 
0.0696253478527069 3.36108860210516e-05 -2.0397835953645e-07 -1.78879933088183e-08 
0.0803960785269737 2.33457521972014e-05 2.60533880691582e-07 -1.61486909178166e-07 
0.0909916460514069 1.30875878312509e-05 -1.96937037344469e-07 2.20549267737624e-07 
0.101484857499599 2.31696435548656e-06 7.04938116768972e-08 -8.51778096944145e-08 
0.111189596354961 -3.74691330762289e-06 -4.71137573399005e-09 6.09816641627958e-09 
0.117959588766098 -5.95074970988207e-06 -1.86334792040554e-09 -7.89390686151137e-09 
0.122641876339912 -6.21439721726347e-06 -1.18524958736543e-08 3.61720142727506e-09 
0.126829221844673 -3.71993837688933e-06 1.86774040678017e-10 3.56569773707349e-09 
0.130461692810059 -3.00748979498167e-06 1.47047360954389e-08 -1.29472894627725e-08 
0.133718833327293 -3.09949473376037e-06 -1.06245918729542e-08 8.77118111475284e-09 
0.136819198727608 -3.61788966074528e-06 -1.54414281361426e-09 -3.11833692201446e-09 
0.13991867005825 -1.85951910225413e-06 -6.33984553743971e-09 2.25777152529361e-09 
0.143153980374336 -5.39168649993371e-06 -2.0276129664154e-09 -7.85655429602627e-11 
0.146414339542389 -2.89683248411166e-06 1.20539056513991e-09 2.12444883906926e-09 
0.149797588586807 -1.44005332458619e-06 -7.32901384026263e-09 -3.53559348464927e-10 
0.152536630630493 1.6520895087524e-06 -2.91786550477013e-09 2.73296119068789e-09 
0.154920116066933 2.93939638140728e-06 -2.4090445194247e-09 -2.25666707542871e-09 
0.156615704298019 7.59340446165879e-06 1.18682361716083e-08 -3.49960505019453e-09 
0.157961815595627 8.65198308019899e-06 1.00727728380434e-08 -6.23498053187177e-09 
0.159047216176987 1.0557280802459e-05 7.42949035625884e-10 7.16961823243878e-09 
0.160335630178452 1.10593691715621e-05 5.34068034241386e-09 5.36211919310858e-09 
0.161804124712944 1.13502446765779e-05 2.54839331859102e-08 1.01820161191313e-08 
0.163186281919479 1.01748310044059e-05 3.7683234310748e-09 1.50127501541419e-08 
0.164634734392166 9.6484727691859e-06 5.34460120604763e-09 1.49989141107199e-08 
0.165715798735619 9.71854115050519e-06 3.38021211021555e-09 5.88391424471979e-09 
0.166134193539619 7.97975826571928e-06 5.51182521846272e-09 1.04943109757727e-09 
0.165980443358421 6.08892833042773e-06 2.90801188684853e-10 3.87541154722726e-09 
0.165175437927246 4.4686557885143e-06 2.21072093964381e-09 6.66431532181377e-09 
0.163695514202118 4.90152524434961e-06 -2.3956681083348e-09 -6.15108541879295e-09 
0.161914646625519 2.08870255846705e-06 2.64786992332233e-09 1.54382764350203e-08 
0.159785836935043 2.49696972787206e-06 3.55572504773249e-09 -2.36984964985254e-09 
0.157443284988403 -6.77185823860782e-07 6.27176266476681e-09 -7.57284457364449e-09 
0.155088871717453 5.72433862089383e-07 3.73965214350847e-09 -6.97892232892627e-09 
0.15264955163002 -4.5886445150245e-06 -1.1933011023757e-08 9.55418499870575e-09 
0.149726703763008 -6.62152115182835e-06 -9.51558210005032e-09 -2.21829266067175e-09 
0.146829456090927 -1.02511094155489e-05 4.82615414298948e-09 -1.32360664650832e-08 
0.143667504191399 -8.8209180830745e-06 4.94996355016042e-09 -5.76339331814779e-09 
0.140227973461151 -1.37983024615096e-05 -1.20308589757201e-08 3.42782602302805e-09 
0.136351451277733 -1.38372533911024e-05 -3.82765419359998e-09 -1.85766302340795e-09 
0.131778344511986 -1.33948660732131e-05 -3.69692765289642e-09 -1.67950972573827e-10 
0.126655831933022 -1.33503581309924e-05 -7.05478253593128e-09 -1.03787396454891e-08 
0.121022246778011 -1.26247641674126e-05 -6.78218947669507e-09 -9.39351707529568e-09 
0.11537116765976 -9.07585035747616e-06 -3.58912677356216e-09 -1.16495755264623e-08 
0.109714090824127 -7.59827571528149e-06 1.6252692247587e-10 1.80868653387734e-09 
0.104277849197388 -4.70718396172742e-06 7.58366258679644e-09 -2.33264141336065e-09 
0.0988743081688881 -6.93276319907454e-07 2.44930320469905e-09 6.48258002833302e-10 
0.0936232134699821 6.04601439135877e-07 -1.82450143881852e-09 -7.87261367207748e-11 
0.0881626680493355 1.35667164613551e-06 -3.44382278250066e-09 -1.03148256602736e-09 
0.082771398127079 6.70268264002516e-07 7.18959752843418e-11 8.4258472421439e-10 
0.0775172710418701 -3.26181429954886e-06 -1.75695213933125e-09 2.43146569545161e-09 
0.0721525922417641 -5.20142521054368e-06 -6.01911231967733e-09 -7.5027561940999e-10 
0.0669486671686172 -6.3404836510017e-06 -1.87523152561653e-09 -1.84654613821778e-09 
0.0620737597346306 -7.38724020266091e-06 -3.45792422473679e-10 -4.68324223845684e-09 
0.0574356578290462 -6.5275407905574e-06 -3.09300141054791e-09 -7.87295473259064e-09 
0.0532809272408485 -5.7609295254224e-06 -2.16790230211927e-09 -1.64492919285664e-09 
0.0497624725103378 -7.1554673013452e-06 -3.73307917911347e-09 -2.62753996338461e-09 
0.0466057732701302 -6.95560311214649e-06 5.47075829082644e-10 -6.05257444163954e-09 
0.0438034757971764 -7.12928476787056e-06 -1.30875132953179e-09 -2.79766143584936e-09 
0.0414619408547878 -7.11106940798345e-06 -4.60911420141485e-10 6.00522520599611e-10 
0.0393578223884106 -5.68642280995846e-06 -3.60365626228543e-09 -3.3811204946943e-09 
0.0375163555145264 -5.70360089113819e-06 -4.98508523349983e-09 -3.41834893724524e-09 
0.0359367653727531 -6.71872749080649e-06 2.07036121580018e-09 -3.25179949633991e-09 
0.0345995873212814 -7.33195247448748e-06 -2.55476240162977e-09 -6.12827011359229e-10 
0.0332404561340809 -7.32130138203502e-06 -3.8077860864405e-09 -2.07231143356523e-09 
0.0320416018366814 -9.00419581739698e-06 -2.24543983406988e-09 -7.2602084344453e-09 
0.0308221019804478 -8.91256058821455e-06 -3.53740370329092e-09 -3.61640295487575e-09 
0.02968311868608 -8.98149664863013e-06 -3.3152152134619e-09 -3.78169140446971e-09 
0.0285664815455675 -9.05654724192573e-06 -3.19062598563846e-09 -5.35020205916226e-09 
0.0275446176528931 -9.42063343245536e-06 -3.07225911377884e-09 -4.63619231894086e-09 
0.0264469180256128 -9.73536043602508e-06 -1.5671202113765e-09 -4.39419567399568e-09 
0.0254767797887325 -9.18084788281703e-06 -2.12541451105608e-09 -2.80765988236453e-09 
0.0245062410831451 -9.95122900349088e-06 -2.65343724770162e-09 -4.83151607610921e-09 
0.0235943906009197 -1.04015407487168e-05 -3.56388252242823e-09 -4.50765780257711e-09 
0.0226301234215498 -1.11334420580533e-05 -3.34009087055165e-09 -4.61009941332691e-09 
0.0218312554061413 -1.06325614979141e-05 -3.73034225731317e-09 -2.78829648259205e-09 
0.0210575889796019 -1.1618359167187e-05 -6.00598060174207e-09 -5.67093039194333e-09 
0.0203943401575089 -9.75372586253798e-06 -3.27331672878017e-09 -4.68879335357997e-09 
0.0197666082531214 -8.69022369442973e-06 -3.37407413120161e-09 -4.64362104324323e-09 
0.0192793942987919 -7.55031851440435e-06 -1.9467303324916e-09 -3.56074436602682e-09 
0.0188370142132044 -7.57302495912882e-06 -2.82298584508567e-09 -2.97845170749156e-09 
0.0184100940823555 -7.22503455108381e-06 -2.72215006091869e-09 -3.28781157854507e-09 
0.0180004294961691 -7.58631585995317e-06 -1.75713099626051e-09 -3.2466320742941e-09 
0.0177307333797216 -7.34215109332581e-06 -2.67937183551226e-09 -4.09117895117106e-09 
0.0174352210015059 -7.53965241528931e-06 -1.34909716731357e-09 -3.52947049364616e-09 
0.017169788479805 -6.77015395922353e-06 -1.706103036625e-09 -2.30651298060991e-09 
0.0170098263770342 -6.12085841567023e-06 -2.56970511536281e-09 -2.36871389169835e-09 
0.0168192628771067 -5.9742565099441e-06 -2.04599559516794e-09 -2.37112796064309e-09 
0.0165941622108221 -6.7956334532937e-06 -1.41423417421294e-09 -3.33925775919397e-09 
0.0164029486477375 -6.64087656332413e-06 -2.17305551331037e-09 -3.54830231863446e-09 
0.0161785557866096 -7.45627903597779e-06 -2.20309614995529e-09 -2.52641907394491e-09 
0.0158506520092487 -8.2155893323943e-06 -2.84972645481218e-09 -3.8231782184539e-09 
0.0155239840969443 -8.61729040479986e-06 -3.47786044407883e-09 -3.83353970789813e-09 
0.0150713119655848 -8.44970236357767e-06 -3.98245481036952e-09 -4.70828531717871e-09 
0.0146536342799664 -8.53386336530093e-06 -3.06394598581505e-09 -3.75694408916161e-09 
0.0142348166555166 -8.46068360260688e-06 -3.21808357739428e-09 -2.1973844965828e-09 
0.013907234184444 -8.18369335320313e-06 -2.11211048650739e-09 -4.5311869811826e-09 
0.013603625819087 -7.9247738540289e-06 -2.688494316061e-09 -3.3870537485825e-09 
0.01338797993958 -7.56862073103548e-06 -2.26860041863119e-09 -2.37034858407981e-09 
0.0131823942065239 -7.48190586818964e-06 -2.25036078660423e-09 -1.88620941088402e-09 
0.012973484583199 -6.79272443449008e-06 -2.46200704268063e-09 -3.9828238485029e-09 
0.0127454269677401 -6.09125845585368e-06 -1.65062397083915e-09 -2.98582802926717e-09 
0.0124092027544975 -5.37679716217099e-06 -2.18766715853747e-09 -2.35009367521855e-09 
0.0120305987074971 -4.45625937572913e-06 -9.06808905742906e-10 -1.90719751103074e-09 
0.0116130840033293 -3.89560136682121e-06 -9.75479030884685e-10 -1.813509231674e-09 
0.0111262798309326 -3.19908099299937e-06 -7.8521777968632e-10 -1.83763426697681e-09 
0.0106025254353881 -3.06007245853834e-06 -1.90552254530907e-10 -1.74449221734818e-09 
0.0101515734568238 -3.01677187053428e-06 -9.98896854120801e-10 -1.4657961511233e-09 
0.00971549935638905 -3.40336282533826e-06 -1.50929058140292e-09 -1.85866233515242e-09 
0.00928409863263369 -3.38628956342291e-06 -1.99337280015754e-09 -1.31895316890507e-09 
0.00893146824091673 -3.34287483383378e-06 -9.6494834345151e-10 -1.56977753018595e-09 
0.00855939090251923 -3.24293819176091e-06 -1.00234687216982e-09 -1.48505419073075e-09 
0.00824040919542313 -3.02302191812487e-06 -7.86446741063429e-10 -6.16004469655707e-10 
0.00794532150030136 -2.53940152106225e-06 -5.53584622586811e-10 -6.70002719971308e-10 
0.00764496810734272 -2.57171177509008e-06 -1.03399599993281e-09 -6.27914609196978e-10 
0.00731534278020263 -2.36064647651801e-06 -1.38567168850301e-09 -3.35748956414861e-10 
0.00703566707670689 -1.79627579655062e-06 -2.45729353531843e-10 -1.29519450720039e-09 
0.0066727427765727 -1.66553718372597e-06 -7.58921148147351e-10 -2.33367436486276e-10 
0.00629939325153828 -1.80707661456836e-06 -4.28972191102162e-10 -1.52314805212939e-09 
0.00592099502682686 -1.6026324374252e-06 -6.16778406126173e-10 -8.33166091673831e-10 
0.00550621841102839 -1.48573496971949e-06 -8.76727024312629e-10 -7.52995221731112e-10 
0.0050461133942008 -1.71238593793532e-06 -5.49097989299696e-10 -1.00286956516982e-09 
0.00459815002977848 -1.46497643527255e-06 -5.34575772537238e-10 -3.08472414278782e-10 
0.00411614635959268 -1.27122882531694e-06 -3.11293935073564e-10 -4.28471369495753e-10 
0.0036283447407186 -9.67177015809284e-07 -1.91942864380401e-10 -4.63931587590949e-10 
0.00319027691148221 -1.04085381735786e-06 -3.04135189255206e-10 -6.32363938990466e-10 
0.00274337106384337 -8.76479987255152e-07 -2.61245386434794e-10 -4.43793474191878e-10 
0.0023353926371783 -9.58545001594757e-07 -1.9089085867563e-10 -4.90087304072517e-10 
0.00198799232020974 -9.03283932984777e-07 -3.44414358144363e-10 -5.49600642774095e-10 
0.00167012377642095 -1.23339566471259e-06 -4.00512678577769e-10 -7.11961878341327e-10 
0.00139871530700475 -1.58707314312778e-06 -6.27139007391975e-10 -6.19569284765475e-10 
0.00119719328358769 -1.75518368905614e-06 -6.17229323207624e-10 -7.75839503752707e-10 
0.00105400173924863 -1.97384861166938e-06 -6.93805957130422e-10 -8.48303260969629e-10 
0.000904776155948639 -2.01889247364306e-06 -6.94846014059891e-10 -9.83781167640529e-10 
0.000825127004645765 -1.94590893443092e-06 -6.44521880310833e-10 -8.99005980770085e-10 
0.000772480911109596 -1.80518804882013e-06 -6.2348060048123e-10 -8.03132116367067e-10 
0.000725397083442658 -2.01855982595589e-06 -6.53446408094283e-10 -9.39154420898092e-10 
0.000666869047563523 -2.47327966462763e-06 -8.19856293965415e-10 -1.10534292829811e-09 
0.000638171564787626 -2.76232390206133e-06 -9.81021597290521e-10 -1.21731713598194e-09 
0.00059038563631475 -2.87280568045389e-06 -9.935452460752e-10 -1.31614741327724e-09 
0.000560064741875976 -3.00744181913615e-06 -1.021213891228e-09 -1.37442823788803e-09 
0.000528557633515447 -2.94409892376279e-06 -1.00402919311904e-09 -1.32808020136821e-09 
0.000483877520309761 -2.35168158724264e-06 -8.07473587993712e-10 -1.1042015080065e-09 
0.000522123125847429 -1.78911398052151e-06 -6.22601026289971e-10 -8.32831859032268e-10 
0.000499556073918939 -2.16148737308686e-06 -7.41917804969461e-10 -9.92021131906995e-10 
0.000468530895886943 -1.89438696907018e-06 -6.57198184761398e-10 -8.66970162327618e-10 
0.000417668314184994 -1.90515913800482e-06 -6.66104837954151e-10 -8.85230722058594e-10 
0.00039615374407731 -2.07786138162191e-06 -7.40455974312937e-10 -9.3748619978129e-10 
0.000296738056931645 -2.67943892140465e-06 -9.10760855621362e-10 -1.1992360438029e-09 
0.000269716285401955 -2.39552969105716e-06 -8.28771551386609e-10 -1.08652453700842e-09 
0.00023074600903783 -2.70785017164599e-06 -9.3133167844428e-10 -1.2202184818122e-09 
0.000232099686400034 -2.43257750298653e-06 -8.21324230848575e-10 -1.10015851984002e-09 
0.000219951383769512 -2.25312351176399e-06 -7.61535279281134e-10 -1.00303620964581e-09 
0.000239513770793565 -1.81849975433579e-06 -6.19212792152268e-10 -8.21725687494279e-10 
0.00024909435887821 -1.57550653057115e-06 -5.29821853056944e-10 -7.01060764995987e-10 
0.000251854857197031 -1.21219659376948e-06 -4.20578821769269e-10 -5.44925937706608e-10 
0.000274909602012485 -1.28098633922491e-06 -4.50076836910895e-10 -5.68253444299671e-10 
0.000231015175813809 -1.27558087115176e-06 -4.4291464940116e-10 -5.75452852036307e-10 
0 0 0 0 
0 0 0 0 
0 0 0 0 
0 0 0 0 
0 0 0 0 
0 0 0 0 
0 0 0 0 
0 0 0 0 
0 0 0 0 
0 0 0 0 
0 0 0 0 
0 0 0 0 
0 0 0 0 
0 0 0 0 
99.9859008789063 0.0128166740760207 4.74051485070959e-05 4.47385209554341e-05 
