0 0 0 0 
0 0 0 0 
0 0 0 0 
0 0 0 0 
0 0 0 0 
0 0 0 0 
0 0 0 0 
0 0 0 0 
0 0 0 0 
0 0 0 0 
0.00539584830403328 -0.000129321968415752 6.81491246723454e-06 1.52873167280632e-06 
0.0067596142180264 -0.000151144951814786 1.39393323479453e-05 1.57439592385344e-06 
0.0078736525028944 -0.000170764717040583 2.21462578338105e-05 7.41520580049837e-07 
0.0089772567152977 -0.000191671075299382 2.95255740638822e-05 3.45925684541726e-07 
0.00996540393680334 -0.000209235920920037 3.84276499971747e-05 -7.02814588748879e-07 
0.0108187953010201 -0.000221216367208399 4.74381195090245e-05 -2.0207346551615e-06 
0.0115437246859074 -0.000228335527935997 5.34915525349788e-05 -2.77495200862177e-06 
0.0121502168476582 -0.000230170538998209 5.70106349186972e-05 -3.3230869576073e-06 
0.0126005681231618 -0.0002264897339046 5.78553554078098e-05 -4.03951435146155e-06 
0.0128881055861712 -0.000220609057578258 5.3136252972763e-05 -3.84768327421625e-06 
0.0129996091127396 -0.00021451544307638 4.49180733994581e-05 -3.37908613801119e-06 
0.0129806268960238 -0.000207271863473579 3.53483374055941e-05 -3.02019134323928e-06 
0.0128605496138334 -0.000199585745576769 2.44040493271314e-05 -2.51883056989755e-06 
0.0126076769083738 -0.00018990681564901 1.38964660436613e-05 -1.91351773537463e-06 
0.012254954315722 -0.000178682996192947 4.69408223580103e-06 -1.46845752624358e-06 
0.0118336100131273 -0.000166789279319346 -3.09143865706574e-06 -1.0040031384051e-06 
0.011367442086339 -0.000155033412738703 -9.13767235033447e-06 -5.2390072369235e-07 
0.0108572905883193 -0.000142824690556154 -1.34320343931904e-05 -2.95101301617251e-07 
0.0103330910205841 -0.000131523469462991 -1.67674897966208e-05 4.56600126597095e-08 
0.00980324577540159 -0.000120867975056171 -1.89178535947576e-05 2.99117232316348e-07 
0.00927208922803402 -0.000110812565253582 -2.03068520931993e-05 4.13873721072378e-07 
0.00875497423112392 -0.000102022007922642 -2.11771894100821e-05 4.38382045331309e-07 
0.00826271437108517 -9.47783846640959e-05 -2.16272856050637e-05 6.60101022731396e-07 
0.00778494402766228 -8.92440802999772e-05 -2.20111105591059e-05 7.18627802598348e-07 
0.00728838378563523 -8.49492789711803e-05 -2.26157462748233e-05 8.80760694599303e-07 
0.00677152443677187 -7.9731507867109e-05 -2.3181528376881e-05 1.046267698257e-06 
0.00628934614360332 -7.3243078077212e-05 -2.33557948376983e-05 1.18430784823431e-06 
0.00585226574912667 -6.56487827654928e-05 -2.30417190323351e-05 1.15693035240838e-06 
0.00548394676297903 -5.67774150113109e-05 -2.2419095330406e-05 1.12430382159801e-06 
0.00521971704438329 -4.74373919132631e-05 -2.12656359508401e-05 1.07299945284467e-06 
0.00505885388702154 -3.94399394281209e-05 -2.03401887119981e-05 1.03424986264145e-06 
0.00494672730565071 -3.2312840630766e-05 -1.95846914721187e-05 9.80198933575593e-07 
0.00487726833671331 -2.61330733337672e-05 -1.91080907825381e-05 9.86810505310132e-07 
0.00485729007050395 -2.03383679036051e-05 -1.88657577382401e-05 1.00008230674575e-06 
0.0049012778326869 -1.46252996273688e-05 -1.87341338460101e-05 9.72800876297697e-07 
0.00502464128658175 -8.89495277078822e-06 -1.86993238457944e-05 9.17424131330336e-07 
0.00521779945120215 -3.8122843761812e-06 -1.86797769856639e-05 8.80010247783503e-07 
0.00545732490718365 8.27213398224558e-07 -1.86983379535377e-05 8.17430986899126e-07 
0.00572405429556966 5.26147641721764e-06 -1.8756783902063e-05 7.00028977007605e-07 
0.00601767608895898 9.34563558985246e-06 -1.88470075954683e-05 5.91329296639742e-07 
0.00628985138610005 1.22834180729114e-05 -1.90366936294595e-05 4.63127690863985e-07 
0.00652336468920112 1.48945555338287e-05 -1.93024025065824e-05 4.14858305930466e-07 
0.00671576056629419 1.73443113453686e-05 -1.95166867342778e-05 2.77750217492212e-07 
0.006877560634166 2.05037831619848e-05 -1.9518058252288e-05 2.06217421805377e-07 
0.00699639040976763 2.38408883888042e-05 -1.93447995116003e-05 1.14686670826813e-07 
0.00709168333560228 2.87171715172008e-05 -1.91155868378701e-05 6.89771013639984e-08 
0.00717689050361514 3.44773980032187e-05 -1.86711713467957e-05 -5.55846710881269e-08 
0.00726509233936667 4.1788378439378e-05 -1.8039178030449e-05 -1.38086264200865e-07 
0.0073603754863143 4.950169386575e-05 -1.74989090737654e-05 -2.00744352696347e-07 
0.00747069576755166 5.82020729780197e-05 -1.71544488694053e-05 -2.84292411834031e-07 
0.00760809192433953 6.75007540849037e-05 -1.64819321071263e-05 -3.8700699178662e-07 
0.00777858030050993 7.69203834352084e-05 -1.61325897352071e-05 -4.8055630941235e-07 
0.00799129530787468 8.66031114128418e-05 -1.59844239533413e-05 -5.85016550758155e-07 
0.0082625225186348 9.70234541455284e-05 -1.59581650223117e-05 -7.73093461248209e-07 
0.00861690286546946 0.000108112937596161 -1.61730677064043e-05 -8.20395996470324e-07 
0.00906720943748951 0.000120422315376345 -1.6647856682539e-05 -9.39011670197942e-07 
0.00961168948560953 0.000134417743538506 -1.70652710949071e-05 -1.01644207006757e-06 
0.010244345292449 0.000149181461893022 -1.77541423909133e-05 -1.08068365989311e-06 
0.0109346397221088 0.000163267599418759 -1.87361056305235e-05 -1.07785706404684e-06 
0.0116465073078871 0.000177033405634575 -1.95407919818535e-05 -1.1295765034447e-06 
0.0123666636645794 0.000190994775039144 -2.04726657102583e-05 -1.04360151453875e-06 
0.0130211785435677 0.000201748378458433 -2.15331128856633e-05 -1.14869851586263e-06 
0.0135700469836593 0.000211005273740739 -2.2171849195729e-05 -1.21943196518259e-06 
0.0139332721009851 0.00021573735284619 -2.19548091990873e-05 -1.13363000764366e-06 
0.0140536315739155 0.000216387998079881 -2.20988640649011e-05 -9.94777337837149e-07 
0.0139046218246222 0.00021133445261512 -2.15516229218338e-05 -1.03095965187094e-06 
0.0135466558858752 0.000203284478629939 -2.05044216272654e-05 -9.08413653633033e-07 
0.0130009390413761 0.000190524107892998 -1.97169720195234e-05 -6.80863195157144e-07 
0.0123931327834725 0.000177994734258391 -1.89562870218651e-05 -7.82049880854174e-07 
0.0117964530363679 0.000165038640261628 -1.77528963831719e-05 -8.75603291206062e-07 
0.0112616075202823 0.000152796317706816 -1.60340205184184e-05 -9.64310402196134e-07 
0.0108358254656196 0.000142151169711724 -1.50106870933087e-05 -9.79498167907877e-07 
0.0105350539088249 0.000133273410028778 -1.39343601404107e-05 -1.0728783763625e-06 
0.0103497821837664 0.00012639608758036 -1.3293577467266e-05 -9.67955202213489e-07 
0.0102925803512335 0.000121751218102872 -1.2214683010825e-05 -1.11648830625199e-06 
0.0103316185995936 0.000118044015835039 -1.2300323760428e-05 -1.10764949567965e-06 
0.010417184792459 0.000115104703581892 -1.23133740999037e-05 -1.11894155452319e-06 
0.0105749368667603 0.000113336187496316 -1.2016963410133e-05 -1.23108225125179e-06 
0.0107759367674589 0.000112754467409104 -1.2166394299129e-05 -1.37501808694651e-06 
0.0110114375129342 0.000112491674371995 -1.23730715131387e-05 -1.37659344545682e-06 
0.0112856533378363 0.000114483067591209 -1.28392512124265e-05 -1.67339135259681e-06 
0.0116611383855343 0.000120658885862213 -1.30734806589317e-05 -2.01025318347092e-06 
0.0121800135821104 0.000131297565530986 -1.35292702907464e-05 -2.14547776522522e-06 
0.0130305783823133 0.000151210886542685 -1.34112915475271e-05 -2.32209822570439e-06 
0.0146002937108278 0.000186015517101623 -1.40001693580416e-05 -3.09096390083141e-06 
0.0176397785544395 0.000245122879277915 -1.42513263199362e-05 -4.08653113481705e-06 
0.0231809038668871 0.000333280011545867 -1.63251497724559e-05 -5.74136856812402e-06 
0.0324958935379982 0.000436815520515665 -2.32259535550838e-05 -7.67226356401807e-06 
0.0466036349534988 0.000534383812919259 -3.46331180480774e-05 -1.00852930700057e-05 
0.0659729242324829 0.000613457872532308 -4.23792771471199e-05 -1.15282728074817e-05 
0.0897457003593445 0.000643022125586867 -5.35803665115964e-05 -1.0409240530862e-05 
0.115484930574894 0.00060883373953402 -7.19240197213367e-05 -8.05768195277778e-06 
0.140988141298294 0.000525011622812599 -8.97485078894533e-05 -2.46074455390044e-06 
0.163855448365211 0.000419933930970728 -9.26404100027867e-05 3.99233840653324e-06 
0.182207569479942 0.000287871866021305 -0.000113929032522719 1.13065734694828e-05 
0.19474034011364 0.000169078193721361 -0.000128936459077522 1.49618999785162e-05 
0.202955424785614 6.36678887531161e-05 -0.000134327710838988 2.08535529964138e-05 
0.20740370452404 -1.37457000164432e-05 -0.000137267386890016 1.87647474376718e-05 
0.208899259567261 -6.77321659168229e-05 -0.000132592598674819 1.44821206049528e-05 
0.208387896418571 -8.58604253153317e-05 -0.000114938418846577 1.11558983917348e-05 
0.207130208611488 -0.000112763511424419 -0.000106354535091668 8.18298030935694e-06 
0.20476046204567 -0.000135446680360474 -9.9111937743146e-05 4.42141890744097e-06 
0.201495096087456 -0.000144988880492747 -8.73860335559584e-05 1.6961934079518e-06 
0.198026567697525 -0.000177144785993733 -8.17443215055391e-05 4.4421876737033e-06 
0.19416968524456 -0.000205510092200711 -7.97557586338371e-05 2.66365759671316e-06 
0.190240234136581 -0.000213946856092662 -6.97649011272006e-05 -1.06422100998316e-06 
0.186471119523048 -0.000212893472053111 -5.5402753787348e-05 -5.08543644173187e-06 
0.182625085115433 -0.000211858714465052 -3.96546929550823e-05 -5.13375289301621e-06 
0.178790658712387 -0.00019929934933316 -2.88348255708115e-05 -1.05475173768355e-05 
0.174478814005852 -0.000193340354599059 -1.28989659060608e-05 -1.20291369967163e-05 
0.16996705532074 -0.000190135528100654 8.93609740160173e-06 -1.00322067737579e-05 
0.165321066975594 -0.0001874640583992 2.33353075600462e-05 -9.07851699594175e-06 
0.160526692867279 -0.000185536860954016 4.41283918917179e-05 -6.93886704539182e-06 
0.155037343502045 -0.000171594641869888 5.69434159842785e-05 -5.1679162424989e-06 
0.149830967187881 -0.000157484304509126 7.51479165046476e-05 -5.44280010217335e-06 
0.144275665283203 -0.000129503983771428 8.93412361619994e-05 -7.21986316420953e-06 
0.138550266623497 -0.000101526587968692 0.000109870779851917 -8.5783258327865e-06 
0.132523521780968 -7.78373796492815e-05 0.000118907628348097 -1.11639810711495e-05 
0.126449182629585 -5.1239909225842e-05 0.000132022993057035 -1.30787339003291e-05 
0.120351523160934 -2.3337244783761e-05 0.000147156373714097 -1.22553365144995e-05 
0.114152893424034 -2.2695721781929e-06 0.000156512571265921 -1.05133876786567e-05 
0.107350796461105 2.295484955539e-05 0.000167905833222903 -9.42535552894697e-06 
0.100868403911591 5.40414439456072e-05 0.000184516291483305 -8.3646636994672e-06 
0.0943085551261902 7.08393345121294e-05 0.000202478040591814 -5.87603926760494e-06 
0.0876012369990349 9.22654508030973e-05 0.000211171296541579 -5.45728835277259e-06 
0.0807947069406509 0.000107704203401227 0.000225110197789036 -1.97504573407059e-06 
0.0743327587842941 0.00012676531332545 0.000234912047744729 6.9485230369537e-07 
0.0675925761461258 0.000137052498757839 0.000239287241129205 3.63776575795782e-06 
0.0611091516911983 0.000152264386997558 0.000241693880525418 6.23964297119528e-06 
0.0547001510858536 0.000158715396537445 0.00024438533000648 9.53143353399355e-06 
0.0485453456640244 0.000160665513249114 0.000244021895923652 1.02113890534383e-05 
0.0423468500375748 0.000156606940436177 0.000236735082580708 1.15519133032649e-05 
0.0364702120423317 0.000147454396937974 0.00022661397815682 1.24195867101662e-05 
0.0308558698743582 0.0001351820101263 0.000211103862966411 1.35339259941247e-05 
0.0255864299833775 0.000117472227429971 0.00019336496188771 1.36600820042077e-05 
0.0208026189357042 9.95050868368708e-05 0.000170990693732165 1.3141054296284e-05 
0.0167090054601431 7.87001335993409e-05 0.00015215556777548 1.19950009320746e-05 
0.0132191898301244 5.66221096960362e-05 0.00013221510744188 1.08262920548441e-05 
0.0102294376119971 3.27366433339193e-05 0.00011196263221791 9.39592428039759e-06 
0.00774920731782913 1.21096190923708e-05 9.26613065530546e-05 7.81977360020392e-06 
0.0057356208562851 -5.29143562744139e-06 7.52111955080181e-05 6.49302637611981e-06 
0.00415094848722219 -1.78024238266516e-05 5.81249332753941e-05 5.37800542588229e-06 
0.00293040624819696 -2.75576439889846e-05 4.46575686510187e-05 4.27383884016308e-06 
0.00203092652373016 -3.34540236508474e-05 3.29187641909812e-05 3.4468303056201e-06 
0.00136488792486489 -3.75582130800467e-05 2.35816205531592e-05 2.76676269095333e-06 
0.000897160382010043 -3.94635389966425e-05 1.62002888828283e-05 2.28183580475161e-06 
0.000563712092116475 -4.02847763325553e-05 1.09133470687084e-05 1.84978057404805e-06 
0.000327762420056388 -4.03751873818692e-05 6.70405506753013e-06 1.56316161792347e-06 
0.000168457612744533 -4.00914104830008e-05 3.51342077919981e-06 1.41650468776788e-06 
5.9512512962101e-05 -3.8832331483718e-05 1.28919293729268e-06 1.2429736671038e-06 
-7.59930162530509e-06 -3.73235416191164e-05 -3.08959613448678e-07 1.16250942028273e-06 
-5.20234279974829e-05 -3.5749970265897e-05 -1.49090908507787e-06 1.07605933408195e-06 
-7.43794516893104e-05 -3.37966885126662e-05 -2.11236397262837e-06 9.94539050225285e-07 
-8.9956316514872e-05 -3.16476653097197e-05 -2.51986466537346e-06 9.13190319806745e-07 
-9.16291173780337e-05 -2.9884429750382e-05 -2.91348078462761e-06 9.18351474865631e-07 
-9.64560749707744e-05 -2.81018637906527e-05 -3.11007215714199e-06 8.68233371420501e-07 
-9.57427109824494e-05 -2.63878828263842e-05 -3.1929530450725e-06 8.47875696763367e-07 
-9.38212979235686e-05 -2.49428048846312e-05 -3.28029909724137e-06 8.38533878777525e-07 
-9.1853471531067e-05 -2.3718319425825e-05 -3.41695931638242e-06 8.15921282537602e-07 
-9.21574392123148e-05 -2.27919845201541e-05 -3.45185821970517e-06 7.6846185947943e-07 
-9.80608965619467e-05 -2.19228204514366e-05 -3.40928409059416e-06 7.149607199608e-07 
0 0 0 0 
0 0 0 0 
0 0 0 0 
0 0 0 0 
0 0 0 0 
0 0 0 0 
0 0 0 0 
0 0 0 0 
0 0 0 0 
0 0 0 0 
0 0 0 0 
0 0 0 0 
0 0 0 0 
0 0 0 0 
99.6656112670898 0.218386590480804 0.105437494814396 0.00735777709633112 
