0 0 0 0 
0 0 0 0 
0 0 0 0 
0 0 0 0 
0 0 0 0 
0 0 0 0 
0 0 0 0 
0 0 0 0 
0 0 0 0 
0 0 0 0 
-0.000399279408156872 -1.0914330914602e-06 1.44762896070461e-06 -6.30116062438901e-07 
-0.000343417486874387 -1.18330501663877e-06 1.45112903737754e-06 -6.33234492397605e-07 
-0.000267970259301364 -1.64088658038963e-06 1.63099741712358e-06 -7.54428640448168e-07 
-9.23724001040682e-05 -2.10970347325201e-06 1.88970091130614e-06 -8.92880393621454e-07 
0.000331651623127982 -2.556010031185e-06 2.22892435886024e-06 -1.01842681488051e-06 
0.000940702622756362 -2.74305693892529e-06 2.4356759240618e-06 -1.06259301446698e-06 
0.00159904616884887 -2.6330365017202e-06 2.52036306847003e-06 -1.03587126432103e-06 
0.00222247047349811 -2.24735185838654e-06 2.42896157942596e-06 -9.39097844820935e-07 
0.00268855202011764 -1.72273280441004e-06 2.19294906855794e-06 -7.62535762532934e-07 
0.00283944141119719 -1.19338039894501e-06 1.84493603683222e-06 -5.87381691730116e-07 
0.00273690302856266 -8.52278162710718e-07 1.59670764787734e-06 -4.80126573165762e-07 
0.00253349030390382 -7.40395876164257e-07 1.43053102874546e-06 -4.13308299584969e-07 
0.00231539877131581 -7.31842817458528e-07 1.32936440877529e-06 -3.82659663955565e-07 
0.0021411320194602 -7.39066592814197e-07 1.24026189496362e-06 -3.56952682523115e-07 
0.00204585050232708 -7.7002914622426e-07 1.23104086924286e-06 -3.28775740854326e-07 
0.00203763856552541 -8.19767819848494e-07 1.22972448934888e-06 -2.97081442113267e-07 
0.00211270106956363 -8.15113935459522e-07 1.25850931453897e-06 -2.85674303768246e-07 
0.00225511542521417 -8.07873107078194e-07 1.3021693803239e-06 -2.6039779754683e-07 
0.00243511842563748 -7.72012356264895e-07 1.34628578507545e-06 -2.22731387111708e-07 
0.00261755287647247 -7.40448456326703e-07 1.34429114950763e-06 -2.00782054093906e-07 
0.0027750707231462 -6.77076229749218e-07 1.36093126457126e-06 -1.93961952277277e-07 
0.0028773823287338 -6.46277328542055e-07 1.35730715555837e-06 -1.72350596017168e-07 
0.002904909895733 -6.31190516742208e-07 1.35528500777582e-06 -1.67352652624686e-07 
0.00284187868237495 -6.80012249176798e-07 1.42731187224854e-06 -2.17313015582477e-07 
0.00270346691831946 -7.47895740005333e-07 1.58971818109421e-06 -2.68283741888808e-07 
0.00257019372656941 -8.43741872813553e-07 1.72935551745468e-06 -3.00595331736986e-07 
0.00252224062569439 -8.52831249176234e-07 1.83219765403919e-06 -2.96926003784392e-07 
0.00261255167424679 -8.37975562717475e-07 1.93268124348833e-06 -2.50254487355051e-07 
0.00290761538781226 -7.40441862490115e-07 2.06304957828252e-06 -1.45369554616082e-07 
0.00349228316918015 -6.04690910677164e-07 2.25137523557351e-06 8.29749513542311e-09 
0.00443601841107011 -5.09866652009805e-07 2.58245245277067e-06 1.70141575495109e-07 
0.00586887262761593 -5.33594175067265e-07 3.15822489938e-06 3.771631327254e-07 
0.00801253970712423 -6.56074405469553e-07 3.99723239752348e-06 5.42813722859137e-07 
0.0111525189131498 -8.8789875007933e-07 5.01154272569693e-06 7.14349027930439e-07 
0.0155022470280528 -1.43300690069736e-06 6.10650022281334e-06 8.78740081589058e-07 
0.0212697628885508 -1.96404835151043e-06 7.03350951880566e-06 1.09421068827942e-06 
0.0285123102366924 -2.98285499411577e-06 7.72083785705036e-06 1.25566168662772e-06 
0.037005640566349 -3.93410300603136e-06 7.52208734411397e-06 1.43261354423885e-06 
0.0463361963629723 -5.03494993608911e-06 6.97232053425978e-06 1.54983183620061e-06 
0.0561140775680542 -5.76458705836558e-06 5.95726214669412e-06 1.25223562008614e-06 
0.0655590295791626 -6.43711928205448e-06 4.38282995673944e-06 9.93263256532373e-07 
0.0742368698120117 -5.64869833397097e-06 2.49458025791682e-06 8.6793056652823e-07 
0.0821457579731941 -5.55967199034058e-06 7.75966952915041e-07 6.48974321393325e-07 
0.0890338942408562 -5.05487059854204e-06 -7.10963661276764e-07 4.56437561524581e-07 
0.0948811769485474 -5.60227044843487e-06 -2.28336307372956e-06 5.59052068638266e-07 
0.0998236238956451 -5.68330779060489e-06 -2.88809405901702e-06 1.32001602537457e-07 
0.104085110127926 -5.64000765734818e-06 -4.26026417699177e-06 9.15903086706749e-08 
0.107689000666142 -5.46514047528035e-06 -4.84298288938589e-06 1.2896143175567e-07 
0.110747314989567 -4.99161205880227e-06 -5.71088230572059e-06 -2.15162657468682e-07 
0.113380253314972 -3.60457602255337e-06 -5.16149839313584e-06 -2.74597539373644e-07 
0.115879558026791 -3.20791082231153e-06 -5.44762770005036e-06 1.62022317340416e-07 
0.118227139115334 -3.99442751586321e-06 -4.53541906608734e-06 -7.17068218136774e-08 
0.12013877928257 -4.39137829744141e-06 -4.06260096497135e-06 2.12032020385777e-07 
0.121906444430351 -3.98422025682521e-06 -2.66386700786825e-06 5.90602439842769e-07 
0.123332604765892 -4.06080926040886e-06 -1.75880313690868e-06 8.82245558386785e-07 
0.124384850263596 -3.42585758517089e-06 -4.91045966555248e-07 9.65612343861721e-07 
0.125049650669098 -2.71451949629409e-06 6.28688155757118e-07 1.45239164339728e-06 
0.125401243567467 -1.88563114988938e-06 2.32127149502048e-06 1.21727873647615e-06 
0.125572741031647 -2.26030488192919e-06 2.83989538729656e-06 1.09200561837497e-06 
0.125792354345322 -1.74695696841809e-06 3.46193610312184e-06 1.30398109376983e-06 
0.12598180770874 -6.36709557966242e-07 3.52672532244469e-06 2.02047476705047e-06 
0.126361161470413 1.91340390642836e-07 3.88485250368831e-06 2.07109269467765e-06 
0.126948729157448 1.55370446464076e-06 1.96421910914069e-06 2.53828011409496e-06 
0.12739072740078 2.07133143703686e-06 2.19034382098471e-06 3.31849696522113e-06 
0.127894520759583 2.57208967013867e-06 8.45514193770214e-07 3.32898980559548e-06 
0.128344014286995 2.89126933239459e-06 -6.73414547236462e-07 1.94178483070573e-06 
0.128549799323082 4.13216093875235e-06 -3.08030098494783e-06 1.76230560100521e-06 
0.128671810030937 4.39179666500422e-06 -3.46988440469431e-06 7.76226784182654e-07 
0.128421738743782 5.49038850294892e-06 -6.13581687503029e-06 -3.60541150712379e-07 
0.127984642982483 3.91011690226151e-06 -7.16403519618325e-06 -1.24831740322406e-06 
0.127053037285805 3.6650089896284e-06 -5.72719318370218e-06 -6.69570056288649e-07 
0.126298874616623 1.35736468109826e-06 -3.87405998480972e-06 -7.29957264411496e-07 
0.125286087393761 -1.11960923732113e-06 -1.67887094448815e-06 -1.24996120121068e-07 
0.124814994633198 -3.45662124345836e-06 8.96287474461133e-07 6.62221566471999e-07 
0.124368406832218 -4.5417823457683e-06 1.44517855460435e-06 7.5350044426159e-07 
0.124338790774345 -6.22389779891819e-06 1.84635439381964e-06 1.04826119695645e-06 
0.123837888240814 -5.38391532245441e-06 3.39867165166652e-06 1.37773952246789e-06 
0.123572945594788 -4.00734461436514e-06 2.49420986619953e-06 1.88262583833421e-06 
0.122865438461304 -2.47156663135684e-06 1.55228951825848e-06 1.80467736754508e-06 
0.121853657066822 -6.69573523737199e-07 3.03322758554714e-06 3.23557469528168e-06 
0.120886318385601 9.69506686487875e-07 1.82904784651328e-06 3.05230378216947e-06 
0.119905471801758 6.67914662244584e-07 9.08501817775687e-07 2.63543597611715e-06 
0.118705607950687 1.13420537672937e-06 4.39571294919006e-07 1.79039852810092e-06 
0.11767091602087 -6.55142926575536e-08 4.00091870744745e-08 1.67156792940659e-06 
0.116648301482201 7.6303098239805e-07 -2.40906206272484e-06 -1.73715307028033e-07 
0.115508899092674 1.28331123505632e-08 -2.7804219371319e-06 -1.04782941434678e-06 
0.114488609135151 8.54480006751146e-08 -3.8069908896432e-06 -1.65571600518888e-06 
0.113783173263073 3.52829573557756e-07 -4.87023953610333e-06 -2.3153788788477e-06 
0.113100908696651 7.90666092598258e-07 -4.88896830574959e-06 -2.9067948617012e-06 
0.112598523497581 1.71804356341454e-06 -3.93565642298199e-06 -2.7728535769711e-06 
0.112073920667171 3.60401236321195e-06 -3.78839854420221e-06 -2.39410883295932e-06 
0.111764714121819 5.02044031236437e-06 -4.93714560434455e-06 -1.42382691592502e-06 
0.111296407878399 4.39390942119644e-06 -3.66397193829471e-06 -9.7474026006239e-07 
0.110594294965267 5.71079817746067e-06 -3.89132219424937e-06 -7.93652588981786e-07 
0.109628967940807 4.57415990240406e-06 -3.71134842680476e-06 -6.01838394231891e-07 
0.108478508889675 2.35998800235393e-06 -3.18218076245103e-06 -8.18201101537852e-07 
0.106803126633167 2.31919580073736e-06 -1.98364818970731e-06 -1.58206739797606e-06 
0.104696325957775 1.63806498676422e-06 -1.99786950361158e-06 -1.75199909335788e-06 
0.102640070021152 5.87138742957904e-07 -1.55790303324466e-06 -2.23307688429486e-06 
0.100391112267971 2.12560991030841e-07 2.36326783920049e-07 -1.72362604189402e-06 
0.0982484519481659 -1.10856024093664e-06 1.09996534547463e-07 -1.86852423667005e-06 
0.0962492227554321 -3.06317701870285e-06 4.80036533190287e-07 -1.89051218058012e-06 
0.0945097580552101 -3.93443997381837e-06 7.30790816305671e-07 -1.07697621842817e-06 
0.0928525030612946 -4.73167165182531e-06 1.58003854267008e-06 -4.68417965748813e-07 
0.0914560258388519 -4.81065126223257e-06 1.72173002965792e-07 -3.22353571391432e-07 
0.0901492089033127 -3.6575684134732e-06 7.58338160267158e-07 3.71082478523022e-07 
0.088883250951767 -2.54658311860112e-06 6.99451277341723e-07 5.81711674385588e-07 
0.0876467451453209 -8.88034378476732e-07 2.51936853601364e-06 -3.46559829722537e-07 
0.0861522480845451 1.61733305503731e-06 2.74560898105847e-06 -6.968906518523e-07 
0.0846520215272903 2.56496605288703e-06 4.24126255893498e-06 -1.45740557400131e-06 
0.0831079334020615 4.85563714391901e-06 4.86166845803382e-06 -1.59254477694049e-06 
0.0813013911247253 5.22272330272244e-06 4.7196886043821e-06 -1.79846119863214e-06 
0.0791355818510056 5.74506066186586e-06 3.69317945114744e-06 -1.87428543085844e-06 
0.0771470665931702 5.22730260854587e-06 4.44069564764504e-06 -1.96917017092346e-06 
0.0749142840504646 5.91338448430179e-06 3.82344842364546e-06 -1.87096566151013e-06 
0.0724513828754425 5.35143908564351e-06 3.32614126818953e-06 -1.8039308997686e-06 
0.0702006593346596 5.09397887071827e-06 3.33406615027343e-06 -1.64061850682629e-06 
0.0681096613407135 4.53171014669351e-06 3.28414739669824e-06 -1.33208766328607e-06 
0.0659823343157768 4.07330799134797e-06 2.06274739866785e-06 -1.33074104269326e-06 
0.0638855844736099 3.012714387296e-06 1.86282863978704e-06 -1.46623460750561e-06 
0.0617759339511395 2.59577564065694e-06 2.02578235075634e-06 -1.84624082066875e-06 
0.0597495622932911 1.97738495444355e-06 2.05703599931439e-06 -2.15355044019816e-06 
0.0576854050159454 1.40385225222417e-06 2.63696529145818e-06 -2.27267514674168e-06 
0.0557169914245605 4.8836233190741e-07 2.83043982562958e-06 -1.87585453659267e-06 
0.0539022199809551 1.13497563347664e-07 3.47891500496189e-06 -1.60530555604055e-06 
0.0522255226969719 -1.12465716028964e-06 4.20618562202435e-06 -1.5628756955266e-06 
0.0504774823784828 -1.24960172342981e-06 5.47249192095478e-06 -1.27003465877351e-06 
0.0488274544477463 -9.69781353887811e-07 5.92030119150877e-06 -1.02421086012328e-06 
0.0471304692327976 -9.58047849053401e-07 6.83125199429924e-06 -1.15252294108359e-06 
0.0453730262815952 -8.22716913262411e-07 6.75519368087407e-06 -9.66684410741436e-07 
0.0437237285077572 -7.967155966071e-07 6.68657821734087e-06 -9.55814130065846e-07 
0.0420444160699844 -1.44632269893918e-06 6.72036958349054e-06 -1.35210996177193e-06 
0.0403361432254314 -1.24632310871675e-06 5.94997891312232e-06 -1.5214384347928e-06 
0.0384749583899975 -3.64212269232667e-07 5.59625641471939e-06 -1.76157482201234e-06 
0.0365911088883877 1.20427739602746e-06 5.23868311574915e-06 -2.05951801035553e-06 
0.0344981178641319 3.72804970538709e-06 4.25083317168173e-06 -1.76444825683575e-06 
0.0323272570967674 7.18402225174941e-06 3.08809603666305e-06 -1.10507107820013e-06 
0.0299060884863138 1.04921227830346e-05 2.45364367401635e-06 -3.96083919440571e-07 
0.0273286439478397 1.42459348353441e-05 1.54172323618695e-06 4.78417064186942e-07 
0.0244789216667414 1.72650597960455e-05 6.52763901598519e-07 1.23240329230612e-06 
0.0213936343789101 2.05482392630074e-05 3.38633270757782e-07 1.69002487382386e-06 
0.0181004609912634 2.26741085498361e-05 1.89312544307541e-07 1.86860143003287e-06 
0.0148422066122293 2.35769202845404e-05 1.95681792547475e-07 1.72523391483992e-06 
0.0117162438109517 2.27277923841029e-05 4.51134468448799e-07 1.33484763864544e-06 
0.00889485701918602 2.07745160878403e-05 8.75928776622459e-07 9.29652856029861e-07 
0.00646262755617499 1.71577248693211e-05 1.15213526896696e-06 4.97865244142304e-07 
0.00449585635215044 1.36074768306571e-05 1.48974595504114e-06 7.22549842180342e-08 
0.00297444453462958 1.00423085314105e-05 1.66974700732681e-06 -2.79192050811616e-07 
0.00184234988410026 6.98421081324341e-06 1.87667387763213e-06 -4.70460264523354e-07 
0.00103291275445372 4.57217765870155e-06 1.95399570657173e-06 -5.82609516186494e-07 
0.000484295393107459 2.88597357211984e-06 1.99151554625132e-06 -6.65154686885217e-07 
0.000117330477223732 1.72935779119143e-06 1.9584792880778e-06 -6.96478650752397e-07 
-0.000116661874926649 9.91092633739754e-07 1.91355934475723e-06 -7.0512533056899e-07 
-0.000266911403741688 5.0200696932734e-07 1.85774422334362e-06 -6.92701405569096e-07 
-0.000359187863068655 1.73898783373261e-07 1.75900311205623e-06 -6.73729459776951e-07 
-0.000418759911553934 -3.27641949127155e-08 1.7023326108756e-06 -6.35460537523613e-07 
-0.000455863279057667 -1.93257974956396e-07 1.64401626534527e-06 -6.11145480888808e-07 
-0.000480873975902796 -3.04457927313706e-07 1.57513295562239e-06 -5.91809850902791e-07 
-0.000499810790643096 -3.76494767806435e-07 1.52287657328998e-06 -5.78543506435381e-07 
-0.000509960285853595 -4.26043044399194e-07 1.46993420457875e-06 -5.62452100894006e-07 
-0.000517853128258139 -4.50464739287781e-07 1.42450244311476e-06 -5.53103632228158e-07 
0 0 0 0 
0 0 0 0 
0 0 0 0 
0 0 0 0 
0 0 0 0 
0 0 0 0 
0 0 0 0 
0 0 0 0 
0 0 0 0 
0 0 0 0 
0 0 0 0 
0 0 0 0 
0 0 0 0 
0 0 0 0 
99.9846649169922 0.00712332874536514 0.00421532057225704 0.00166074652224779 
