#,version,,,,,,,,,,,,,,,,,,,,,,,,,,,,,,,,,,,,,,,,,,,,,,,,,,,,,,,,
2021,8,5,0,,,,,,,,,,,,,,,,,,,,,,,,,,,,,,,,,,,,,,,,,,,,,,,,,,,,,,
#,row_col_num,,,,,,,,,,,,,,,,,,,,,,,,,,,,,,,,,,,,,,,,,,,,,,,,,,,,,,,,
40,18,,,,,,,,,,,,,,,,,,,,,,,,,,,,,,,,,,,,,,,,,,,,,,,,,,,,,,,,
#,noise,,,,,,,,,,,,,,,,,,,,,,,,,,,,,,,,,,,,,,,,,,,,,,,,,,,,,,,,
-500,500,,,,,,,,,,,,,,,,,,,,,,,,,,,,,,,,,,,,,,,,,,,,,,,,,,,,,,,,
#,raw_max,,,,,,,,,,,,,,,,,,,,,,,,,,,,,,,,,,,,,,,,,,,,,,,,,,,,,,,,
21343,21991,22072,22045,22040,22023,22004,22089,21510,21487,21967,21949,21926,21927,21897,21872,21718,19949,,,,,,,,,,,,,,,,,,,,,,,,,,,,,,,,,,,,,,,,
22374,22401,22374,22359,22359,22365,22349,22422,21837,21819,22364,22353,22350,22366,22361,22356,22377,22235,,,,,,,,,,,,,,,,,,,,,,,,,,,,,,,,,,,,,,,,
22586,22423,22403,22392,22384,22397,22378,22428,22466,22401,22400,22471,22469,22413,22473,22442,22497,22546,,,,,,,,,,,,,,,,,,,,,,,,,,,,,,,,,,,,,,,,
22605,22446,22429,22419,22413,22424,22409,22558,22506,22436,22433,22421,22417,22436,22434,22430,22453,22575,,,,,,,,,,,,,,,,,,,,,,,,,,,,,,,,,,,,,,,,
22572,22422,22402,22393,22389,22402,22387,22412,22419,22421,22413,22399,22395,22413,22411,22404,22418,22547,,,,,,,,,,,,,,,,,,,,,,,,,,,,,,,,,,,,,,,,
22587,22438,22415,22412,22412,22421,22414,22412,22442,22444,22437,22422,22418,22435,22429,22426,22444,22568,,,,,,,,,,,,,,,,,,,,,,,,,,,,,,,,,,,,,,,,
22545,22397,22374,22373,22378,22385,22379,22378,22409,22406,22399,22388,22382,22401,22395,22387,22403,22533,,,,,,,,,,,,,,,,,,,,,,,,,,,,,,,,,,,,,,,,
22497,22354,22335,22337,22340,22348,22339,22339,22372,22366,22359,22347,22342,22358,22352,22344,22362,22489,,,,,,,,,,,,,,,,,,,,,,,,,,,,,,,,,,,,,,,,
22539,22397,22387,22390,22396,22402,22389,22390,22417,22427,22404,22393,22386,22401,22395,22387,22408,22533,,,,,,,,,,,,,,,,,,,,,,,,,,,,,,,,,,,,,,,,
22492,22360,22351,22353,22358,22365,22351,22357,22387,22383,22373,22361,22354,22369,22364,22357,22372,22499,,,,,,,,,,,,,,,,,,,,,,,,,,,,,,,,,,,,,,,,
22428,22299,22294,22296,22303,22306,22300,22299,22330,22326,22311,22301,22295,22313,22305,22299,22311,22449,,,,,,,,,,,,,,,,,,,,,,,,,,,,,,,,,,,,,,,,
22436,22318,22309,22316,22314,22321,22318,22314,22348,22344,22336,22323,22316,22328,22324,22318,22327,22459,,,,,,,,,,,,,,,,,,,,,,,,,,,,,,,,,,,,,,,,
22401,22292,22284,22285,22283,22290,22289,22283,22315,22312,22296,22289,22282,22296,22293,22293,22295,22421,,,,,,,,,,,,,,,,,,,,,,,,,,,,,,,,,,,,,,,,
22350,22251,22242,22239,22236,22243,22242,22236,22272,22264,22251,22247,22239,22258,22247,22242,22252,22374,,,,,,,,,,,,,,,,,,,,,,,,,,,,,,,,,,,,,,,,
22344,22242,22235,22228,22231,22234,22235,22228,22262,22255,22239,22236,22231,22240,22234,22231,22239,22361,,,,,,,,,,,,,,,,,,,,,,,,,,,,,,,,,,,,,,,,
22326,22228,22217,22216,22221,22224,22224,22220,22253,22247,22229,22226,22225,22233,22222,22223,22229,22349,,,,,,,,,,,,,,,,,,,,,,,,,,,,,,,,,,,,,,,,
22265,22168,22158,22159,22163,22171,22170,22165,22198,22193,22176,22169,22164,22180,22165,22167,22180,22290,,,,,,,,,,,,,,,,,,,,,,,,,,,,,,,,,,,,,,,,
22257,22163,22159,22156,22164,22172,22167,22163,22193,22192,22173,22164,22161,22175,22165,22164,22168,22285,,,,,,,,,,,,,,,,,,,,,,,,,,,,,,,,,,,,,,,,
22204,22123,22114,22117,22124,22129,22126,22120,22151,22149,22129,22126,22119,22125,22115,22122,22122,22239,,,,,,,,,,,,,,,,,,,,,,,,,,,,,,,,,,,,,,,,
22168,22099,22091,22089,22094,22100,22098,22093,22132,22120,22102,22091,22094,22095,22090,22100,22102,22219,,,,,,,,,,,,,,,,,,,,,,,,,,,,,,,,,,,,,,,,
22122,22065,22060,22057,22060,22066,22064,22064,22091,22085,22066,22058,22060,22064,22061,22068,22068,22182,,,,,,,,,,,,,,,,,,,,,,,,,,,,,,,,,,,,,,,,
22100,22052,22051,22052,22050,22054,22062,22047,22078,22077,22056,22052,22053,22060,22053,22056,22057,22169,,,,,,,,,,,,,,,,,,,,,,,,,,,,,,,,,,,,,,,,
22040,22002,22010,22001,22000,22005,22005,22002,22028,22027,22005,22004,22006,22010,22006,22009,22006,22119,,,,,,,,,,,,,,,,,,,,,,,,,,,,,,,,,,,,,,,,
22039,22005,22006,22002,22009,22008,22010,22006,22032,22031,22011,22010,22013,22013,22012,22020,22011,22121,,,,,,,,,,,,,,,,,,,,,,,,,,,,,,,,,,,,,,,,
21971,21945,21945,21943,21947,21952,21951,21944,21973,21969,21950,21952,21950,21952,21953,21961,21957,22061,,,,,,,,,,,,,,,,,,,,,,,,,,,,,,,,,,,,,,,,
21926,21911,21910,21913,21909,21910,21912,21906,21935,21933,21914,21917,21916,21917,21917,21925,21921,22023,,,,,,,,,,,,,,,,,,,,,,,,,,,,,,,,,,,,,,,,
21854,21839,21839,21834,21831,21839,21840,21834,21862,21864,21841,21845,21842,21847,21843,21850,21850,21952,,,,,,,,,,,,,,,,,,,,,,,,,,,,,,,,,,,,,,,,
21836,21828,21832,21827,21821,21828,21829,21823,21849,21858,21836,21839,21832,21838,21836,21844,21843,21938,,,,,,,,,,,,,,,,,,,,,,,,,,,,,,,,,,,,,,,,
21805,21796,21808,21801,21799,21802,21804,21793,21819,21840,21810,21813,21808,21814,21811,21818,21822,21916,,,,,,,,,,,,,,,,,,,,,,,,,,,,,,,,,,,,,,,,
21784,21780,21788,21778,21785,21788,21791,21775,21800,21818,21791,21792,21794,21796,21796,21805,21805,21899,,,,,,,,,,,,,,,,,,,,,,,,,,,,,,,,,,,,,,,,
21712,21708,21717,21707,21711,21717,21710,21706,21733,21747,21718,21723,21726,21731,21734,21740,21734,21824,,,,,,,,,,,,,,,,,,,,,,,,,,,,,,,,,,,,,,,,
21706,21711,21722,21719,21717,21717,21720,21713,21739,21753,21723,21731,21737,21740,21742,21745,21740,21828,,,,,,,,,,,,,,,,,,,,,,,,,,,,,,,,,,,,,,,,
21641,21659,21671,21665,21669,21667,21665,21660,21687,21701,21668,21675,21682,21685,21683,21691,21688,21771,,,,,,,,,,,,,,,,,,,,,,,,,,,,,,,,,,,,,,,,
21587,21606,21623,21618,21623,21619,21620,21615,21640,21655,21622,21632,21638,21639,21641,21647,21644,21727,,,,,,,,,,,,,,,,,,,,,,,,,,,,,,,,,,,,,,,,
21526,21550,21568,21562,21569,21567,21565,21561,21585,21600,21563,21576,21584,21585,21583,21591,21586,21665,,,,,,,,,,,,,,,,,,,,,,,,,,,,,,,,,,,,,,,,
21473,21510,21524,21520,21523,21522,21520,21513,21541,21553,21516,21533,21541,21542,21541,21547,21539,21615,,,,,,,,,,,,,,,,,,,,,,,,,,,,,,,,,,,,,,,,
21474,21511,21524,21518,21524,21527,21521,21516,21544,21554,21519,21537,21545,21544,21545,21552,21543,21617,,,,,,,,,,,,,,,,,,,,,,,,,,,,,,,,,,,,,,,,
21441,21480,21501,21486,21508,21497,21568,21489,21513,21526,21492,21508,21515,21511,21507,21521,21512,21563,,,,,,,,,,,,,,,,,,,,,,,,,,,,,,,,,,,,,,,,
21198,21462,21542,21535,21559,21518,21538,21447,21470,21492,21451,21464,21467,21460,21453,21459,21445,21173,,,,,,,,,,,,,,,,,,,,,,,,,,,,,,,,,,,,,,,,
19978,21163,21331,21304,21307,21284,21274,21244,21250,21265,21204,21175,21143,21113,21146,21114,20970,19185,,,,,,,,,,,,,,,,,,,,,,,,,,,,,,,,,,,,,,,,
#,raw_min,,,,,,,,,,,,,,,,,,,,,,,,,,,,,,,,,,,,,,,,,,,,,,,,,,,,,,,,
11183,11831,11912,11885,11880,11863,11844,11929,11350,11327,11807,11789,11766,11767,11737,11712,11558,9789,,,,,,,,,,,,,,,,,,,,,,,,,,,,,,,,,,,,,,,,
12214,12241,12214,12199,12199,12205,12189,12262,11677,11659,12204,12193,12190,12206,12201,12196,12217,12075,,,,,,,,,,,,,,,,,,,,,,,,,,,,,,,,,,,,,,,,
12426,12263,12243,12232,12224,12237,12218,12268,12306,12241,12240,12311,12309,12253,12313,12282,12337,12386,,,,,,,,,,,,,,,,,,,,,,,,,,,,,,,,,,,,,,,,
12445,12286,12269,12259,12253,12264,12249,12398,12346,12276,12273,12261,12257,12276,12274,12270,12293,12415,,,,,,,,,,,,,,,,,,,,,,,,,,,,,,,,,,,,,,,,
12412,12262,12242,12233,12229,12242,12227,12252,12259,12261,12253,12239,12235,12253,12251,12244,12258,12387,,,,,,,,,,,,,,,,,,,,,,,,,,,,,,,,,,,,,,,,
12427,12278,12255,12252,12252,12261,12254,12252,12282,12284,12277,12262,12258,12275,12269,12266,12284,12408,,,,,,,,,,,,,,,,,,,,,,,,,,,,,,,,,,,,,,,,
12385,12237,12214,12213,12218,12225,12219,12218,12249,12246,12239,12228,12222,12241,12235,12227,12243,12373,,,,,,,,,,,,,,,,,,,,,,,,,,,,,,,,,,,,,,,,
12337,12194,12175,12177,12180,12188,12179,12179,12212,12206,12199,12187,12182,12198,12192,12184,12202,12329,,,,,,,,,,,,,,,,,,,,,,,,,,,,,,,,,,,,,,,,
12379,12237,12227,12230,12236,12242,12229,12230,12257,12267,12244,12233,12226,12241,12235,12227,12248,12373,,,,,,,,,,,,,,,,,,,,,,,,,,,,,,,,,,,,,,,,
12332,12200,12191,12193,12198,12205,12191,12197,12227,12223,12213,12201,12194,12209,12204,12197,12212,12339,,,,,,,,,,,,,,,,,,,,,,,,,,,,,,,,,,,,,,,,
12268,12139,12134,12136,12143,12146,12140,12139,12170,12166,12151,12141,12135,12153,12145,12139,12151,12289,,,,,,,,,,,,,,,,,,,,,,,,,,,,,,,,,,,,,,,,
12276,12158,12149,12156,12154,12161,12158,12154,12188,12184,12176,12163,12156,12168,12164,12158,12167,12299,,,,,,,,,,,,,,,,,,,,,,,,,,,,,,,,,,,,,,,,
12241,12132,12124,12125,12123,12130,12129,12123,12155,12152,12136,12129,12122,12136,12133,12133,12135,12261,,,,,,,,,,,,,,,,,,,,,,,,,,,,,,,,,,,,,,,,
12190,12091,12082,12079,12076,12083,12082,12076,12112,12104,12091,12087,12079,12098,12087,12082,12092,12214,,,,,,,,,,,,,,,,,,,,,,,,,,,,,,,,,,,,,,,,
12184,12082,12075,12068,12071,12074,12075,12068,12102,12095,12079,12076,12071,12080,12074,12071,12079,12201,,,,,,,,,,,,,,,,,,,,,,,,,,,,,,,,,,,,,,,,
12166,12068,12057,12056,12061,12064,12064,12060,12093,12087,12069,12066,12065,12073,12062,12063,12069,12189,,,,,,,,,,,,,,,,,,,,,,,,,,,,,,,,,,,,,,,,
12105,12008,11998,11999,12003,12011,12010,12005,12038,12033,12016,12009,12004,12020,12005,12007,12020,12130,,,,,,,,,,,,,,,,,,,,,,,,,,,,,,,,,,,,,,,,
12097,12003,11999,11996,12004,12012,12007,12003,12033,12032,12013,12004,12001,12015,12005,12004,12008,12125,,,,,,,,,,,,,,,,,,,,,,,,,,,,,,,,,,,,,,,,
12044,11963,11954,11957,11964,11969,11966,11960,11991,11989,11969,11966,11959,11965,11955,11962,11962,12079,,,,,,,,,,,,,,,,,,,,,,,,,,,,,,,,,,,,,,,,
12008,11939,11931,11929,11934,11940,11938,11933,11972,11960,11942,11931,11934,11935,11930,11940,11942,12059,,,,,,,,,,,,,,,,,,,,,,,,,,,,,,,,,,,,,,,,
11962,11905,11900,11897,11900,11906,11904,11904,11931,11925,11906,11898,11900,11904,11901,11908,11908,12022,,,,,,,,,,,,,,,,,,,,,,,,,,,,,,,,,,,,,,,,
11940,11892,11891,11892,11890,11894,11902,11887,11918,11917,11896,11892,11893,11900,11893,11896,11897,12009,,,,,,,,,,,,,,,,,,,,,,,,,,,,,,,,,,,,,,,,
11880,11842,11850,11841,11840,11845,11845,11842,11868,11867,11845,11844,11846,11850,11846,11849,11846,11959,,,,,,,,,,,,,,,,,,,,,,,,,,,,,,,,,,,,,,,,
11879,11845,11846,11842,11849,11848,11850,11846,11872,11871,11851,11850,11853,11853,11852,11860,11851,11961,,,,,,,,,,,,,,,,,,,,,,,,,,,,,,,,,,,,,,,,
11811,11785,11785,11783,11787,11792,11791,11784,11813,11809,11790,11792,11790,11792,11793,11801,11797,11901,,,,,,,,,,,,,,,,,,,,,,,,,,,,,,,,,,,,,,,,
11766,11751,11750,11753,11749,11750,11752,11746,11775,11773,11754,11757,11756,11757,11757,11765,11761,11863,,,,,,,,,,,,,,,,,,,,,,,,,,,,,,,,,,,,,,,,
11694,11679,11679,11674,11671,11679,11680,11674,11702,11704,11681,11685,11682,11687,11683,11690,11690,11792,,,,,,,,,,,,,,,,,,,,,,,,,,,,,,,,,,,,,,,,
11676,11668,11672,11667,11661,11668,11669,11663,11689,11698,11676,11679,11672,11678,11676,11684,11683,11778,,,,,,,,,,,,,,,,,,,,,,,,,,,,,,,,,,,,,,,,
11645,11636,11648,11641,11639,11642,11644,11633,11659,11680,11650,11653,11648,11654,11651,11658,11662,11756,,,,,,,,,,,,,,,,,,,,,,,,,,,,,,,,,,,,,,,,
11624,11620,11628,11618,11625,11628,11631,11615,11640,11658,11631,11632,11634,11636,11636,11645,11645,11739,,,,,,,,,,,,,,,,,,,,,,,,,,,,,,,,,,,,,,,,
11552,11548,11557,11547,11551,11557,11550,11546,11573,11587,11558,11563,11566,11571,11574,11580,11574,11664,,,,,,,,,,,,,,,,,,,,,,,,,,,,,,,,,,,,,,,,
11546,11551,11562,11559,11557,11557,11560,11553,11579,11593,11563,11571,11577,11580,11582,11585,11580,11668,,,,,,,,,,,,,,,,,,,,,,,,,,,,,,,,,,,,,,,,
11481,11499,11511,11505,11509,11507,11505,11500,11527,11541,11508,11515,11522,11525,11523,11531,11528,11611,,,,,,,,,,,,,,,,,,,,,,,,,,,,,,,,,,,,,,,,
11427,11446,11463,11458,11463,11459,11460,11455,11480,11495,11462,11472,11478,11479,11481,11487,11484,11567,,,,,,,,,,,,,,,,,,,,,,,,,,,,,,,,,,,,,,,,
11366,11390,11408,11402,11409,11407,11405,11401,11425,11440,11403,11416,11424,11425,11423,11431,11426,11505,,,,,,,,,,,,,,,,,,,,,,,,,,,,,,,,,,,,,,,,
11313,11350,11364,11360,11363,11362,11360,11353,11381,11393,11356,11373,11381,11382,11381,11387,11379,11455,,,,,,,,,,,,,,,,,,,,,,,,,,,,,,,,,,,,,,,,
11314,11351,11364,11358,11364,11367,11361,11356,11384,11394,11359,11377,11385,11384,11385,11392,11383,11457,,,,,,,,,,,,,,,,,,,,,,,,,,,,,,,,,,,,,,,,
11281,11320,11341,11326,11348,11337,11408,11329,11353,11366,11332,11348,11355,11351,11347,11361,11352,11403,,,,,,,,,,,,,,,,,,,,,,,,,,,,,,,,,,,,,,,,
11038,11302,11382,11375,11399,11358,11378,11287,11310,11332,11291,11304,11307,11300,11293,11299,11285,11013,,,,,,,,,,,,,,,,,,,,,,,,,,,,,,,,,,,,,,,,
9818,11003,11171,11144,11147,11124,11114,11084,11090,11105,11044,11015,10983,10953,10986,10954,10810,9025,,,,,,,,,,,,,,,,,,,,,,,,,,,,,,,,,,,,,,,,
#,raw_row_delta_max,,,,,,,,,,,,,,,,,,,,,,,,,,,,,,,,,,,,,,,,,,,,,,,,,,,,,,,,
8000,1500,1000,1000,1000,1000,1000,1000,1300,1300,1000,1000,1000,1000,1000,1000,1500,8000,,,,,,,,,,,,,,,,,,,,,,,,,,,,,,,,,,,,,,,,
2500,500,500,500,500,500,500,500,1300,1300,500,500,500,500,500,500,500,2500,,,,,,,,,,,,,,,,,,,,,,,,,,,,,,,,,,,,,,,,
500,500,500,500,500,500,500,500,500,500,500,500,500,500,500,500,500,500,,,,,,,,,,,,,,,,,,,,,,,,,,,,,,,,,,,,,,,,
500,500,500,500,500,500,500,500,500,500,500,500,500,500,500,500,500,500,,,,,,,,,,,,,,,,,,,,,,,,,,,,,,,,,,,,,,,,
500,500,500,500,500,500,500,500,500,500,500,500,500,500,500,500,500,500,,,,,,,,,,,,,,,,,,,,,,,,,,,,,,,,,,,,,,,,
500,500,500,500,500,500,500,500,500,500,500,500,500,500,500,500,500,500,,,,,,,,,,,,,,,,,,,,,,,,,,,,,,,,,,,,,,,,
500,500,500,500,500,500,500,500,500,500,500,500,500,500,500,500,500,500,,,,,,,,,,,,,,,,,,,,,,,,,,,,,,,,,,,,,,,,
500,500,500,500,500,500,500,500,500,500,500,500,500,500,500,500,500,500,,,,,,,,,,,,,,,,,,,,,,,,,,,,,,,,,,,,,,,,
500,500,500,500,500,500,500,500,500,500,500,500,500,500,500,500,500,500,,,,,,,,,,,,,,,,,,,,,,,,,,,,,,,,,,,,,,,,
500,500,500,500,500,500,500,500,500,500,500,500,500,500,500,500,500,500,,,,,,,,,,,,,,,,,,,,,,,,,,,,,,,,,,,,,,,,
500,500,500,500,500,500,500,500,500,500,500,500,500,500,500,500,500,500,,,,,,,,,,,,,,,,,,,,,,,,,,,,,,,,,,,,,,,,
500,500,500,500,500,500,500,500,500,500,500,500,500,500,500,500,500,500,,,,,,,,,,,,,,,,,,,,,,,,,,,,,,,,,,,,,,,,
500,500,500,500,500,500,500,500,500,500,500,500,500,500,500,500,500,500,,,,,,,,,,,,,,,,,,,,,,,,,,,,,,,,,,,,,,,,
500,500,500,500,500,500,500,500,500,500,500,500,500,500,500,500,500,500,,,,,,,,,,,,,,,,,,,,,,,,,,,,,,,,,,,,,,,,
500,500,500,500,500,500,500,500,500,500,500,500,500,500,500,500,500,500,,,,,,,,,,,,,,,,,,,,,,,,,,,,,,,,,,,,,,,,
500,500,500,500,500,500,500,500,500,500,500,500,500,500,500,500,500,500,,,,,,,,,,,,,,,,,,,,,,,,,,,,,,,,,,,,,,,,
500,500,500,500,500,500,500,500,500,500,500,500,500,500,500,500,500,500,,,,,,,,,,,,,,,,,,,,,,,,,,,,,,,,,,,,,,,,
500,500,500,500,500,500,500,500,500,500,500,500,500,500,500,500,500,500,,,,,,,,,,,,,,,,,,,,,,,,,,,,,,,,,,,,,,,,
500,500,500,500,500,500,500,500,500,500,500,500,500,500,500,500,500,500,,,,,,,,,,,,,,,,,,,,,,,,,,,,,,,,,,,,,,,,
500,500,500,500,500,500,500,500,500,500,500,500,500,500,500,500,500,500,,,,,,,,,,,,,,,,,,,,,,,,,,,,,,,,,,,,,,,,
500,500,500,500,500,500,500,500,500,500,500,500,500,500,500,500,500,500,,,,,,,,,,,,,,,,,,,,,,,,,,,,,,,,,,,,,,,,
500,500,500,500,500,500,500,500,500,500,500,500,500,500,500,500,500,500,,,,,,,,,,,,,,,,,,,,,,,,,,,,,,,,,,,,,,,,
500,500,500,500,500,500,500,500,500,500,500,500,500,500,500,500,500,500,,,,,,,,,,,,,,,,,,,,,,,,,,,,,,,,,,,,,,,,
500,500,500,500,500,500,500,500,500,500,500,500,500,500,500,500,500,500,,,,,,,,,,,,,,,,,,,,,,,,,,,,,,,,,,,,,,,,
500,500,500,500,500,500,500,500,500,500,500,500,500,500,500,500,500,500,,,,,,,,,,,,,,,,,,,,,,,,,,,,,,,,,,,,,,,,
500,500,500,500,500,500,500,500,500,500,500,500,500,500,500,500,500,500,,,,,,,,,,,,,,,,,,,,,,,,,,,,,,,,,,,,,,,,
500,500,500,500,500,500,500,500,500,500,500,500,500,500,500,500,500,500,,,,,,,,,,,,,,,,,,,,,,,,,,,,,,,,,,,,,,,,
500,500,500,500,500,500,500,500,500,500,500,500,500,500,500,500,500,500,,,,,,,,,,,,,,,,,,,,,,,,,,,,,,,,,,,,,,,,
500,500,500,500,500,500,500,500,500,500,500,500,500,500,500,500,500,500,,,,,,,,,,,,,,,,,,,,,,,,,,,,,,,,,,,,,,,,
500,500,500,500,500,500,500,500,500,500,500,500,500,500,500,500,500,500,,,,,,,,,,,,,,,,,,,,,,,,,,,,,,,,,,,,,,,,
500,500,500,500,500,500,500,500,500,500,500,500,500,500,500,500,500,500,,,,,,,,,,,,,,,,,,,,,,,,,,,,,,,,,,,,,,,,
500,500,500,500,500,500,500,500,500,500,500,500,500,500,500,500,500,500,,,,,,,,,,,,,,,,,,,,,,,,,,,,,,,,,,,,,,,,
500,500,500,500,500,500,500,500,500,500,500,500,500,500,500,500,500,500,,,,,,,,,,,,,,,,,,,,,,,,,,,,,,,,,,,,,,,,
500,500,500,500,500,500,500,500,500,500,500,500,500,500,500,500,500,500,,,,,,,,,,,,,,,,,,,,,,,,,,,,,,,,,,,,,,,,
500,500,500,500,500,500,500,500,500,500,500,500,500,500,500,500,500,500,,,,,,,,,,,,,,,,,,,,,,,,,,,,,,,,,,,,,,,,
500,500,500,500,500,500,500,500,500,500,500,500,500,500,500,500,500,500,,,,,,,,,,,,,,,,,,,,,,,,,,,,,,,,,,,,,,,,
500,500,500,500,500,500,500,500,500,500,500,500,500,500,500,500,500,500,,,,,,,,,,,,,,,,,,,,,,,,,,,,,,,,,,,,,,,,
2500,500,500,500,500,500,500,500,500,500,500,500,500,500,500,500,500,2500,,,,,,,,,,,,,,,,,,,,,,,,,,,,,,,,,,,,,,,,
5000,500,500,500,500,500,500,500,500,500,500,500,500,500,500,500,500,5000,,,,,,,,,,,,,,,,,,,,,,,,,,,,,,,,,,,,,,,,
#,raw_row_delta_min,,,,,,,,,,,,,,,,,,,,,,,,,,,,,,,,,,,,,,,,,,,,,,,,,,,,,,,,
-5000,-1000,-1000,-1000,-1000,-1000,-1000,-1000,-1300,-1300,-1000,-1000,-1000,-1000,-1000,-1000,-1000,-5000,,,,,,,,,,,,,,,,,,,,,,,,,,,,,,,,,,,,,,,,
-2500,-500,-500,-500,-500,-500,-500,-500,-1300,-1300,-500,-500,-500,-500,-500,-500,-500,-2500,,,,,,,,,,,,,,,,,,,,,,,,,,,,,,,,,,,,,,,,
-500,-500,-500,-500,-500,-500,-500,-500,-500,-500,-500,-500,-500,-500,-500,-500,-500,-500,,,,,,,,,,,,,,,,,,,,,,,,,,,,,,,,,,,,,,,,
-500,-500,-500,-500,-500,-500,-500,-500,-500,-500,-500,-500,-500,-500,-500,-500,-500,-500,,,,,,,,,,,,,,,,,,,,,,,,,,,,,,,,,,,,,,,,
-500,-500,-500,-500,-500,-500,-500,-500,-500,-500,-500,-500,-500,-500,-500,-500,-500,-500,,,,,,,,,,,,,,,,,,,,,,,,,,,,,,,,,,,,,,,,
-500,-500,-500,-500,-500,-500,-500,-500,-500,-500,-500,-500,-500,-500,-500,-500,-500,-500,,,,,,,,,,,,,,,,,,,,,,,,,,,,,,,,,,,,,,,,
-500,-500,-500,-500,-500,-500,-500,-500,-500,-500,-500,-500,-500,-500,-500,-500,-500,-500,,,,,,,,,,,,,,,,,,,,,,,,,,,,,,,,,,,,,,,,
-500,-500,-500,-500,-500,-500,-500,-500,-500,-500,-500,-500,-500,-500,-500,-500,-500,-500,,,,,,,,,,,,,,,,,,,,,,,,,,,,,,,,,,,,,,,,
-500,-500,-500,-500,-500,-500,-500,-500,-500,-500,-500,-500,-500,-500,-500,-500,-500,-500,,,,,,,,,,,,,,,,,,,,,,,,,,,,,,,,,,,,,,,,
-500,-500,-500,-500,-500,-500,-500,-500,-500,-500,-500,-500,-500,-500,-500,-500,-500,-500,,,,,,,,,,,,,,,,,,,,,,,,,,,,,,,,,,,,,,,,
-500,-500,-500,-500,-500,-500,-500,-500,-500,-500,-500,-500,-500,-500,-500,-500,-500,-500,,,,,,,,,,,,,,,,,,,,,,,,,,,,,,,,,,,,,,,,
-500,-500,-500,-500,-500,-500,-500,-500,-500,-500,-500,-500,-500,-500,-500,-500,-500,-500,,,,,,,,,,,,,,,,,,,,,,,,,,,,,,,,,,,,,,,,
-500,-500,-500,-500,-500,-500,-500,-500,-500,-500,-500,-500,-500,-500,-500,-500,-500,-500,,,,,,,,,,,,,,,,,,,,,,,,,,,,,,,,,,,,,,,,
-500,-500,-500,-500,-500,-500,-500,-500,-500,-500,-500,-500,-500,-500,-500,-500,-500,-500,,,,,,,,,,,,,,,,,,,,,,,,,,,,,,,,,,,,,,,,
-500,-500,-500,-500,-500,-500,-500,-500,-500,-500,-500,-500,-500,-500,-500,-500,-500,-500,,,,,,,,,,,,,,,,,,,,,,,,,,,,,,,,,,,,,,,,
-500,-500,-500,-500,-500,-500,-500,-500,-500,-500,-500,-500,-500,-500,-500,-500,-500,-500,,,,,,,,,,,,,,,,,,,,,,,,,,,,,,,,,,,,,,,,
-500,-500,-500,-500,-500,-500,-500,-500,-500,-500,-500,-500,-500,-500,-500,-500,-500,-500,,,,,,,,,,,,,,,,,,,,,,,,,,,,,,,,,,,,,,,,
-500,-500,-500,-500,-500,-500,-500,-500,-500,-500,-500,-500,-500,-500,-500,-500,-500,-500,,,,,,,,,,,,,,,,,,,,,,,,,,,,,,,,,,,,,,,,
-500,-500,-500,-500,-500,-500,-500,-500,-500,-500,-500,-500,-500,-500,-500,-500,-500,-500,,,,,,,,,,,,,,,,,,,,,,,,,,,,,,,,,,,,,,,,
-500,-500,-500,-500,-500,-500,-500,-500,-500,-500,-500,-500,-500,-500,-500,-500,-500,-500,,,,,,,,,,,,,,,,,,,,,,,,,,,,,,,,,,,,,,,,
-500,-500,-500,-500,-500,-500,-500,-500,-500,-500,-500,-500,-500,-500,-500,-500,-500,-500,,,,,,,,,,,,,,,,,,,,,,,,,,,,,,,,,,,,,,,,
-500,-500,-500,-500,-500,-500,-500,-500,-500,-500,-500,-500,-500,-500,-500,-500,-500,-500,,,,,,,,,,,,,,,,,,,,,,,,,,,,,,,,,,,,,,,,
-500,-500,-500,-500,-500,-500,-500,-500,-500,-500,-500,-500,-500,-500,-500,-500,-500,-500,,,,,,,,,,,,,,,,,,,,,,,,,,,,,,,,,,,,,,,,
-500,-500,-500,-500,-500,-500,-500,-500,-500,-500,-500,-500,-500,-500,-500,-500,-500,-500,,,,,,,,,,,,,,,,,,,,,,,,,,,,,,,,,,,,,,,,
-500,-500,-500,-500,-500,-500,-500,-500,-500,-500,-500,-500,-500,-500,-500,-500,-500,-500,,,,,,,,,,,,,,,,,,,,,,,,,,,,,,,,,,,,,,,,
-500,-500,-500,-500,-500,-500,-500,-500,-500,-500,-500,-500,-500,-500,-500,-500,-500,-500,,,,,,,,,,,,,,,,,,,,,,,,,,,,,,,,,,,,,,,,
-500,-500,-500,-500,-500,-500,-500,-500,-500,-500,-500,-500,-500,-500,-500,-500,-500,-500,,,,,,,,,,,,,,,,,,,,,,,,,,,,,,,,,,,,,,,,
-500,-500,-500,-500,-500,-500,-500,-500,-500,-500,-500,-500,-500,-500,-500,-500,-500,-500,,,,,,,,,,,,,,,,,,,,,,,,,,,,,,,,,,,,,,,,
-500,-500,-500,-500,-500,-500,-500,-500,-500,-500,-500,-500,-500,-500,-500,-500,-500,-500,,,,,,,,,,,,,,,,,,,,,,,,,,,,,,,,,,,,,,,,
-500,-500,-500,-500,-500,-500,-500,-500,-500,-500,-500,-500,-500,-500,-500,-500,-500,-500,,,,,,,,,,,,,,,,,,,,,,,,,,,,,,,,,,,,,,,,
-500,-500,-500,-500,-500,-500,-500,-500,-500,-500,-500,-500,-500,-500,-500,-500,-500,-500,,,,,,,,,,,,,,,,,,,,,,,,,,,,,,,,,,,,,,,,
-500,-500,-500,-500,-500,-500,-500,-500,-500,-500,-500,-500,-500,-500,-500,-500,-500,-500,,,,,,,,,,,,,,,,,,,,,,,,,,,,,,,,,,,,,,,,
-500,-500,-500,-500,-500,-500,-500,-500,-500,-500,-500,-500,-500,-500,-500,-500,-500,-500,,,,,,,,,,,,,,,,,,,,,,,,,,,,,,,,,,,,,,,,
-500,-500,-500,-500,-500,-500,-500,-500,-500,-500,-500,-500,-500,-500,-500,-500,-500,-500,,,,,,,,,,,,,,,,,,,,,,,,,,,,,,,,,,,,,,,,
-500,-500,-500,-500,-500,-500,-500,-500,-500,-500,-500,-500,-500,-500,-500,-500,-500,-500,,,,,,,,,,,,,,,,,,,,,,,,,,,,,,,,,,,,,,,,
-500,-500,-500,-500,-500,-500,-500,-500,-500,-500,-500,-500,-500,-500,-500,-500,-500,-500,,,,,,,,,,,,,,,,,,,,,,,,,,,,,,,,,,,,,,,,
-500,-500,-500,-500,-500,-500,-500,-500,-500,-500,-500,-500,-500,-500,-500,-500,-500,-500,,,,,,,,,,,,,,,,,,,,,,,,,,,,,,,,,,,,,,,,
-2500,-500,-500,-500,-500,-500,-500,-500,-500,-500,-500,-500,-500,-500,-500,-500,-500,-2500,,,,,,,,,,,,,,,,,,,,,,,,,,,,,,,,,,,,,,,,
-8000,-1500,-1000,-1000,-1000,-1000,-1000,-1000,-1000,-1000,-1000,-1000,-1000,-1000,-1000,-1000,-1500,-8000,,,,,,,,,,,,,,,,,,,,,,,,,,,,,,,,,,,,,,,,
#,raw_col_delta_max,,,,,,,,,,,,,,,,,,,,,,,,,,,,,,,,,,,,,,,,,,,,,,,,,,,,,,,,
5000,1000,500,500,500,500,500,500,500,1300,500,500,500,500,500,500,500,,,,,,,,,,,,,,,,,,,,,,,,,,,,,,,,,,,,,,,,,
500,500,500,500,500,500,500,500,500,1300,500,500,500,500,500,500,500,,,,,,,,,,,,,,,,,,,,,,,,,,,,,,,,,,,,,,,,,
500,500,500,500,500,500,500,500,500,500,500,500,500,500,500,500,800,,,,,,,,,,,,,,,,,,,,,,,,,,,,,,,,,,,,,,,,,
500,500,500,500,500,500,500,500,500,500,500,500,500,500,500,500,800,,,,,,,,,,,,,,,,,,,,,,,,,,,,,,,,,,,,,,,,,
500,500,500,500,500,500,500,500,500,500,500,500,500,500,500,500,800,,,,,,,,,,,,,,,,,,,,,,,,,,,,,,,,,,,,,,,,,
500,500,500,500,500,500,500,500,500,500,500,500,500,500,500,500,800,,,,,,,,,,,,,,,,,,,,,,,,,,,,,,,,,,,,,,,,,
500,500,500,500,500,500,500,500,500,500,500,500,500,500,500,500,800,,,,,,,,,,,,,,,,,,,,,,,,,,,,,,,,,,,,,,,,,
500,500,500,500,500,500,500,500,500,500,500,500,500,500,500,500,800,,,,,,,,,,,,,,,,,,,,,,,,,,,,,,,,,,,,,,,,,
500,500,500,500,500,500,500,500,500,500,500,500,500,500,500,500,800,,,,,,,,,,,,,,,,,,,,,,,,,,,,,,,,,,,,,,,,,
500,500,500,500,500,500,500,500,500,500,500,500,500,500,500,500,800,,,,,,,,,,,,,,,,,,,,,,,,,,,,,,,,,,,,,,,,,
500,500,500,500,500,500,500,500,500,500,500,500,500,500,500,500,800,,,,,,,,,,,,,,,,,,,,,,,,,,,,,,,,,,,,,,,,,
500,500,500,500,500,500,500,500,500,500,500,500,500,500,500,500,800,,,,,,,,,,,,,,,,,,,,,,,,,,,,,,,,,,,,,,,,,
500,500,500,500,500,500,500,500,500,500,500,500,500,500,500,500,800,,,,,,,,,,,,,,,,,,,,,,,,,,,,,,,,,,,,,,,,,
500,500,500,500,500,500,500,500,500,500,500,500,500,500,500,500,800,,,,,,,,,,,,,,,,,,,,,,,,,,,,,,,,,,,,,,,,,
500,500,500,500,500,500,500,500,500,500,500,500,500,500,500,500,800,,,,,,,,,,,,,,,,,,,,,,,,,,,,,,,,,,,,,,,,,
500,500,500,500,500,500,500,500,500,500,500,500,500,500,500,500,800,,,,,,,,,,,,,,,,,,,,,,,,,,,,,,,,,,,,,,,,,
500,500,500,500,500,500,500,500,500,500,500,500,500,500,500,500,800,,,,,,,,,,,,,,,,,,,,,,,,,,,,,,,,,,,,,,,,,
500,500,500,500,500,500,500,500,500,500,500,500,500,500,500,500,800,,,,,,,,,,,,,,,,,,,,,,,,,,,,,,,,,,,,,,,,,
500,500,500,500,500,500,500,500,500,500,500,500,500,500,500,500,800,,,,,,,,,,,,,,,,,,,,,,,,,,,,,,,,,,,,,,,,,
500,500,500,500,500,500,500,500,500,500,500,500,500,500,500,500,800,,,,,,,,,,,,,,,,,,,,,,,,,,,,,,,,,,,,,,,,,
500,500,500,500,500,500,500,500,500,500,500,500,500,500,500,500,800,,,,,,,,,,,,,,,,,,,,,,,,,,,,,,,,,,,,,,,,,
500,500,500,500,500,500,500,500,500,500,500,500,500,500,500,500,800,,,,,,,,,,,,,,,,,,,,,,,,,,,,,,,,,,,,,,,,,
500,500,500,500,500,500,500,500,500,500,500,500,500,500,500,500,800,,,,,,,,,,,,,,,,,,,,,,,,,,,,,,,,,,,,,,,,,
500,500,500,500,500,500,500,500,500,500,500,500,500,500,500,500,800,,,,,,,,,,,,,,,,,,,,,,,,,,,,,,,,,,,,,,,,,
500,500,500,500,500,500,500,500,500,500,500,500,500,500,500,500,800,,,,,,,,,,,,,,,,,,,,,,,,,,,,,,,,,,,,,,,,,
500,500,500,500,500,500,500,500,500,500,500,500,500,500,500,500,800,,,,,,,,,,,,,,,,,,,,,,,,,,,,,,,,,,,,,,,,,
500,500,500,500,500,500,500,500,500,500,500,500,500,500,500,500,800,,,,,,,,,,,,,,,,,,,,,,,,,,,,,,,,,,,,,,,,,
500,500,500,500,500,500,500,500,500,500,500,500,500,500,500,500,800,,,,,,,,,,,,,,,,,,,,,,,,,,,,,,,,,,,,,,,,,
500,500,500,500,500,500,500,500,500,500,500,500,500,500,500,500,800,,,,,,,,,,,,,,,,,,,,,,,,,,,,,,,,,,,,,,,,,
500,500,500,500,500,500,500,500,500,500,500,500,500,500,500,500,800,,,,,,,,,,,,,,,,,,,,,,,,,,,,,,,,,,,,,,,,,
500,500,500,500,500,500,500,500,500,500,500,500,500,500,500,500,800,,,,,,,,,,,,,,,,,,,,,,,,,,,,,,,,,,,,,,,,,
500,500,500,500,500,500,500,500,500,500,500,500,500,500,500,500,800,,,,,,,,,,,,,,,,,,,,,,,,,,,,,,,,,,,,,,,,,
500,500,500,500,500,500,500,500,500,500,500,500,500,500,500,500,800,,,,,,,,,,,,,,,,,,,,,,,,,,,,,,,,,,,,,,,,,
500,500,500,500,500,500,500,500,500,500,500,500,500,500,500,500,800,,,,,,,,,,,,,,,,,,,,,,,,,,,,,,,,,,,,,,,,,
500,500,500,500,500,500,500,500,500,500,500,500,500,500,500,500,800,,,,,,,,,,,,,,,,,,,,,,,,,,,,,,,,,,,,,,,,,
500,500,500,500,500,500,500,500,500,500,500,500,500,500,500,500,800,,,,,,,,,,,,,,,,,,,,,,,,,,,,,,,,,,,,,,,,,
500,500,500,500,500,500,500,500,500,500,500,500,500,500,500,500,800,,,,,,,,,,,,,,,,,,,,,,,,,,,,,,,,,,,,,,,,,
500,500,500,500,500,500,500,500,500,500,500,500,500,500,500,500,800,,,,,,,,,,,,,,,,,,,,,,,,,,,,,,,,,,,,,,,,,
1000,500,500,500,500,500,500,500,500,500,500,500,500,500,500,500,500,,,,,,,,,,,,,,,,,,,,,,,,,,,,,,,,,,,,,,,,,
8000,1000,500,500,500,500,500,500,500,500,500,500,500,500,500,500,500,,,,,,,,,,,,,,,,,,,,,,,,,,,,,,,,,,,,,,,,,
#,raw_col_delta_min,,,,,,,,,,,,,,,,,,,,,,,,,,,,,,,,,,,,,,,,,,,,,,,,,,,,,,,,
-2000,-500,-500,-500,-500,-500,-500,-1300,-500,-500,-500,-500,-500,-500,-500,-1000,-8000,,,,,,,,,,,,,,,,,,,,,,,,,,,,,,,,,,,,,,,,,
-800,-500,-500,-500,-500,-500,-500,-1300,-500,-500,-500,-500,-500,-500,-500,-500,-500,,,,,,,,,,,,,,,,,,,,,,,,,,,,,,,,,,,,,,,,,
-800,-500,-500,-500,-500,-500,-500,-500,-500,-500,-500,-500,-500,-500,-500,-500,-500,,,,,,,,,,,,,,,,,,,,,,,,,,,,,,,,,,,,,,,,,
-800,-500,-500,-500,-500,-500,-500,-500,-500,-500,-500,-500,-500,-500,-500,-500,-500,,,,,,,,,,,,,,,,,,,,,,,,,,,,,,,,,,,,,,,,,
-800,-500,-500,-500,-500,-500,-500,-500,-500,-500,-500,-500,-500,-500,-500,-500,-500,,,,,,,,,,,,,,,,,,,,,,,,,,,,,,,,,,,,,,,,,
-800,-500,-500,-500,-500,-500,-500,-500,-500,-500,-500,-500,-500,-500,-500,-500,-500,,,,,,,,,,,,,,,,,,,,,,,,,,,,,,,,,,,,,,,,,
-800,-500,-500,-500,-500,-500,-500,-500,-500,-500,-500,-500,-500,-500,-500,-500,-500,,,,,,,,,,,,,,,,,,,,,,,,,,,,,,,,,,,,,,,,,
-800,-500,-500,-500,-500,-500,-500,-500,-500,-500,-500,-500,-500,-500,-500,-500,-500,,,,,,,,,,,,,,,,,,,,,,,,,,,,,,,,,,,,,,,,,
-800,-500,-500,-500,-500,-500,-500,-500,-500,-500,-500,-500,-500,-500,-500,-500,-500,,,,,,,,,,,,,,,,,,,,,,,,,,,,,,,,,,,,,,,,,
-800,-500,-500,-500,-500,-500,-500,-500,-500,-500,-500,-500,-500,-500,-500,-500,-500,,,,,,,,,,,,,,,,,,,,,,,,,,,,,,,,,,,,,,,,,
-800,-500,-500,-500,-500,-500,-500,-500,-500,-500,-500,-500,-500,-500,-500,-500,-500,,,,,,,,,,,,,,,,,,,,,,,,,,,,,,,,,,,,,,,,,
-800,-500,-500,-500,-500,-500,-500,-500,-500,-500,-500,-500,-500,-500,-500,-500,-500,,,,,,,,,,,,,,,,,,,,,,,,,,,,,,,,,,,,,,,,,
-800,-500,-500,-500,-500,-500,-500,-500,-500,-500,-500,-500,-500,-500,-500,-500,-500,,,,,,,,,,,,,,,,,,,,,,,,,,,,,,,,,,,,,,,,,
-800,-500,-500,-500,-500,-500,-500,-500,-500,-500,-500,-500,-500,-500,-500,-500,-500,,,,,,,,,,,,,,,,,,,,,,,,,,,,,,,,,,,,,,,,,
-800,-500,-500,-500,-500,-500,-500,-500,-500,-500,-500,-500,-500,-500,-500,-500,-500,,,,,,,,,,,,,,,,,,,,,,,,,,,,,,,,,,,,,,,,,
-800,-500,-500,-500,-500,-500,-500,-500,-500,-500,-500,-500,-500,-500,-500,-500,-500,,,,,,,,,,,,,,,,,,,,,,,,,,,,,,,,,,,,,,,,,
-800,-500,-500,-500,-500,-500,-500,-500,-500,-500,-500,-500,-500,-500,-500,-500,-500,,,,,,,,,,,,,,,,,,,,,,,,,,,,,,,,,,,,,,,,,
-800,-500,-500,-500,-500,-500,-500,-500,-500,-500,-500,-500,-500,-500,-500,-500,-500,,,,,,,,,,,,,,,,,,,,,,,,,,,,,,,,,,,,,,,,,
-800,-500,-500,-500,-500,-500,-500,-500,-500,-500,-500,-500,-500,-500,-500,-500,-500,,,,,,,,,,,,,,,,,,,,,,,,,,,,,,,,,,,,,,,,,
-800,-500,-500,-500,-500,-500,-500,-500,-500,-500,-500,-500,-500,-500,-500,-500,-500,,,,,,,,,,,,,,,,,,,,,,,,,,,,,,,,,,,,,,,,,
-800,-500,-500,-500,-500,-500,-500,-500,-500,-500,-500,-500,-500,-500,-500,-500,-500,,,,,,,,,,,,,,,,,,,,,,,,,,,,,,,,,,,,,,,,,
-800,-500,-500,-500,-500,-500,-500,-500,-500,-500,-500,-500,-500,-500,-500,-500,-500,,,,,,,,,,,,,,,,,,,,,,,,,,,,,,,,,,,,,,,,,
-800,-500,-500,-500,-500,-500,-500,-500,-500,-500,-500,-500,-500,-500,-500,-500,-500,,,,,,,,,,,,,,,,,,,,,,,,,,,,,,,,,,,,,,,,,
-800,-500,-500,-500,-500,-500,-500,-500,-500,-500,-500,-500,-500,-500,-500,-500,-500,,,,,,,,,,,,,,,,,,,,,,,,,,,,,,,,,,,,,,,,,
-800,-500,-500,-500,-500,-500,-500,-500,-500,-500,-500,-500,-500,-500,-500,-500,-500,,,,,,,,,,,,,,,,,,,,,,,,,,,,,,,,,,,,,,,,,
-800,-500,-500,-500,-500,-500,-500,-500,-500,-500,-500,-500,-500,-500,-500,-500,-500,,,,,,,,,,,,,,,,,,,,,,,,,,,,,,,,,,,,,,,,,
-800,-500,-500,-500,-500,-500,-500,-500,-500,-500,-500,-500,-500,-500,-500,-500,-500,,,,,,,,,,,,,,,,,,,,,,,,,,,,,,,,,,,,,,,,,
-800,-500,-500,-500,-500,-500,-500,-500,-500,-500,-500,-500,-500,-500,-500,-500,-500,,,,,,,,,,,,,,,,,,,,,,,,,,,,,,,,,,,,,,,,,
-800,-500,-500,-500,-500,-500,-500,-500,-500,-500,-500,-500,-500,-500,-500,-500,-500,,,,,,,,,,,,,,,,,,,,,,,,,,,,,,,,,,,,,,,,,
-800,-500,-500,-500,-500,-500,-500,-500,-500,-500,-500,-500,-500,-500,-500,-500,-500,,,,,,,,,,,,,,,,,,,,,,,,,,,,,,,,,,,,,,,,,
-800,-500,-500,-500,-500,-500,-500,-500,-500,-500,-500,-500,-500,-500,-500,-500,-500,,,,,,,,,,,,,,,,,,,,,,,,,,,,,,,,,,,,,,,,,
-800,-500,-500,-500,-500,-500,-500,-500,-500,-500,-500,-500,-500,-500,-500,-500,-500,,,,,,,,,,,,,,,,,,,,,,,,,,,,,,,,,,,,,,,,,
-800,-500,-500,-500,-500,-500,-500,-500,-500,-500,-500,-500,-500,-500,-500,-500,-500,,,,,,,,,,,,,,,,,,,,,,,,,,,,,,,,,,,,,,,,,
-800,-500,-500,-500,-500,-500,-500,-500,-500,-500,-500,-500,-500,-500,-500,-500,-500,,,,,,,,,,,,,,,,,,,,,,,,,,,,,,,,,,,,,,,,,
-800,-500,-500,-500,-500,-500,-500,-500,-500,-500,-500,-500,-500,-500,-500,-500,-500,,,,,,,,,,,,,,,,,,,,,,,,,,,,,,,,,,,,,,,,,
-800,-500,-500,-500,-500,-500,-500,-500,-500,-500,-500,-500,-500,-500,-500,-500,-500,,,,,,,,,,,,,,,,,,,,,,,,,,,,,,,,,,,,,,,,,
-800,-500,-500,-500,-500,-500,-500,-500,-500,-500,-500,-500,-500,-500,-500,-500,-500,,,,,,,,,,,,,,,,,,,,,,,,,,,,,,,,,,,,,,,,,
-800,-500,-500,-500,-500,-500,-500,-500,-500,-500,-500,-500,-500,-500,-500,-500,-500,,,,,,,,,,,,,,,,,,,,,,,,,,,,,,,,,,,,,,,,,
-1000,-500,-500,-500,-500,-500,-500,-500,-500,-500,-500,-500,-500,-500,-500,-500,-500,,,,,,,,,,,,,,,,,,,,,,,,,,,,,,,,,,,,,,,,,
-2000,-500,-500,-500,-500,-500,-500,-500,-500,-500,-500,-500,-500,-500,-500,-1000,-8000,,,,,,,,,,,,,,,,,,,,,,,,,,,,,,,,,,,,,,,,,
#,line_max,,,,,,,,,,,,,,,,,,,,,,,,,,,,,,,,,,,,,,,,,,,,,,,,,,,,,,,,
58000,58000,58000,58000,58000,58000,58000,58000,58000,58000,58000,58000,58000,58000,58000,58000,58000,58000,58000,58000,58000,58000,58000,58000,58000,58000,58000,58000,58000,58000,58000,58000,58000,58000,58000,58000,58000,58000,58000,58000,58000,58000,58000,58000,58000,58000,58000,58000,58000,58000,58000,58000,58000,58000,58000,58000,58000,58000
#,line_min,,,,,,,,,,,,,,,,,,,,,,,,,,,,,,,,,,,,,,,,,,,,,,,,,,,,,,,,
10000,10000,10000,10000,10000,10000,10000,10000,10000,10000,10000,10000,10000,10000,10000,10000,10000,10000,10000,10000,10000,10000,10000,10000,10000,10000,10000,10000,10000,10000,10000,10000,10000,10000,10000,10000,10000,10000,10000,10000,10000,10000,10000,10000,10000,10000,10000,10000,10000,10000,10000,10000,10000,10000,10000,10000,10000,10000
#,full_max,,,,,,,,,,,,,,,,,,,,,,,,,,,,,,,,,,,,,,,,,,,,,,,,,,,,,,,,
3000,3000,3000,3000,3000,3000,3000,3000,3000,3000,3000,3000,3000,3000,3000,3000,3000,3000,,,,,,,,,,,,,,,,,,,,,,,,,,,,,,,,,,,,,,,,
3000,3000,3000,3000,3000,3000,3000,3000,3000,3000,3000,3000,3000,3000,3000,3000,3000,3000,,,,,,,,,,,,,,,,,,,,,,,,,,,,,,,,,,,,,,,,
3000,3000,3000,3000,3000,3000,3000,3000,3000,3000,3000,3000,3000,3000,3000,3000,3000,3000,,,,,,,,,,,,,,,,,,,,,,,,,,,,,,,,,,,,,,,,
3000,3000,3000,3000,3000,3000,3000,3000,3000,3000,3000,3000,3000,3000,3000,3000,3000,3000,,,,,,,,,,,,,,,,,,,,,,,,,,,,,,,,,,,,,,,,
3000,3000,3000,3000,3000,3000,3000,3000,3000,3000,3000,3000,3000,3000,3000,3000,3000,3000,,,,,,,,,,,,,,,,,,,,,,,,,,,,,,,,,,,,,,,,
3000,3000,3000,3000,3000,3000,3000,3000,3000,3000,3000,3000,3000,3000,3000,3000,3000,3000,,,,,,,,,,,,,,,,,,,,,,,,,,,,,,,,,,,,,,,,
3000,3000,3000,3000,3000,3000,3000,3000,3000,3000,3000,3000,3000,3000,3000,3000,3000,3000,,,,,,,,,,,,,,,,,,,,,,,,,,,,,,,,,,,,,,,,
3000,3000,3000,3000,3000,3000,3000,3000,3000,3000,3000,3000,3000,3000,3000,3000,3000,3000,,,,,,,,,,,,,,,,,,,,,,,,,,,,,,,,,,,,,,,,
3000,3000,3000,3000,3000,3000,3000,3000,3000,3000,3000,3000,3000,3000,3000,3000,3000,3000,,,,,,,,,,,,,,,,,,,,,,,,,,,,,,,,,,,,,,,,
3000,3000,3000,3000,3000,3000,3000,3000,3000,3000,3000,3000,3000,3000,3000,3000,3000,3000,,,,,,,,,,,,,,,,,,,,,,,,,,,,,,,,,,,,,,,,
3000,3000,3000,3000,3000,3000,3000,3000,3000,3000,3000,3000,3000,3000,3000,3000,3000,3000,,,,,,,,,,,,,,,,,,,,,,,,,,,,,,,,,,,,,,,,
3000,3000,3000,3000,3000,3000,3000,3000,3000,3000,3000,3000,3000,3000,3000,3000,3000,3000,,,,,,,,,,,,,,,,,,,,,,,,,,,,,,,,,,,,,,,,
3000,3000,3000,3000,3000,3000,3000,3000,3000,3000,3000,3000,3000,3000,3000,3000,3000,3000,,,,,,,,,,,,,,,,,,,,,,,,,,,,,,,,,,,,,,,,
3000,3000,3000,3000,3000,3000,3000,3000,3000,3000,3000,3000,3000,3000,3000,3000,3000,3000,,,,,,,,,,,,,,,,,,,,,,,,,,,,,,,,,,,,,,,,
3000,3000,3000,3000,3000,3000,3000,3000,3000,3000,3000,3000,3000,3000,3000,3000,3000,3000,,,,,,,,,,,,,,,,,,,,,,,,,,,,,,,,,,,,,,,,
3000,3000,3000,3000,3000,3000,3000,3000,3000,3000,3000,3000,3000,3000,3000,3000,3000,3000,,,,,,,,,,,,,,,,,,,,,,,,,,,,,,,,,,,,,,,,
3000,3000,3000,3000,3000,3000,3000,3000,3000,3000,3000,3000,3000,3000,3000,3000,3000,3000,,,,,,,,,,,,,,,,,,,,,,,,,,,,,,,,,,,,,,,,
3000,3000,3000,3000,3000,3000,3000,3000,3000,3000,3000,3000,3000,3000,3000,3000,3000,3000,,,,,,,,,,,,,,,,,,,,,,,,,,,,,,,,,,,,,,,,
3000,3000,3000,3000,3000,3000,3000,3000,3000,3000,3000,3000,3000,3000,3000,3000,3000,3000,,,,,,,,,,,,,,,,,,,,,,,,,,,,,,,,,,,,,,,,
3000,3000,3000,3000,3000,3000,3000,3000,3000,3000,3000,3000,3000,3000,3000,3000,3000,3000,,,,,,,,,,,,,,,,,,,,,,,,,,,,,,,,,,,,,,,,
3000,3000,3000,3000,3000,3000,3000,3000,3000,3000,3000,3000,3000,3000,3000,3000,3000,3000,,,,,,,,,,,,,,,,,,,,,,,,,,,,,,,,,,,,,,,,
3000,3000,3000,3000,3000,3000,3000,3000,3000,3000,3000,3000,3000,3000,3000,3000,3000,3000,,,,,,,,,,,,,,,,,,,,,,,,,,,,,,,,,,,,,,,,
3000,3000,3000,3000,3000,3000,3000,3000,3000,3000,3000,3000,3000,3000,3000,3000,3000,3000,,,,,,,,,,,,,,,,,,,,,,,,,,,,,,,,,,,,,,,,
3000,3000,3000,3000,3000,3000,3000,3000,3000,3000,3000,3000,3000,3000,3000,3000,3000,3000,,,,,,,,,,,,,,,,,,,,,,,,,,,,,,,,,,,,,,,,
3000,3000,3000,3000,3000,3000,3000,3000,3000,3000,3000,3000,3000,3000,3000,3000,3000,3000,,,,,,,,,,,,,,,,,,,,,,,,,,,,,,,,,,,,,,,,
3000,3000,3000,3000,3000,3000,3000,3000,3000,3000,3000,3000,3000,3000,3000,3000,3000,3000,,,,,,,,,,,,,,,,,,,,,,,,,,,,,,,,,,,,,,,,
3000,3000,3000,3000,3000,3000,3000,3000,3000,3000,3000,3000,3000,3000,3000,3000,3000,3000,,,,,,,,,,,,,,,,,,,,,,,,,,,,,,,,,,,,,,,,
3000,3000,3000,3000,3000,3000,3000,3000,3000,3000,3000,3000,3000,3000,3000,3000,3000,3000,,,,,,,,,,,,,,,,,,,,,,,,,,,,,,,,,,,,,,,,
3000,3000,3000,3000,3000,3000,3000,3000,3000,3000,3000,3000,3000,3000,3000,3000,3000,3000,,,,,,,,,,,,,,,,,,,,,,,,,,,,,,,,,,,,,,,,
3000,3000,3000,3000,3000,3000,3000,3000,3000,3000,3000,3000,3000,3000,3000,3000,3000,3000,,,,,,,,,,,,,,,,,,,,,,,,,,,,,,,,,,,,,,,,
3000,3000,3000,3000,3000,3000,3000,3000,3000,3000,3000,3000,3000,3000,3000,3000,3000,3000,,,,,,,,,,,,,,,,,,,,,,,,,,,,,,,,,,,,,,,,
3000,3000,3000,3000,3000,3000,3000,3000,3000,3000,3000,3000,3000,3000,3000,3000,3000,3000,,,,,,,,,,,,,,,,,,,,,,,,,,,,,,,,,,,,,,,,
3000,3000,3000,3000,3000,3000,3000,3000,3000,3000,3000,3000,3000,3000,3000,3000,3000,3000,,,,,,,,,,,,,,,,,,,,,,,,,,,,,,,,,,,,,,,,
3000,3000,3000,3000,3000,3000,3000,3000,3000,3000,3000,3000,3000,3000,3000,3000,3000,3000,,,,,,,,,,,,,,,,,,,,,,,,,,,,,,,,,,,,,,,,
3000,3000,3000,3000,3000,3000,3000,3000,3000,3000,3000,3000,3000,3000,3000,3000,3000,3000,,,,,,,,,,,,,,,,,,,,,,,,,,,,,,,,,,,,,,,,
3000,3000,3000,3000,3000,3000,3000,3000,3000,3000,3000,3000,3000,3000,3000,3000,3000,3000,,,,,,,,,,,,,,,,,,,,,,,,,,,,,,,,,,,,,,,,
3000,3000,3000,3000,3000,3000,3000,3000,3000,3000,3000,3000,3000,3000,3000,3000,3000,3000,,,,,,,,,,,,,,,,,,,,,,,,,,,,,,,,,,,,,,,,
3000,3000,3000,3000,3000,3000,3000,3000,3000,3000,3000,3000,3000,3000,3000,3000,3000,3000,,,,,,,,,,,,,,,,,,,,,,,,,,,,,,,,,,,,,,,,
3000,3000,3000,3000,3000,3000,3000,3000,3000,3000,3000,3000,3000,3000,3000,3000,3000,3000,,,,,,,,,,,,,,,,,,,,,,,,,,,,,,,,,,,,,,,,
3000,3000,3000,3000,3000,3000,3000,3000,3000,3000,3000,3000,3000,3000,3000,3000,3000,3000,,,,,,,,,,,,,,,,,,,,,,,,,,,,,,,,,,,,,,,,
#,full_min,,,,,,,,,,,,,,,,,,,,,,,,,,,,,,,,,,,,,,,,,,,,,,,,,,,,,,,,
200,1000,1000,1000,1000,1000,1000,1000,1000,1000,1000,1000,1000,1000,1000,1000,1000,200,,,,,,,,,,,,,,,,,,,,,,,,,,,,,,,,,,,,,,,,
1000,1000,1000,1000,1000,1000,1000,1000,1000,1000,1000,1000,1000,1000,1000,1000,1000,1000,,,,,,,,,,,,,,,,,,,,,,,,,,,,,,,,,,,,,,,,
1000,1000,1000,1000,1000,1000,1000,1000,1000,1000,1000,1000,1000,1000,1000,1000,1000,1000,,,,,,,,,,,,,,,,,,,,,,,,,,,,,,,,,,,,,,,,
1000,1000,1000,1000,1000,1000,1000,1000,1000,1000,1000,1000,1000,1000,1000,1000,1000,1000,,,,,,,,,,,,,,,,,,,,,,,,,,,,,,,,,,,,,,,,
1000,1000,1000,1000,1000,1000,1000,1000,1000,1000,1000,1000,1000,1000,1000,1000,1000,1000,,,,,,,,,,,,,,,,,,,,,,,,,,,,,,,,,,,,,,,,
1000,1000,1000,1000,1000,1000,1000,1000,1000,1000,1000,1000,1000,1000,1000,1000,1000,1000,,,,,,,,,,,,,,,,,,,,,,,,,,,,,,,,,,,,,,,,
1000,1000,1000,1000,1000,1000,1000,1000,1000,1000,1000,1000,1000,1000,1000,1000,1000,1000,,,,,,,,,,,,,,,,,,,,,,,,,,,,,,,,,,,,,,,,
1000,1000,1000,1000,1000,1000,1000,1000,1000,1000,1000,1000,1000,1000,1000,1000,1000,1000,,,,,,,,,,,,,,,,,,,,,,,,,,,,,,,,,,,,,,,,
1000,1000,1000,1000,1000,1000,1000,1000,1000,1000,1000,1000,1000,1000,1000,1000,1000,1000,,,,,,,,,,,,,,,,,,,,,,,,,,,,,,,,,,,,,,,,
1000,1000,1000,1000,1000,1000,1000,1000,1000,1000,1000,1000,1000,1000,1000,1000,1000,1000,,,,,,,,,,,,,,,,,,,,,,,,,,,,,,,,,,,,,,,,
1000,1000,1000,1000,1000,1000,1000,1000,1000,1000,1000,1000,1000,1000,1000,1000,1000,1000,,,,,,,,,,,,,,,,,,,,,,,,,,,,,,,,,,,,,,,,
1000,1000,1000,1000,1000,1000,1000,1000,1000,1000,1000,1000,1000,1000,1000,1000,1000,1000,,,,,,,,,,,,,,,,,,,,,,,,,,,,,,,,,,,,,,,,
1000,1000,1000,1000,1000,1000,1000,1000,1000,1000,1000,1000,1000,1000,1000,1000,1000,1000,,,,,,,,,,,,,,,,,,,,,,,,,,,,,,,,,,,,,,,,
1000,1000,1000,1000,1000,1000,1000,1000,1000,1000,1000,1000,1000,1000,1000,1000,1000,1000,,,,,,,,,,,,,,,,,,,,,,,,,,,,,,,,,,,,,,,,
1000,1000,1000,1000,1000,1000,1000,1000,1000,1000,1000,1000,1000,1000,1000,1000,1000,1000,,,,,,,,,,,,,,,,,,,,,,,,,,,,,,,,,,,,,,,,
1000,1000,1000,1000,1000,1000,1000,1000,1000,1000,1000,1000,1000,1000,1000,1000,1000,1000,,,,,,,,,,,,,,,,,,,,,,,,,,,,,,,,,,,,,,,,
1000,1000,1000,1000,1000,1000,1000,1000,1000,1000,1000,1000,1000,1000,1000,1000,1000,1000,,,,,,,,,,,,,,,,,,,,,,,,,,,,,,,,,,,,,,,,
1000,1000,1000,1000,1000,1000,1000,1000,1000,1000,1000,1000,1000,1000,1000,1000,1000,1000,,,,,,,,,,,,,,,,,,,,,,,,,,,,,,,,,,,,,,,,
1000,1000,1000,1000,1000,1000,1000,1000,1000,1000,1000,1000,1000,1000,1000,1000,1000,1000,,,,,,,,,,,,,,,,,,,,,,,,,,,,,,,,,,,,,,,,
1000,1000,1000,1000,1000,1000,1000,1000,1000,1000,1000,1000,1000,1000,1000,1000,1000,1000,,,,,,,,,,,,,,,,,,,,,,,,,,,,,,,,,,,,,,,,
1000,1000,1000,1000,1000,1000,1000,1000,1000,1000,1000,1000,1000,1000,1000,1000,1000,1000,,,,,,,,,,,,,,,,,,,,,,,,,,,,,,,,,,,,,,,,
1000,1000,1000,1000,1000,1000,1000,1000,1000,1000,1000,1000,1000,1000,1000,1000,1000,1000,,,,,,,,,,,,,,,,,,,,,,,,,,,,,,,,,,,,,,,,
1000,1000,1000,1000,1000,1000,1000,1000,1000,1000,1000,1000,1000,1000,1000,1000,1000,1000,,,,,,,,,,,,,,,,,,,,,,,,,,,,,,,,,,,,,,,,
1000,1000,1000,1000,1000,1000,1000,1000,1000,1000,1000,1000,1000,1000,1000,1000,1000,1000,,,,,,,,,,,,,,,,,,,,,,,,,,,,,,,,,,,,,,,,
1000,1000,1000,1000,1000,1000,1000,1000,1000,1000,1000,1000,1000,1000,1000,1000,1000,1000,,,,,,,,,,,,,,,,,,,,,,,,,,,,,,,,,,,,,,,,
1000,1000,1000,1000,1000,1000,1000,1000,1000,1000,1000,1000,1000,1000,1000,1000,1000,1000,,,,,,,,,,,,,,,,,,,,,,,,,,,,,,,,,,,,,,,,
1000,1000,1000,1000,1000,1000,1000,1000,1000,1000,1000,1000,1000,1000,1000,1000,1000,1000,,,,,,,,,,,,,,,,,,,,,,,,,,,,,,,,,,,,,,,,
1000,1000,1000,1000,1000,1000,1000,1000,1000,1000,1000,1000,1000,1000,1000,1000,1000,1000,,,,,,,,,,,,,,,,,,,,,,,,,,,,,,,,,,,,,,,,
1000,1000,1000,1000,1000,1000,1000,1000,1000,1000,1000,1000,1000,1000,1000,1000,1000,1000,,,,,,,,,,,,,,,,,,,,,,,,,,,,,,,,,,,,,,,,
1000,1000,1000,1000,1000,1000,1000,1000,1000,1000,1000,1000,1000,1000,1000,1000,1000,1000,,,,,,,,,,,,,,,,,,,,,,,,,,,,,,,,,,,,,,,,
1000,1000,1000,1000,1000,1000,1000,1000,1000,1000,1000,1000,1000,1000,1000,1000,1000,1000,,,,,,,,,,,,,,,,,,,,,,,,,,,,,,,,,,,,,,,,
1000,1000,1000,1000,1000,1000,1000,1000,1000,1000,1000,1000,1000,1000,1000,1000,1000,1000,,,,,,,,,,,,,,,,,,,,,,,,,,,,,,,,,,,,,,,,
1000,1000,1000,1000,1000,1000,1000,1000,1000,1000,1000,1000,1000,1000,1000,1000,1000,1000,,,,,,,,,,,,,,,,,,,,,,,,,,,,,,,,,,,,,,,,
1000,1000,1000,1000,1000,1000,1000,1000,1000,1000,1000,1000,1000,1000,1000,1000,1000,1000,,,,,,,,,,,,,,,,,,,,,,,,,,,,,,,,,,,,,,,,
1000,1000,1000,1000,1000,1000,1000,1000,1000,1000,1000,1000,1000,1000,1000,1000,1000,1000,,,,,,,,,,,,,,,,,,,,,,,,,,,,,,,,,,,,,,,,
1000,1000,1000,1000,1000,1000,1000,1000,1000,1000,1000,1000,1000,1000,1000,1000,1000,1000,,,,,,,,,,,,,,,,,,,,,,,,,,,,,,,,,,,,,,,,
1000,1000,1000,1000,1000,1000,1000,1000,1000,1000,1000,1000,1000,1000,1000,1000,1000,1000,,,,,,,,,,,,,,,,,,,,,,,,,,,,,,,,,,,,,,,,
1000,1000,1000,1000,1000,1000,1000,1000,1000,1000,1000,1000,1000,1000,1000,1000,1000,1000,,,,,,,,,,,,,,,,,,,,,,,,,,,,,,,,,,,,,,,,
1000,1000,1000,1000,1000,1000,1000,1000,1000,1000,1000,1000,1000,1000,1000,1000,1000,1000,,,,,,,,,,,,,,,,,,,,,,,,,,,,,,,,,,,,,,,,
200,1000,1000,1000,1000,1000,1000,1000,1000,1000,1000,1000,1000,1000,1000,1000,1000,200,,,,,,,,,,,,,,,,,,,,,,,,,,,,,,,,,,,,,,,,
#,full_row_delta_max,,,,,,,,,,,,,,,,,,,,,,,,,,,,,,,,,,,,,,,,,,,,,,,,,,,,,,,,
9000,3500,2340,2340,2340,2340,2340,2340,2340,2340,2340,2340,2340,2340,2340,2340,2340,2340,2340,2340,2340,2340,2340,2340,2340,2340,2340,2340,2340,2340,2340,2340,2340,2340,2340,2340,2340,3000,9000,,,,,,,,,,,,,,,,,,,
#,full_row_delta_min,,,,,,,,,,,,,,,,,,,,,,,,,,,,,,,,,,,,,,,,,,,,,,,,,,,,,,,,
-9000,-3500,-2340,-2340,-2340,-2340,-2340,-2340,-2340,-2340,-2340,-2340,-2340,-2340,-2340,-2340,-2340,-2340,-2340,-2340,-2340,-2340,-2340,-2340,-2340,-2340,-2340,-2340,-2340,-2340,-2340,-2340,-2340,-2340,-2340,-2340,-2340,-3000,-9000,,,,,,,,,,,,,,,,,,,
#,full_col_delta_max,,,,,,,,,,,,,,,,,,,,,,,,,,,,,,,,,,,,,,,,,,,,,,,,,,,,,,,,
6000,3600,3600,3600,3600,3600,3600,3600,3600,4500,3600,3600,3600,3600,3600,3600,6000,,,,,,,,,,,,,,,,,,,,,,,,,,,,,,,,,,,,,,,,,
#,full_col_delta_min,,,,,,,,,,,,,,,,,,,,,,,,,,,,,,,,,,,,,,,,,,,,,,,,,,,,,,,,
-6000,-3600,-3600,-3600,-3600,-3600,-3600,-4500,-3600,-3600,-3600,-3600,-3600,-3600,-3600,-3600,-6000,,,,,,,,,,,,,,,,,,,,,,,,,,,,,,,,,,,,,,,,,
