0 0 0 0 
0 0 0 0 
0 0 0 0 
0 0 0 0 
0 0 0 0 
0 0 0 0 
0 0 0 0 
0 0 0 0 
0 0 0 0 
0 0 0 0 
0.0149760572239757 1.16168821477913e-05 2.75830003282351e-09 3.06825098661534e-09 
0.0255437660962343 1.10488545033149e-05 -2.87064182202812e-07 -1.98566539211242e-07 
0.0350837260484695 1.39516632771119e-05 -4.16320382612412e-08 -2.9911429777485e-08 
0.0455325096845627 1.52423963299952e-05 3.73428633793083e-07 2.65047059855306e-08 
0.0570843704044819 1.70485236594686e-05 -2.0941722311818e-07 2.46324873387493e-07 
0.0689316987991333 1.70610965142259e-05 7.2730998113002e-08 -2.1550451378971e-07 
0.0802902430295944 1.50669793583802e-05 -1.3519677821705e-08 1.33294747683976e-07 
0.0910379961133003 1.12321131382487e-05 9.54098489103217e-09 -7.76410189473609e-08 
0.100501410663128 7.39805864213849e-06 8.37259772623611e-09 5.00681842652284e-08 
0.108209267258644 2.08396158996038e-06 1.29451516173162e-09 -2.45443469992779e-08 
0.114737890660763 -3.85032490157755e-06 -6.01499960950491e-09 -1.59883786210457e-08 
0.121012337505817 -7.23165430827066e-06 -1.19762102457344e-08 -7.03635905097144e-09 
0.126686587929726 -1.10763421616866e-05 -7.97165888855034e-09 5.966654725853e-09 
0.131633400917053 -1.3982355085318e-05 -7.5928809906145e-09 5.39712274871817e-09 
0.13586014509201 -1.54912813741248e-05 -8.12712563913465e-09 -1.51793322356042e-09 
0.139439851045609 -1.39488956847345e-05 3.34524352663124e-10 -3.65038355099045e-09 
0.142609417438507 -1.53510700329207e-05 -8.96291574292718e-09 -4.40606884311023e-09 
0.14553439617157 -1.21965558719239e-05 -2.93272250928567e-09 -3.62233842921e-09 
0.148593753576279 -1.01536161309923e-05 1.2755577927237e-08 1.02345625307976e-08 
0.151237711310387 -7.69254802435171e-06 1.16091614099645e-09 -1.44509881838673e-09 
0.153871208429337 -6.81487426845706e-06 2.58738497294075e-09 -1.75392456114309e-09 
0.156094163656235 -3.84519353247015e-06 8.06191557956026e-09 5.33758548471042e-09 
0.158017531037331 -3.06184733744885e-06 4.24259338771549e-09 6.1876470613953e-10 
0.159443199634552 -1.44281511893496e-06 -2.99588243102278e-09 7.19844073238107e-10 
0.160633593797684 1.17836762569823e-07 1.54485721992614e-08 7.34769134425051e-09 
0.161661103367805 2.40246527027921e-06 6.53972076491982e-09 3.94513977042266e-09 
0.162555456161499 4.30908448834089e-06 -1.11939846281217e-09 -3.81395537374374e-09 
0.163613542914391 6.4209943957394e-06 4.36896918643015e-09 -6.12276951361679e-10 
0.164584904909134 8.82745189301204e-06 2.30400920564477e-09 -6.25352702954274e-09 
0.16534611582756 9.36580363486428e-06 1.18142899907525e-08 2.06157785287431e-10 
0.165890946984291 8.83759548742091e-06 2.8970932319794e-09 1.80050785392183e-09 
0.165820002555847 7.87247972766636e-06 -8.23908763436521e-09 8.67857341546596e-09 
0.165042042732239 8.47163846628973e-06 -3.7817811104901e-09 -5.90948845413664e-09 
0.163833826780319 6.85218583384994e-06 -1.00046495532524e-08 -1.39072682259211e-08 
0.162032023072243 7.70614042266971e-06 -2.67462141323449e-08 -6.70576927319644e-09 
0.159693777561188 6.10041661275318e-06 -1.52278678555717e-09 7.99643551374629e-09 
0.1571394354105 7.93823528510984e-06 -1.71135250415233e-09 3.62119134678096e-09 
0.154387354850769 5.03254432260292e-06 2.36459696267843e-09 1.34137190244132e-09 
0.151184216141701 4.35412493970944e-06 -2.53152876439344e-09 3.85013754211627e-09 
0.148165673017502 2.50083621722297e-06 2.59189669726823e-09 -2.22536900018611e-09 
0.145056262612343 4.09178392146714e-06 1.58476556322285e-08 1.7713103872552e-08 
0.141812697052956 5.09082781263714e-07 -7.90311105447472e-09 -1.48808576572179e-09 
0.138228103518486 3.04491209135449e-07 3.74289843563247e-09 -5.56776091897859e-09 
0.134066209197044 -1.16769847124942e-07 5.54653567519381e-09 7.16681505807948e-11 
0.129375785589218 -1.34856122713245e-06 -5.96810112440949e-09 -1.37278211020941e-09 
0.124223873019218 -2.41132920564269e-06 5.78890047009395e-09 4.73885553020637e-09 
0.119132585823536 -1.50623577610531e-06 -3.7313445666598e-09 1.57498591946137e-09 
0.114095740020275 -2.28037947636039e-06 4.20883861096399e-09 3.96981530981222e-10 
0.109254203736782 -1.6520144754395e-06 -1.64148128423136e-09 3.45528855527633e-10 
0.104420758783817 7.81337945454652e-08 1.31474857667513e-08 3.124952296929e-09 
0.0996740534901619 1.39084349370933e-07 -5.86019677228933e-09 1.68120822818807e-10 
0.094586655497551 1.89317617582674e-07 2.60463850487724e-09 3.23014970327051e-09 
0.0894413068890572 -5.88719785810099e-07 -3.31820593224563e-09 -9.06999275684939e-09 
0.0842783376574516 -3.55324891643249e-06 7.05903246966955e-09 3.65829122550565e-09 
0.0788634270429611 -4.58283921034308e-06 -1.25661179239955e-08 -8.66747740246865e-09 
0.0734979882836342 -4.82432733406313e-06 -6.04553029859289e-09 -2.10092165886522e-09 
0.0683675929903984 -4.79789332530345e-06 -1.99693905855725e-09 -1.24142451873865e-09 
0.0633736029267311 -3.28474106936483e-06 -1.92695770451223e-09 -1.83118931129655e-09 
0.0588288605213165 -1.88123601674306e-06 4.66337635174341e-09 2.73626121760628e-10 
0.0549120157957077 -2.33212426792306e-06 1.04494946029376e-09 9.51714929087188e-10 
0.0513533838093281 -1.68619897067401e-06 1.40295430828274e-09 -2.65341304483968e-10 
0.0481626056134701 -1.652109403949e-06 -1.46589185234802e-09 -2.57115817525744e-09 
0.0454884096980095 -1.44566627113818e-06 2.8444611110956e-09 8.90481632875861e-10 
0.0430999621748924 -2.64470486399659e-07 6.18696149867759e-10 5.78143588558788e-10 
0.0409904196858406 -4.42013288193266e-07 -9.3485641450286e-10 2.58029070332455e-10 
0.0391626991331577 -1.2418787491697e-06 -6.71086852754854e-10 8.71358485365903e-10 
0.0375908762216568 -1.74916090145416e-06 9.16666742512007e-11 6.4869254412514e-10 
0.0359664261341095 -1.79320340976119e-06 -1.60253599279514e-09 -1.78441394993456e-09 
0.0344811156392097 -3.11046983370034e-06 2.42349784684848e-09 9.98356064485506e-10 
0.0329607985913754 -2.82136602436367e-06 -1.23886956249208e-09 9.00142183013486e-10 
0.0315182544291019 -2.81621873909899e-06 -2.14700057732387e-09 -9.87826043186146e-10 
0.030102027580142 -2.67153609456727e-06 1.98129423978344e-09 -7.31150306965134e-10 
0.0287983249872923 -2.75539537142322e-06 -5.51238943380383e-10 -6.31851015953089e-10 
0.0274319965392351 -2.80894414572685e-06 2.52163095959546e-10 -1.77805492551641e-09 
0.026210056617856 -2.27157443077886e-06 1.61605551163291e-09 -3.99000776862835e-10 
0.0249872989952564 -2.7213636712986e-06 -1.25992694055554e-09 -2.22920570891461e-09 
0.0238276366144419 -2.9929240099591e-06 3.56388279998399e-10 -1.75674919056235e-10 
0.0226390566676855 -3.59323234988551e-06 -1.37268574285088e-09 -2.4658743935646e-09 
0.0216387491673231 -3.33000957652985e-06 7.37586880461549e-10 -3.75419251241738e-10 
0.0206927638500929 -4.16203874920029e-06 -2.0171227188559e-10 -8.91729634577842e-10 
0.0198985245078802 -2.94007077172864e-06 5.12357711812683e-10 -2.06899247734427e-10 
0.0191762391477823 -2.40227518588654e-06 5.91406368322112e-10 -1.36870159650471e-09 
0.0186181832104921 -1.79093729002489e-06 7.51553819178241e-10 -6.40267672213923e-10 
0.0181269999593496 -1.89776869774505e-06 9.69408164852581e-11 -1.00697575278197e-10 
0.0176952201873064 -1.82202279574994e-06 -1.91370155833148e-10 -1.4100069722911e-10 
0.0172883626073599 -2.22084736378747e-06 -1.2745650368462e-10 -9.27348364765379e-10 
0.0170408021658659 -2.20488618651871e-06 -4.93165175363686e-10 -9.31535959480811e-10 
0.016782509163022 -2.53360121860169e-06 -3.69563407653928e-11 -3.97920751904479e-10 
0.0165672395378351 -2.21447521653317e-06 -9.49858303123108e-10 -1.18363396861554e-09 
0.0164394695311785 -1.99272426470998e-06 1.72138997500682e-10 -1.6213144715671e-10 
0.0163009781390429 -2.18108652916271e-06 -6.77586264874463e-10 -1.27817589845591e-09 
0.0161184705793858 -3.00673491437919e-06 1.25330468225826e-09 -1.11835407601291e-09 
0.0159522090107203 -3.05133380607003e-06 -7.09016512168148e-10 -5.02375807620581e-10 
0.0157548189163208 -3.85731118512922e-06 5.12598685720178e-10 -6.86055878773573e-10 
0.0154479099437594 -4.57703936262988e-06 -5.54862489288155e-10 1.75316774986278e-10 
0.0151363499462605 -5.00220676258323e-06 -1.08673625653921e-09 -1.14035381137967e-09 
0.0147041380405426 -4.95587892146432e-06 -2.19239670862237e-09 -8.85891526802851e-10 
0.0142958322539926 -5.06172955283546e-06 -2.32737829009011e-09 -2.14662709829838e-09 
0.0138201732188463 -4.86822773382301e-06 -1.43735412461155e-09 2.99057653641022e-11 
0.0133873801678419 -4.53502480013412e-06 2.90206157715911e-11 -8.8885715454623e-10 
0.0128790494054556 -4.06708295486169e-06 5.66099181420476e-11 -1.13322773387381e-09 
0.0123978797346354 -3.60137596544519e-06 -6.97281288264406e-10 -6.34255259424066e-10 
0.0119059439748526 -3.48861954080348e-06 -1.11514653067246e-09 -1.12075715374971e-09 
0.0114663550630212 -3.02429157272854e-06 -3.59952206929748e-10 -1.09465292386091e-09 
0.0110632330179214 -2.74653575615957e-06 5.54501389249396e-10 2.19643664367553e-10 
0.0106923542916775 -2.60385172623501e-06 1.57801161027038e-10 4.00079136486653e-10 
0.0103865209966898 -2.31805415751296e-06 3.54099305432953e-10 -3.27164989544215e-10 
0.0101528568193316 -2.14500141737517e-06 -4.41918057703106e-10 -5.77071057605849e-10 
0.00994493626058102 -1.98499674297636e-06 -2.19883125596176e-10 -5.02089092524471e-10 
0.00975780561566353 -1.88481089935522e-06 -9.10179376312215e-10 -1.08442210766668e-09 
0.00967110786587 -2.03156946554373e-06 -4.67717142793589e-10 -3.07782271891099e-10 
0.00960324332118034 -2.39065343521361e-06 7.23052506756972e-10 2.01283725798085e-10 
0.00952295586466789 -2.51502251558122e-06 7.48449011100938e-11 -2.44336023635938e-10 
0.00947493221610785 -2.50757307185268e-06 -1.68937752675902e-10 6.86957643547537e-11 
0.00938101392239332 -2.59988655670895e-06 -7.6734429921288e-10 -7.57582607757712e-10 
0.00929161161184311 -2.41683665080927e-06 -5.84389592273027e-10 -2.8214838798668e-10 
0.00920404493808746 -1.94992003343941e-06 -1.19344797933074e-10 -6.42518316329443e-10 
0.00908808130770922 -1.84448572326801e-06 -9.70773683661719e-10 -4.51880172169794e-10 
0.00892291776835918 -1.6791200323496e-06 -1.96346591763152e-10 -1.21359616800376e-10 
0.00879642087966204 -1.3501825151252e-06 1.4593609307112e-11 1.20166834816082e-10 
0.00859454553574324 -1.24432847314893e-06 2.78002870723881e-10 4.00310860848574e-11 
0.00839919038116932 -1.43606507663208e-06 1.20193952013459e-10 -3.68827440810904e-10 
0.00821557268500328 -1.30824946609209e-06 1.80106152214421e-10 -3.40980743640529e-10 
0.00798856001347303 -1.11638178168505e-06 -2.25789928420816e-10 3.38097633223455e-10 
0.00775411771610379 -1.05856156551454e-06 -9.77487424336232e-10 -6.68751887200614e-10 
0.00754520716145635 -7.00843486356462e-07 -4.90572027445069e-10 -4.12770956303987e-10 
0.00728740356862545 -3.73840464362729e-07 2.92153301550968e-10 -1.80814585526434e-10 
0.00701634027063847 1.69773329616874e-07 1.38764055801488e-10 4.65238056412964e-11 
0.00677245296537876 3.91392859455664e-07 2.93347984792192e-10 1.16665760385715e-10 
0.00644442299380898 8.13863437088003e-07 2.01027500201789e-10 3.26827648278183e-10 
0.00609081843867898 1.10662358565605e-06 2.15121226387893e-10 -1.00984463846654e-10 
0.00568748591467738 1.5123788443816e-06 1.3002532384121e-10 1.27626798018809e-10 
0.00520555628463626 1.57054864757811e-06 1.66234151444122e-10 1.98563970821297e-10 
0.00469792261719704 1.80282745532168e-06 2.50424098124924e-10 4.68973748724011e-10 
0.00418414268642664 1.93939604287152e-06 4.66018446054761e-10 7.05150215996042e-10 
0.00366652803495526 1.96658493223367e-06 5.32958066568057e-10 4.42029080005568e-10 
0.00314340647310019 2.08172377824667e-06 3.21297183303315e-10 4.54217746748142e-10 
0.00267145060934126 2.10509824682958e-06 1.00438150851812e-10 4.52063941835945e-10 
0.00222385814413428 1.97799454326741e-06 1.41984382584504e-10 4.15159545630317e-10 
0.00181864388287067 1.71765407230851e-06 3.81201931132225e-10 3.42408823517104e-10 
0.00143548694904894 1.28695558032632e-06 9.63720492297426e-11 2.35139824278363e-10 
0.00112818344496191 8.63075058532559e-07 8.94588500499616e-11 1.64913013800394e-10 
0.00086564477533102 4.91752473408269e-07 8.00587096616567e-11 1.32927224782975e-10 
0.000657340104226023 1.61494128292361e-07 -3.13472130197834e-11 -3.40991263003687e-11 
0.000498145702295005 -6.96031605684766e-08 2.03932305070653e-11 5.32562318897312e-12 
0.000374043389456347 -4.4423281053696e-08 -3.40149761655917e-12 -2.86823880618625e-11 
0.000306926260236651 -9.84022197059176e-09 1.67144891677351e-11 2.36698421279824e-11 
0.000236645893892273 -2.5768184741537e-07 -3.0803498640708e-11 -6.75871580924081e-11 
0.00017987604951486 -3.14545644641839e-07 -3.76141791325058e-11 -7.16780731990774e-11 
0.000127740728203207 -4.31127062938685e-07 -5.5518794422893e-11 -8.99413946098271e-11 
9.57698866841383e-05 -5.14588293754059e-07 -7.04819050345584e-11 -1.15596469896229e-10 
4.11748915212229e-05 -7.89235571119207e-07 -1.07084681399972e-10 -1.79762135732453e-10 
2.05588294193149e-05 -7.00662724284484e-07 -9.50760373208404e-11 -1.57924118227015e-10 
3.72399654224864e-06 -7.845285381336e-07 -1.07503908552964e-10 -1.77784453825325e-10 
1.80666847882094e-06 -6.78284266086848e-07 -9.22871987163454e-11 -1.53822760085021e-10 
-2.65044718616991e-06 -6.69838982503279e-07 -9.14525677409017e-11 -1.51693907435302e-10 
7.15031319487025e-06 -5.1429236691547e-07 -7.05117908506026e-11 -1.16814044548441e-10 
1.26792383525753e-05 -4.50027158649391e-07 -6.17811982128735e-11 -1.02244587796285e-10 
1.3566870620707e-05 -3.30597828224199e-07 -4.59484082726558e-11 -7.44198105917526e-11 
2.15777563425945e-05 -3.43818499004556e-07 -4.81021299181261e-11 -7.76081768294468e-11 
2.2315709884424e-06 -3.27768276520146e-07 -4.44325340409613e-11 -7.42421610300248e-11 
0 0 0 0 
0 0 0 0 
0 0 0 0 
0 0 0 0 
0 0 0 0 
0 0 0 0 
0 0 0 0 
0 0 0 0 
0 0 0 0 
0 0 0 0 
0 0 0 0 
0 0 0 0 
0 0 0 0 
0 0 0 0 
99.9920120239258 0.00669704424217343 5.25550603924785e-05 4.20498981839046e-05 
