0.000202189185074531 -8.65711845108308e-05 
0.000455975532531738 -0.00311373895965517 
0.000677094969432801 -0.0072447657585144 
0.00093855318846181 -0.0115893483161926 
0.00120437412988394 -0.0158390365540981 
0.00166085385717452 -0.021385196596384 
0.00224254280328751 -0.027267012745142 
0.0030847939196974 -0.0332501120865345 
0.00399819295853376 -0.0376352407038212 
0.00491596292704344 -0.0428125448524952 
0.00582716427743435 -0.0472287535667419 
0.006695038639009 -0.0485686995089054 
0.00751256663352251 -0.0469906106591225 
0.00821857620030642 -0.0442968383431435 
0.00869807321578264 -0.0412450507283211 
0.00895321741700172 -0.0377820655703545 
0.00906211882829666 -0.0301440097391605 
0.00900005642324686 -0.0238103866577148 
0.00891005713492632 -0.01674241758883 
0.00867119617760181 -0.0141386622563004 
0.00842704810202122 -0.0117522673681378 
0.00804960634559393 -0.0107190683484077 
0.00765625713393092 -0.00870705302804708 
0.00726693030446768 -0.0066395471803844 
0.00692849652841687 -0.00595279317349195 
0.00659778760746121 -0.00625663297250867 
0.00628418242558837 -0.00657786848023534 
0.00604130560532212 -0.00642215833067894 
0.005775211378932 -0.00565335620194674 
0.00553970783948898 -0.00543556781485677 
0.00527399685233831 -0.00493255397304893 
0.00504577253013849 -0.00490610115230083 
0.00479916017502546 -0.0048358179628849 
0.00456230854615569 -0.00499436119571328 
0.00431862659752369 -0.00534076476469636 
0.00401390716433525 -0.00535394344478846 
0.00376238115131855 -0.00448261527344584 
0.0035286545753479 -0.00400693947449327 
0.0035094793420285 -0.00351919210515916 
0.00354862352833152 -0.0038654173258692 
0.00365102826617658 -0.00374224665574729 
0.00375166838057339 -0.00411663157865405 
0.00388263002969325 -0.00397708499804139 
0.00410747015848756 -0.00418429635465145 
0.00440073665231466 -0.00430578924715519 
0.004758071154356 -0.00471799867227674 
0.00520205125212669 -0.00492717232555151 
0.00566420145332813 -0.00503815524280071 
0.00615580333396792 -0.00504323793575168 
0.00667127268388867 -0.00496247783303261 
0.00716329459100962 -0.00472440756857395 
0.00763748167082667 -0.00474245613440871 
0.00800163950771093 -0.00331993843428791 
0.00838183052837849 -0.00238067121244967 
0.00874420721083879 -0.00180955755058676 
0.0091170771047473 -0.00194634951185435 
0.00947096943855286 -0.00183165224734694 
0.00982821453362703 -0.00127798551693559 
0.0102116856724024 -0.00131483713630587 
0.0105994837358594 -0.001517154276371 
0.0109967160969973 -0.00158404989633709 
0.0113801872357726 -0.00213301228359342 
0.0118619352579117 -0.00177265296224505 
0.0124143566936255 -0.00238765263929963 
0.0131244556978345 -0.00300184753723443 
0.0139380330219865 -0.00447520799934864 
0.0148947658017278 -0.00428759586066008 
0.0159741714596748 -0.00469244690611959 
0.0171353332698345 -0.0061236284673214 
0.0183809399604797 -0.00762415397912264 
0.0195884592831135 -0.00919555500149727 
0.0207167379558086 -0.00937898084521294 
0.0216781925410032 -0.0108425840735435 
0.0224137306213379 -0.0121524026617408 
0.0227278769016266 -0.014688671566546 
0.0225523076951504 -0.0153709668666124 
0.0220000538975 -0.0141969779506326 
0.0211302489042282 -0.0144364619627595 
0.0201682150363922 -0.0152211366221309 
0.0191440712660551 -0.0152084324508905 
0.0183588601648808 -0.0131721254438162 
0.0176322869956493 -0.0131897367537022 
0.0171270053833723 -0.0137172564864159 
0.0167630631476641 -0.014401406981051 
0.016584224998951 -0.0131458472460508 
0.0165302529931068 -0.01452268473804 
0.0164903178811073 -0.0146646276116371 
0.0166283212602139 -0.015381321310997 
0.016775706782937 -0.0158583577722311 
0.01705551892519 -0.0167431961745024 
0.0173713322728872 -0.0182269755750895 
0.0178326088935137 -0.0199839975684881 
0.0184482913464308 -0.0208943225443363 
0.0194632764905691 -0.0240262839943171 
0.0213650111109018 -0.0252697449177504 
0.0251423586159945 -0.0300588700920343 
0.0322558805346489 -0.0401082895696163 
0.0442445017397404 -0.0563613325357437 
0.0621478892862797 -0.0755374506115913 
0.0858801305294037 -0.0806117430329323 
0.113711938261986 -0.0857217386364937 
0.142397657036781 -0.0851711556315422 
0.167647778987885 -0.088672049343586 
0.187312170863152 -0.0939442366361618 
0.200517848134041 -0.0847924575209618 
0.208597585558891 -0.0858448073267937 
0.212466150522232 -0.0747080817818642 
0.214158937335014 -0.0712799951434135 
0.21390363574028 -0.0729582011699677 
0.211608231067657 -0.0745434537529945 
0.208020761609077 -0.0827447697520256 
0.203821778297424 -0.0639654546976089 
0.19957135617733 -0.0573383830487728 
0.195421159267426 -0.0524952933192253 
0.190847009420395 -0.0559703446924686 
0.186883166432381 -0.0520555339753628 
0.182307168841362 -0.0371138229966164 
0.177574992179871 -0.0214601457118988 
0.172930344939232 -0.00150802475400269 
0.167919084429741 0.0112722041085362 
0.162943080067635 0.0281843654811382 
0.157449036836624 0.0329165570437908 
0.151502683758736 0.0357303097844124 
0.145811572670937 0.0320153646171093 
0.140188664197922 0.043890081346035 
0.134665176272392 0.0544404834508896 
0.128750458359718 0.0665705725550652 
0.122531175613403 0.0766619518399239 
0.116270363330841 0.0987052991986275 
0.109950609505177 0.118904627859592 
0.103105768561363 0.139137133955956 
0.0964010432362556 0.162672013044357 
0.0894655659794807 0.180893838405609 
0.0827561467885971 0.204124137759209 
0.0760288015007973 0.213333308696747 
0.0696374103426933 0.230792924761772 
0.0631821826100349 0.236534744501114 
0.0568212047219276 0.245442762970924 
0.0503824278712273 0.2484260648489 
0.0444619320333004 0.252162605524063 
0.0389467291533947 0.244864866137505 
0.0339053086936474 0.233385890722275 
0.0287882033735514 0.214345127344131 
0.0238823927938938 0.19816829264164 
0.0193041898310184 0.179426595568657 
0.0155806476250291 0.161947637796402 
0.0124134765937924 0.141102254390717 
0.00975397787988186 0.118666917085648 
0.00740148453041911 0.0940669402480125 
0.00551747158169746 0.0706010758876801 
0.00400281744077802 0.0511414259672165 
0.00292427954263985 0.0359320901334286 
0.00208858423866332 0.0235150512307882 
0.0015402560820803 0.0134263252839446 
0.00114305759780109 0.00657231034711003 
0.000888878537807614 0.00226340116932988 
0.000715134723577648 -0.000210000551305711 
0.000539619708433747 -0.000873033714015037 
0.000435093941632658 -0.00183470849879086 
0.000351077876985073 -0.00316736754029989 
0.000316747813485563 -0.00453090714290738 
0.000275139260338619 -0.00385748245753348 
0.0002606266643852 -0.00371772446669638 
0.00026629789499566 -0.00345944962464273 
0.000207663819310255 -0.00312414229847491 
0.000212127226404846 -0.00259958975948393 
0.000153329150634818 -0.0026795519515872 
0.00011248385271756 -0.0023250668309629 
4.12621557188686e-05 -0.00230829231441021 
6.61285157548264e-05 -0.00249416171573102 
7.67304009059444e-05 -0.0030238174367696 
7.50992840039544e-05 -0.00211048312485218 
2.41230009123683e-05 -0.001126101706177 
3.32641320710536e-05 -0.000769597536418587 
2.37447711697314e-05 -0.00103252509143203 
5.18992710567545e-05 -0.00184631184674799 
5.76613310840912e-05 -0.00153736840002239 
4.55856679764111e-05 -0.00142965489067137 
2.49796939897351e-05 -0.000705038430169225 
-2.19555477087852e-05 -0.000947488122619689 
-1.08926833490841e-05 -0.00146854761987925 
-1.64347711688606e-05 -0.00148771854583174 
8.66567404500529e-07 -0.00192426471039653 
6.44924239168176e-06 -0.00179497327189893 
2.18590939766727e-05 -0.00151270569767803 
