{
    "AsrParams":{
        "Enrollment":[false, 0, 240, 2000, 100, 0, 30000, 1, 0, 1, 20000, 20, 0.3, 0.00, -0.1, 0.38, 0.1, 0],
	"Recognition":[false, 0, 240, 2000, 400, 0, 30000, 1, 0, 1, 20000, 20, 0.225, -0.05, -0.12, 0.225, -0.05, -0.12],
        "NoiseRecognition":[false, 0, 240, 2000, 400, 0, 30000, 1, 0, 1, 20000, 20, 0.325, -0.05, -0.12, 0.325, -0.05, -0.12],
	"AecParam":[false, 0, 240, 2000, 400, 0, 30000, 1, 2, 1, 20000, 20, 0.225, -0.05, -0.12, 0.225, -0.05, -0.12],
        "AecNoiseParam":[false, 0, 240, 2000, 400, 0, 30000, 1, 2, 1, 20000, 20, 0.225, 0.03, -0.03, 0.225, 0.03, -0.03],
        "BoundaryParam":[false, 0, 240, 2000, 400, 0, 30000, 1, 2, 1, 20000, 20, 0.175, -0.05, -0.2, 0.175, -0.05, -0.2],
        "AecBoundaryParam":[false, 0, 240, 2000, 400, 0, 30000, 1, 2, 1, 20000, 20, 0.175, -0.05, -0.2, 0.175, -0.05, -0.2],
        "E2ERecognition":[false, 0, 240, 2000, 400, 0, 30000, 1, 0, 1, 20000, 20, 0.225, -0.05, -0.12, 0.225, -0.05, -0.12]
    },
    "EngParams":[0.075,0.1,-1.0],
    "EngAecParams":[0.075,0.1,-1.0],
    "EngBoundaryParams":[0.035,0.05,1.0],

    "SensibilityParams":{
        "comment":"array element 0:low, 1:middle, 2:high",
        "AsrUnconfidentPhonesNum":[2, 2, 2],
        "DspSentenceThresholds":{
            "Default":[84, 84, 77, 73, 73, 67],
            "UserDefined":[97, 97, 97, 88, 88, 88]
        }
    },
	"DefaultPhrase":{
        "heycelia":[84, 84, 77, 75, 75, 75]
	},
	"Features":["conf_upgrade","unencrypted","independent_aec","aec_dnn_e2e","lp_composite","aec_composite","native_bind","iir_enable"],
	"ControlParams":["skip_frame","aec_slide","pcm_encrypt","eng_nas_model","binphone_model","lp_all_model","half_model"],
	"EnrollSnrThrd":15.0,
	"EnrollLoudParams":[77, 77, 0.69, 0.69],
	"EnrollSilThrd":10,
	"InsertSilForEnroll":false,
	"InsertSilForRecoginize":false,
	"GetSnrBeforeAsr":true,
	"AecGetSnrBeforeAsr":true,
	"AsrWhiteList":[
	],
	"IIRFilterParams":[520661, -1041322, 520661, -1041297, 517059, 204792, 409585, 204792, 226721, 68161],
	"SnrThrdForAsr":5.0,
	"AecSnrThrdForAsr":1000.0,
	"PruneType":[2, 6, 6, 2],
	"ModelMap":["AE","GB"],
        "LPE2EDecoderParams":{
        "E2ENpuComputeType": 0,
        "E2ENpuInitType": 1,
        "E2ENpuComputeAsyn": true,
        "E2ENpuModelName": "../CL/kws2_acousticsModel4.pb",
        "E2ENpuModelId": "kws2_acousticsModel4",
        "E2EWakeupPhrase": "heycelia",
        "E2EWakeupPinyin": "",
        "E2EScoreThres": 0.85,
        "E2EOutDimension": 2
        },
    "AecE2EDecoderParams":{
        "E2ENpuComputeType": 0,
        "E2ENpuInitType": 1,
        "E2ENpuComputeAsyn": true,
        "E2ENpuModelName": "../CL/kws2_acousticsModel4.pb",
        "E2ENpuModelId": "kws2_acousticsModel4",
        "E2EWakeupPhrase": "heycelia",
        "E2EWakeupPinyin": "",
        "E2EScoreThres": 0.85,
        "E2EOutDimension": 2
    }
}