{
  "color": [
    {
      "name": "fa_progress_background",
      "value": "#66FFFFFF"
    },
    {
      "name": "fa_button_background_phone",
      "value": "#FFFFFF"
    },
    {
      "name": "fa_card_medium_text_start_run",
      "value": "#FF841A"
    }
  ]
}