[
    "com.tencent.mm",                    // 微信
    "com.smile.gifmaker",                // 快手
    "com.ss.android.ugc.aweme",          // 抖音
    "com.tencent.mobileqq",              // QQ
    "com.xingin.xhs",                    // 小红书
    "com.duowan.kiwi",                   // 虎牙直播
    "com.meelive.ingkee",                // 映客直播
    "com.bilibili.bilibililive",         // BiliBili直播
    "com.taobao.live4anchor"             //淘宝主播
]
