{
    "id":"upbeat",
    "title_id":"story_template_title_lively",
    "music":"Resource/music/out.aac",
    "template_desc_id": "upbeat_template_desc",
    "segments":[
        {
            "camera_id":0,
            "duration":4.5,
            "demo_offset":[0,3.4],
            "audio_offset":0,
            "clip_desc_id": "auto_shoot_video",
            "algo_scripts":{
                "operation_mode":"panning",
                "operation_param":"50,80,50,20"
            },
            "holder_scripts":{
                "delay_before_shoot_pos":0.5,
                "gimbal_before_shoot_pos":[0,0.2,-10,0,0,1],
                "gimbal_start_pos":[0,0.2,0,0,0,1],
                "gimbal_move":[
                    [0.5,4.5,10,0,0,1]
                ]
            }
        },
        {
            "camera_id":0,
            "duration":4.7,
            "demo_offset":[4.5,7.7],
            "audio_offset":3.5,
            "clip_desc_id": "auto_shoot_video",
            "algo_scripts":{
                "operation_mode":"zoom",
                "operation_param":"1.2,1.5"
            }
        },
        {
            "camera_id":0,
            "duration":4.4,
            "demo_offset":[8.2,11.7],
            "audio_offset":7.8,
            "clip_desc_id": "auto_shoot_video",
            "algo_scripts":{
                "operation_mode":"panning",
                "operation_param":"20,50,80,50"
            },
            "holder_scripts":{
                "delay_before_shoot_pos":0.5,
                "gimbal_before_shoot_pos":[0,0.2,0,0,-15,1],
                "gimbal_start_pos":[0,0.2,0,0,0,1],
                "gimbal_move":[
                    [0.5,4.4,0,0,15,1]
                ]
            }
        },
        {
            "camera_id":0,
            "duration":3.2,
            "demo_offset":[12.2,15],
            "audio_offset":11.8,
            "clip_desc_id": "auto_shoot_video",
            "algo_scripts":{
                "operation_mode":"zoom",
                "operation_param":"1.2,1"
            }
        }
    ]
}