{
    "ShareMemoryPoolAlignSize": 0,
    "ShareMemoryPoolSize": 1048576,
    "DynamicPoolAlignSizeForSec": 0,
    "DynamicPoolSizeForSec": 67108864,
    "StaticSecurityPoolAlignSize": 0,
    "StaticSecurityPoolSize": 71303168,
    "StaticSecurityIspPoolAlignSize": 0,
    "StaticSecurityIspPoolSize": 71303168,
    "PoolManagedByHAL": true,
    "SupportDynamicPreviewPool": true
}
