[
    {
        "ZOOM_RATIO": ["MIN", "MAIN_FOV"],
        "Output": ["main", "@wide"]
    },
    {
        "IS_FIRST_START_UP": [1],
        "ZOOM_RATIO": ["MAIN_FOV", "TELE_FOV"],
        "Output": ["@main"]
    },
    {
        "ZOOM_RATIO": ["MAIN_FOV", "DYNAMIC_WIDE_MAX"],
        "Output": ["@main", "wide"]
    },
    {
        "ZOOM_RATIO": ["MAIN_FOV", "DYNAMIC_WIDE_MAX"],
        "Output": ["@main", "wide"],
        "Input": ["@tele", "main"]
    },
    {
        "ZOOM_RATIO": ["MAIN_FOV", "DYNAMIC_WIDE_MAX"],
        "Output": ["@main", "wide"],
        "Input": ["@tele"]
    },
    {
        "ZOOM_RATIO": ["DYNAMIC_WIDE_MAX", "DYNAMIC_TELE_MIN"],
        "Output": ["@main"]
    },
    {
        "ZOOM_RATIO": ["DYNAMIC_TELE_MIN", "TELE_FOV"],
        "Output": ["@main", "tele"]
    },
    {
        "IS_FIRST_START_UP": [1],
        "ZOOM_RATIO": ["TELE_FOV", "FORCE_TELE_PREVIEW"],
        "LUMINANCE": ["MIN", -15],
        "Output": ["@main"]
    },
    {
        "ZOOM_RATIO": ["TELE_FOV", "FORCE_TELE_PREVIEW"],
        "TRANSITION_SRC_ZOOM_RATIO": ["TRANSITION_FORCE_MAIN_PREVIEW", "MAX"],
        "TRANSITION_DST_ZOOM_RATIO": ["MIN", "MAIN_FOV"],
        "Output": ["@main", "tele"]
    },
    {
        "ZOOM_RATIO": ["TELE_FOV", "FORCE_TELE_PREVIEW"],
        "LUMINANCE": ["MIN", -15],
        "Output": ["@main", "tele"]
    },
    {
        "ZOOM_RATIO": ["TELE_FOV", "FORCE_TELE_PREVIEW"],
        "LUMINANCE": [-5, "MAX"],
        "Output": ["main", "@tele"]
    },
    {
        "ZOOM_RATIO": ["TELE_FOV", "FORCE_TELE_PREVIEW"],
        "Output": ["@main", "tele"],
        "Input": ["main", "@wide"]
    },
    {
        "ZOOM_RATIO": ["TELE_FOV", "FORCE_TELE_PREVIEW"],
        "Output": ["@main", "tele"],
        "Input": ["@wide"]
    },
    {
        "ZOOM_RATIO": ["TELE_FOV", "FORCE_TELE_PREVIEW"],
        "Output": ["@main", "tele"],
        "Input": ["@main", "wide"]
    },
    {
        "ZOOM_RATIO": ["TELE_FOV", "FORCE_TELE_PREVIEW"],
        "Output": ["@main", "tele"],
        "Input": ["@main"]
    },
    {
        "ZOOM_RATIO": ["FORCE_TELE_PREVIEW", "MAX"],
        "Output": ["main", "@tele"]
    }
]