{
    "transList": [
        [
            ["@tele", "wide"],
            ["@wide", "tele"]
        ],
        [
            ["@wide", "tele"],
            ["@tele", "wide"]
        ],
        [
            ["@tele"],
            ["@tele", "wide"],
            ["@wide", "tele"]
        ],
        [
            ["@wide"],
            ["@wide", "tele"],
            ["@tele", "wide"]
        ],
        [
            ["@tele", "wide"],
            ["@wide", "tele"],
            ["@wide"]
        ],
        [
            ["@wide", "tele"],
            ["@tele", "wide"],
            ["@tele"]
        ],
        [
            ["@tele"],
            ["@tele", "wide"],
            ["@wide", "tele"],
            ["@wide"]
        ],
        [
            ["@wide"],
            ["@wide", "tele"],
            ["@tele", "wide"],
            ["@tele"]
        ],
        [
            ["@wide", "tele"],
            ["@wide"]
        ],
        [
            ["@tele", "wide"],
            ["@tele"]
        ],
        [
            ["@wide"],
            ["@wide", "tele"]
        ],
        [
            ["@tele"],
            ["@tele", "wide"]
        ]
    ]
}