{
    "id":"relaxed",
    "title_id":"story_template_title_relaxed",
    "music":"Resource/music/out.aac",
    "template_desc_id": "relaxed_template_desc",
    "segments":[
        {
            "camera_id":0,
            "duration":4,
            "demo_offset":[0,3],
            "audio_offset":0,
            "clip_desc_id": "auto_shoot_video",
            "algo_scripts":{
                "operation_mode":"panning",
                "operation_param":"0,50,100,50"
            },
            "holder_scripts":{
                "delay_before_shoot_pos":0.5,
                "gimbal_before_shoot_pos":[0,0.2,0,0,-25,1],
                "gimbal_start_pos":[0,0.2,0,0,0,1],
                "gimbal_move":[
                    [0.5,4.0,0,0,25,1]
                ]
            }
        },
        {
            "camera_id":0,
            "duration":3.95,
            "demo_offset":[3.75,6.20],
            "audio_offset":3,
            "clip_desc_id": "auto_shoot_video",
            "algo_scripts":{
                "operation_mode":"panning",
                "operation_param":"0,50,100,50"
            },
            "holder_scripts":{
                "delay_before_shoot_pos":0.5,
                "gimbal_before_shoot_pos":[0,0.2,0,0,-25,1],
                "gimbal_start_pos":[0,0.2,0,0,0,1],
                "gimbal_move":[
                    [0.5,3.95,0,0,25,1]
                ]
            }
        },
        {
            "camera_id":0,
            "duration":3.5,
            "demo_offset":[6.70,9.20],
            "audio_offset":6.45,
            "clip_desc_id": "auto_shoot_video",
            "algo_scripts":{
                "operation_mode":"zoom",
                "operation_param":"1,2"
            }
        },
        {
            "camera_id":0,
            "duration":3.5,
            "demo_offset":[9.70,12.20],
            "audio_offset":9.45,
            "clip_desc_id": "auto_shoot_video",
            "algo_scripts":{
                "operation_mode":"panning",
                "operation_param":"50,100,50,0"
            },
            "holder_scripts":{
                "delay_before_shoot_pos":0.5,
                "gimbal_before_shoot_pos":[0,0.2,-25,0,0,1],
                "gimbal_start_pos":[0,0.2,0,0,0,1],
                "gimbal_move":[
                    [0.5,3.5,25,0,0,1]
                ]
            }
        },
		{
            "camera_id":0,
            "duration":2.55,
            "demo_offset":[12.70,15],
            "audio_offset":12.45,
            "clip_desc_id": "auto_shoot_video",
            "algo_scripts":{
                "operation_mode":"rotate",
                "operation_param":"-45"
            },
            "holder_scripts":{
                "delay_before_shoot_pos":0.5,
                "gimbal_before_shoot_pos":[0,0.2,0,0,0,1],
                "gimbal_start_pos":[0,0.2,0,0,0,1],
                "gimbal_move":[
                    [0.5,2.55,0,-45,0,1]
                ]
            }
        }
    ]
}