{
  "ambient_brightness_scale": 1,
  "ambient_integrate_first": false,
  "ambient_occlusion_blend_mode": "SCREEN",
  "ambient_occlusion_scale": 1,
  "ambient_occlusion_texname": "",
  "ambient_saturation_scale": 1,
  "ambient_shadow_brightness_scale": 1,
  "ambient_shadow_occlusion_scale": 1,
  "ambient_shadow_saturation_scale": 0.69999998807907104,
  "auxnormal_distort_scale": 0.69999998807907104,
  "bg_color_temp": 8000,
  "bg_grayscale": false,
  "cameras": [
    {
      "ext_rot": [
        0,
        0,
        0
      ],
      "eye": [
        0,
        0,
        10000
      ],
      "fov": 45,
      "look_at": [
        0,
        0,
        0
      ],
      "name": "Primary",
      "ortho_scale": 1,
      "perspective": false,
      "up": [
        0,
        1,
        0
      ]
    },
    {
      "ext_rot": [
        0,
        0,
        0
      ],
      "eye": [
        0,
        0,
        10000
      ],
      "fov": 45,
      "look_at": [
        0,
        0,
        0
      ],
      "name": "Secondary",
      "ortho_scale": 1,
      "perspective": true,
      "up": [
        0,
        1,
        0
      ]
    }
  ],
  "compmask_close_scale": 0.039999999105930328,
  "compmask_close_scale_feather": 0.20000000298023224,
  "compmask_dist_blur_scale": -1,
  "compmask_feat_label_blur_scale": 0.40000000596046448,
  "compmask_simple_blur_scale": 0.070000000298023224,
  "compmask_simple_blur_scale_feather": 0.60000002384185791,
  "eye_alpha_threshold": 0.11999999731779099,
  "eyeball_radius_scale": 2.5,
  "freq_kernel_scale": 0.0099999997764825821,
  "ignore_pupil_normal": true,
  "is_huawei_depth": false,
  "light_filenames": [
    ".\/lights\/light-studiolight.json"
  ],
  "mtl_filenames": [
    ".\/materials\/face-type-b.dat"
  ],
  "n_max_faces": -1,
  "overwrite_bg_normal": true,
  "overwrite_eyeball_normal": true,
  "post_bg_blur_width": 0,
  "post_bg_color": [
    9.9999999747524271e-07,
    9.9998999303352321e-07,
    9.9998999303352321e-07
  ],
  "post_bg_color2": [
    9.9999999747524271e-07,
    9.9998999303352321e-07,
    9.9998999303352321e-07
  ],
  "post_bg_inpaint": false,
  "post_bg_mode": "SINGLE",
  "post_bg_org_alpha": 1,
  "post_bg_projshadow_blend_mode": "SCREEN",
  "post_bg_projshadow_enable_alpha_channel": true,
  "post_bg_projshadow_indep_blend": false,
  "post_bg_projshadow_intensity": 1,
  "post_bg_projshadow_onoff": false,
  "post_bg_projshadow_scale": [
    1,
    1
  ],
  "post_bg_projshadow_scale_by_face": false,
  "post_bg_s_tone_scale": 10,
  "post_bg_tex_alpha": 1,
  "post_bg_tex_blend_mode": "SCREEN",
  "post_bg_tex_scale": 1,
  "post_bg_tex_trans": [
    0,
    0
  ],
  "post_bg_texname": "textures\/wavelight_BG.png",
  "post_bg_z_offset": 200,
  "post_dropshadow_blur_width": 0.0099999997764825821,
  "post_dropshadow_color": [
    0,
    0,
    0
  ],
  "post_dropshadow_intensity": 0.5,
  "post_exposure": 1.1000000238418579,
  "post_exposure_offset": 0,
  "post_fg_tex_alpha": 0.69999998807907104,
  "post_fg_tex_blend_mode": "NORMAL",
  "post_fg_tex_scale": 1,
  "post_fg_tex_trans": [
    0,
    0
  ],
  "post_fg_texname": "textures\/StudioLight_Overlay_Portrait.png",
  "post_freecurve_ctrl_pts": [
    0.40000000596046448,
    0.45999997854232788,
    0.75666666030883789,
    0.8566666841506958
  ],
  "post_freecurve_lut": [
    0,
    0.0043787048198282719,
    0.0087574850767850876,
    0.013136416673660278,
    0.017515575513243675,
    0.021895036101341248,
    0.026274874806404114,
    0.030655166134238243,
    0.035035990178585052,
    0.039417415857315063,
    0.043799523264169693,
    0.04818238690495491,
    0.052566081285476685,
    0.056950684636831284,
    0.061336267739534378,
    0.065722912549972534,
    0.070110693573951721,
    0.07449968159198761,
    0.078889951109886169,
    0.083281584084033966,
    0.087674655020236969,
    0.092069238424301147,
    0.096465408802032471,
    0.1008632481098175,
    0.10526282340288162,
    0.10966420918703079,
    0.11406748741865158,
    0.11847273260354996,
    0.12288001924753189,
    0.12728941440582275,
    0.1317010223865509,
    0.13611488044261932,
    0.14053109288215637,
    0.14494971930980682,
    0.14937083423137665,
    0.15379452705383301,
    0.15822087228298187,
    0.16264992952346802,
    0.1670818030834198,
    0.17151652276515961,
    0.17595420777797699,
    0.18039491772651672,
    0.18483872711658478,
    0.18928571045398712,
    0.19373594224452972,
    0.19818949699401855,
    0.20264646410942078,
    0.20710690319538116,
    0.21157090365886688,
    0.21603852510452271,
    0.2205098569393158,
    0.22498497366905212,
    0.22946393489837646,
    0.23394683003425598,
    0.23843373358249664,
    0.24292472004890442,
    0.24741987884044647,
    0.25191926956176758,
    0.25642293691635132,
    0.26093101501464844,
    0.26544356346130371,
    0.26996064186096191,
    0.27448233962059021,
    0.27900868654251099,
    0.28353983163833618,
    0.28807580471038818,
    0.29261672496795654,
    0.29716259241104126,
    0.30171355605125427,
    0.30626964569091797,
    0.31083095073699951,
    0.31539753079414368,
    0.31996950507164001,
    0.3245469331741333,
    0.32912984490394592,
    0.33371838927268982,
    0.33831259608268738,
    0.34291252493858337,
    0.34751829504966736,
    0.35212996602058411,
    0.35674759745597839,
    0.36137130856513977,
    0.36600109934806824,
    0.37063711881637573,
    0.37527939677238464,
    0.37992805242538452,
    0.38458311557769775,
    0.3892446756362915,
    0.39391282200813293,
    0.39858764410018921,
    0.40326917171478271,
    0.40795749425888062,
    0.41265273094177246,
    0.41735491156578064,
    0.42206409573554993,
    0.42678040266036987,
    0.43150392174720764,
    0.43623465299606323,
    0.44097274541854858,
    0.44571825861930847,
    0.45047125220298767,
    0.45523178577423096,
    0.45999997854232788,
    0.46477577090263367,
    0.4695587158203125,
    0.4743482768535614,
    0.479143887758255,
    0.48394501209259033,
    0.48875108361244202,
    0.49356153607368469,
    0.49837586283683777,
    0.5031934380531311,
    0.50801384449005127,
    0.51283633708953857,
    0.51766055822372437,
    0.52248579263687134,
    0.52731162309646606,
    0.53213739395141602,
    0.53696256875991821,
    0.54178667068481445,
    0.54660904407501221,
    0.55142927169799805,
    0.55624663829803467,
    0.56106072664260864,
    0.56587088108062744,
    0.57067662477493286,
    0.57547736167907715,
    0.5802726149559021,
    0.58506172895431519,
    0.58984416723251343,
    0.59461945295333862,
    0.59938699007034302,
    0.60414618253707886,
    0.60889655351638794,
    0.61363750696182251,
    0.61836850643157959,
    0.62308895587921143,
    0.62779837846755981,
    0.632496178150177,
    0.63718181848526001,
    0.64185476303100586,
    0.64651435613632202,
    0.65116018056869507,
    0.65579164028167725,
    0.6604081392288208,
    0.66500914096832275,
    0.66959410905838013,
    0.67416250705718994,
    0.67871379852294922,
    0.68324732780456543,
    0.68776267766952515,
    0.69225919246673584,
    0.69673639535903931,
    0.70119363069534302,
    0.70563048124313354,
    0.71004629135131836,
    0.71444052457809448,
    0.71881270408630371,
    0.72316217422485352,
    0.72748845815658569,
    0.73179095983505249,
    0.73606914281845093,
    0.74032247066497803,
    0.74455034732818604,
    0.74875229597091675,
    0.75292766094207764,
    0.7570759654045105,
    0.76119667291641235,
    0.76528918743133545,
    0.76935291290283203,
    0.7733873724937439,
    0.77739202976226807,
    0.78136622905731201,
    0.7853095531463623,
    0.78922134637832642,
    0.79310107231140137,
    0.79694819450378418,
    0.80076217651367188,
    0.8045424222946167,
    0.80828845500946045,
    0.81199967861175537,
    0.81567549705505371,
    0.81931543350219727,
    0.82291889190673828,
    0.826485276222229,
    0.83001416921615601,
    0.83350485563278198,
    0.83695691823959351,
    0.84036976099014282,
    0.84374278783798218,
    0.84707552194595337,
    0.85036730766296387,
    0.85361772775650024,
    0.85682612657546997,
    0.85999220609664917,
    0.86311650276184082,
    0.86619967222213745,
    0.86924242973327637,
    0.8722454309463501,
    0.87520939111709595,
    0.87813496589660645,
    0.8810228705406189,
    0.88387376070022583,
    0.88668835163116455,
    0.88946729898452759,
    0.89221131801605225,
    0.89492106437683105,
    0.89759719371795654,
    0.90024048089981079,
    0.90285158157348633,
    0.90543115139007568,
    0.90797990560531616,
    0.91049844026565552,
    0.91298758983612061,
    0.91544795036315918,
    0.91788017749786377,
    0.92028498649597168,
    0.92266315221786499,
    0.92501521110534668,
    0.92734193801879883,
    0.92964398860931396,
    0.93192207813262939,
    0.93417686223983765,
    0.93640905618667603,
    0.93861925601959229,
    0.94080829620361328,
    0.94297671318054199,
    0.94512534141540527,
    0.9472547173500061,
    0.94936561584472656,
    0.95145869255065918,
    0.95353466272354126,
    0.95559412240982056,
    0.95763790607452393,
    0.95966655015945435,
    0.9616808295249939,
    0.96368139982223511,
    0.96566897630691528,
    0.96764421463012695,
    0.96960777044296265,
    0.97156041860580444,
    0.9735027551651001,
    0.97543549537658691,
    0.97735929489135742,
    0.9792749285697937,
    0.98118299245834351,
    0.98308426141738892,
    0.98497927188873291,
    0.98686885833740234,
    0.98875367641448975,
    0.99063432216644287,
    0.9925115704536438,
    0.99438607692718506,
    0.99625855684280396,
    0.99812960624694824,
    1
  ],
  "post_grayscale": false,
  "post_tonemap_mode": "FREECURVE",
  "post_tonemap_with_fore_back": true,
  "post_use_dropshadow": false,
  "projshadow_blend_mode": "MULTIPLY",
  "projshadow_buffer_range": 1,
  "projshadow_color": [
    0.5,
    0.49999499320983887,
    0.49999499320983887
  ],
  "projshadow_enable_alpha_channel": false,
  "projshadow_ext_scale": 1,
  "projshadow_ext_trans_mode": false,
  "projshadow_fit_to_image": true,
  "projshadow_ignore_ext_move": true,
  "projshadow_intensity": 1,
  "projshadow_mono_inversion": false,
  "projshadow_repeat": false,
  "projshadow_repeat_flip": false,
  "projshadow_scale": [
    1,
    1
  ],
  "projshadow_scale_by_face": false,
  "projshadow_shadow_mode": false,
  "projshadow_texname": "projshadow\/StudioLight_Overlay_Portrait2.png",
  "projshadow_trans": [
    0,
    0,
    0
  ],
  "projshadow_two_sided": false,
  "projshadow_yaw_pitch_roll": [
    0,
    0,
    0
  ],
  "pupil_radius_scale": 2.5999999046325684,
  "relative_light": true,
  "rigid_eyeball_normal": true,
  "screen_width": 2000,
  "shading_grayscale": false,
  "shading_region_thld": 0.004999999888241291,
  "softshadow_blend_mode": "LINEAR_BURN",
  "softshadow_blur_width": 0.039999999105930328,
  "softshadow_buffer_range": 0.69999998807907104,
  "softshadow_displace_blend_mode": "ADD",
  "softshadow_displace_intensity_2d_x": 0.029999999329447746,
  "softshadow_displace_intensity_2d_y": 0.029999999329447746,
  "softshadow_displace_intensity_all": 0,
  "softshadow_displace_intensity_dark": 0,
  "softshadow_displace_tex_scale": 1,
  "softshadow_displace_texname": "",
  "softshadow_intensity": 0.15,
  "softshadow_intensity_base_face_scale": 0.5,
  "softshadow_intensity_slope": 0,
  "softshadow_ray_offset": 0.57999998331069946,
  "ssss_quality": 0,
  "ssss_width": 0.059999998658895493,
  "use_ambient": true,
  "use_ambient_occlusion": false,
  "use_bg_color_temp": false,
  "use_bg_s_tone": false,
  "use_estimated_light": true,
  "use_feathering_compmask": true,
  "use_foreground": true,
  "use_freq_separation": false,
  "use_projshadow": false,
  "use_softshadow": true,
  "use_softshadow_displace": false,
  "use_ssss": false
}
