#,version,,,,,,,,,,,,,,,,,,,,,,,,,,,,,,,,,,,,,,,,,,,,,,,,,,,,,,,
2022,4,25,0,,,,,,,,,,,,,,,,,,,,,,,,,,,,,,,,,,,,,,,,,,,,,,,,,,,,,
#,row_col_num,,,,,,,,,,,,,,,,,,,,,,,,,,,,,,,,,,,,,,,,,,,,,,,,,,,,,,,
39,18,,,,,,,,,,,,,,,,,,,,,,,,,,,,,,,,,,,,,,,,,,,,,,,,,,,,,,,
#,noise,,,,,,,,,,,,,,,,,,,,,,,,,,,,,,,,,,,,,,,,,,,,,,,,,,,,,,,
-500,500,,,,,,,,,,,,,,,,,,,,,,,,,,,,,,,,,,,,,,,,,,,,,,,,,,,,,,,
#,raw_max,,,,,,,,,,,,,,,,,,,,,,,,,,,,,,,,,,,,,,,,,,,,,,,,,,,,,,,
50000,50000,50000,50000,50000,50000,21764,21736,21738,21740,21744,21758,21771,21776,21802,21825,21579,50000,,,,,,,,,,,,,,,,,,,,,,,,,,,,,,,,,,,,,,,
50000,50000,50000,50000,50000,50000,21571,21517,21515,21516,21514,21514,21606,21519,21537,21537,21574,21682,,,,,,,,,,,,,,,,,,,,,,,,,,,,,,,,,,,,,,,
21501,21347,21487,21348,21419,21437,21311,21315,21313,21316,21313,21314,21312,21315,21315,21332,21348,21731,,,,,,,,,,,,,,,,,,,,,,,,,,,,,,,,,,,,,,,
21520,21350,21432,21335,21381,21392,21328,21336,21334,21336,21335,21339,21334,21336,21336,21350,21364,21727,,,,,,,,,,,,,,,,,,,,,,,,,,,,,,,,,,,,,,,
21547,21380,21467,21370,21415,21427,21364,21369,21368,21368,21368,21371,21367,21369,21371,21383,21394,21733,,,,,,,,,,,,,,,,,,,,,,,,,,,,,,,,,,,,,,,
21555,21385,21474,21377,21424,21437,21495,21378,21375,21376,21373,21381,21481,21451,21507,21497,21398,21716,,,,,,,,,,,,,,,,,,,,,,,,,,,,,,,,,,,,,,,
21551,21384,21473,21378,21424,21437,21373,21378,21375,21377,21374,21378,21374,21375,21375,21387,21394,21699,,,,,,,,,,,,,,,,,,,,,,,,,,,,,,,,,,,,,,,
21564,21397,21485,21391,21437,21452,21388,21393,21390,21391,21389,21394,21391,21389,21389,21401,21406,21696,,,,,,,,,,,,,,,,,,,,,,,,,,,,,,,,,,,,,,,
21556,21386,21475,21380,21428,21445,21379,21386,21385,21385,21384,21388,21384,21382,21380,21390,21395,21671,,,,,,,,,,,,,,,,,,,,,,,,,,,,,,,,,,,,,,,
21537,21364,21453,21359,21407,21424,21358,21366,21365,21364,21362,21367,21364,21363,21359,21367,21381,21639,,,,,,,,,,,,,,,,,,,,,,,,,,,,,,,,,,,,,,,
21541,21368,21458,21365,21412,21430,21365,21374,21371,21371,21367,21372,21376,21368,21371,21370,21377,21629,,,,,,,,,,,,,,,,,,,,,,,,,,,,,,,,,,,,,,,
21531,21357,21447,21355,21403,21420,21356,21364,21361,21360,21354,21367,21356,21356,21353,21358,21364,21605,,,,,,,,,,,,,,,,,,,,,,,,,,,,,,,,,,,,,,,
21535,21364,21455,21363,21410,21428,21373,21371,21368,21367,21361,21366,21363,21363,21360,21363,21369,21598,,,,,,,,,,,,,,,,,,,,,,,,,,,,,,,,,,,,,,,
21526,21354,21447,21352,21401,21421,21355,21363,21360,21360,21353,21356,21353,21353,21348,21351,21355,21574,,,,,,,,,,,,,,,,,,,,,,,,,,,,,,,,,,,,,,,
21510,21333,21428,21332,21383,21403,21337,21344,21340,21341,21334,21335,21333,21339,21324,21328,21332,21540,,,,,,,,,,,,,,,,,,,,,,,,,,,,,,,,,,,,,,,
21456,21267,21363,21267,21318,21339,21272,21277,21273,21273,21268,21269,21271,21261,21256,21259,21261,21468,,,,,,,,,,,,,,,,,,,,,,,,,,,,,,,,,,,,,,,
21450,21261,21358,21264,21313,21333,21267,21270,21267,21265,21260,21261,21255,21251,21254,21249,21252,21449,,,,,,,,,,,,,,,,,,,,,,,,,,,,,,,,,,,,,,,
21433,21238,21337,21242,21290,21311,21246,21247,21242,21241,21235,21236,21228,21226,21221,21234,21227,21416,,,,,,,,,,,,,,,,,,,,,,,,,,,,,,,,,,,,,,,
21399,21202,21299,21213,21251,21272,21205,21208,21204,21202,21194,21195,21187,21186,21180,21184,21188,21369,,,,,,,,,,,,,,,,,,,,,,,,,,,,,,,,,,,,,,,
21407,21208,21305,21213,21254,21275,21209,21212,21207,21208,21200,21199,21192,21191,21186,21189,21192,21366,,,,,,,,,,,,,,,,,,,,,,,,,,,,,,,,,,,,,,,
21381,21182,21280,21181,21224,21245,21177,21180,21176,21178,21179,21170,21163,21163,21159,21160,21162,21331,,,,,,,,,,,,,,,,,,,,,,,,,,,,,,,,,,,,,,,
21368,21169,21265,21166,21217,21230,21161,21165,21161,21160,21155,21155,21148,21149,21143,21143,21147,21306,,,,,,,,,,,,,,,,,,,,,,,,,,,,,,,,,,,,,,,
21362,21168,21260,21273,21250,21225,21154,21157,21153,21152,21148,21152,21143,21142,21137,21139,21142,21293,,,,,,,,,,,,,,,,,,,,,,,,,,,,,,,,,,,,,,,
21333,21138,21239,21141,21185,21203,21133,21136,21132,21130,21126,21127,21122,21123,21117,21118,21121,21262,,,,,,,,,,,,,,,,,,,,,,,,,,,,,,,,,,,,,,,
21316,21130,21227,21129,21173,21192,21122,21125,21119,21119,21114,21116,21110,21111,21105,21105,21109,21238,,,,,,,,,,,,,,,,,,,,,,,,,,,,,,,,,,,,,,,
21298,21114,21209,21201,21172,21176,21104,21110,21104,21105,21100,21101,21094,21094,21090,21091,21093,21212,,,,,,,,,,,,,,,,,,,,,,,,,,,,,,,,,,,,,,,
21264,21068,21174,21076,21121,21149,21070,21076,21072,21072,21066,21067,21061,21061,21056,21056,21060,21169,,,,,,,,,,,,,,,,,,,,,,,,,,,,,,,,,,,,,,,
21254,21055,21162,21064,21107,21127,21057,21062,21066,21059,21052,21054,21048,21048,21043,21044,21048,21147,,,,,,,,,,,,,,,,,,,,,,,,,,,,,,,,,,,,,,,
21224,21020,21134,21026,21068,21091,21020,21025,21018,21018,21012,21016,21010,21011,21014,21009,21012,21107,,,,,,,,,,,,,,,,,,,,,,,,,,,,,,,,,,,,,,,
21227,21017,21123,21021,21062,21084,21013,21018,21012,21018,21006,21010,21003,21005,21015,21005,21009,21095,,,,,,,,,,,,,,,,,,,,,,,,,,,,,,,,,,,,,,,
21212,20998,21101,20999,21038,21059,20988,21002,20989,20986,20983,20986,20981,20988,20993,20983,20987,21067,,,,,,,,,,,,,,,,,,,,,,,,,,,,,,,,,,,,,,,
21197,20984,21085,21008,21023,21041,20971,20975,20971,20970,20966,20970,20966,20977,20978,20967,20970,21049,,,,,,,,,,,,,,,,,,,,,,,,,,,,,,,,,,,,,,,
21181,20964,21064,20961,21000,21021,20949,20953,20950,20949,20945,20948,20948,20957,20958,20948,20952,21029,,,,,,,,,,,,,,,,,,,,,,,,,,,,,,,,,,,,,,,
21147,20914,21015,20912,20952,20973,20900,20904,20900,20901,20896,20899,20903,20910,20912,20903,20911,20984,,,,,,,,,,,,,,,,,,,,,,,,,,,,,,,,,,,,,,,
21113,20982,21031,20946,20992,21052,20869,20881,20953,20866,20973,20876,20876,20884,20886,20880,20891,20957,,,,,,,,,,,,,,,,,,,,,,,,,,,,,,,,,,,,,,,
21130,20911,21012,20911,20949,20969,20897,20900,20889,20892,20897,20914,20908,20918,20923,20920,20934,20986,,,,,,,,,,,,,,,,,,,,,,,,,,,,,,,,,,,,,,,
21129,20911,21010,20909,20947,20969,20897,20903,20897,20903,20907,20918,20912,20922,20925,20929,20953,20995,,,,,,,,,,,,,,,,,,,,,,,,,,,,,,,,,,,,,,,
20903,20949,21031,20935,20975,20998,20928,20936,20936,20944,20949,20952,20945,20952,20954,20969,21022,21000,,,,,,,,,,,,,,,,,,,,,,,,,,,,,,,,,,,,,,,
50000,21506,21728,21851,21771,21717,21660,21674,21680,21696,21703,21715,21701,21712,21735,21744,21685,50000,,,,,,,,,,,,,,,,,,,,,,,,,,,,,,,,,,,,,,,
#,raw_min,,,,,,,,,,,,,,,,,,,,,,,,,,,,,,,,,,,,,,,,,,,,,,,,,,,,,,,
3000,3000,3000,3000,3000,3000,12000,12000,12000,12000,12000,12000,12000,12000,12000,12000,12000,3000,,,,,,,,,,,,,,,,,,,,,,,,,,,,,,,,,,,,,,,
3000,3000,3000,3000,3000,3000,12942,12910,12908,12909,12907,12908,12963,12910,12921,12921,12944,13008,,,,,,,,,,,,,,,,,,,,,,,,,,,,,,,,,,,,,,,
12900,12808,12891,12808,12851,12861,12786,12788,12787,12789,12787,12788,12787,12788,12788,12798,12808,13038,,,,,,,,,,,,,,,,,,,,,,,,,,,,,,,,,,,,,,,
12911,12809,12859,12800,12828,12835,12796,12801,12799,12801,12800,12802,12800,12801,12801,12809,12817,13035,,,,,,,,,,,,,,,,,,,,,,,,,,,,,,,,,,,,,,,
12927,12827,12879,12821,12848,12856,12818,12821,12820,12820,12820,12822,12819,12820,12822,12829,12835,13039,,,,,,,,,,,,,,,,,,,,,,,,,,,,,,,,,,,,,,,
12932,12830,12884,12826,12853,12861,12896,12826,12824,12825,12823,12828,12888,12870,12903,12898,12838,13029,,,,,,,,,,,,,,,,,,,,,,,,,,,,,,,,,,,,,,,
12930,12830,12883,12826,12854,12861,12823,12826,12824,12825,12824,12826,12823,12824,12824,12831,12836,13019,,,,,,,,,,,,,,,,,,,,,,,,,,,,,,,,,,,,,,,
12938,12837,12890,12834,12861,12870,12832,12835,12833,12834,12833,12836,12834,12833,12833,12840,12843,13017,,,,,,,,,,,,,,,,,,,,,,,,,,,,,,,,,,,,,,,
12933,12831,12884,12827,12856,12866,12827,12831,12830,12830,12829,12832,12830,12828,12827,12833,12836,13002,,,,,,,,,,,,,,,,,,,,,,,,,,,,,,,,,,,,,,,
12921,12817,12871,12814,12843,12854,12814,12819,12818,12817,12816,12819,12818,12817,12814,12820,12828,12982,,,,,,,,,,,,,,,,,,,,,,,,,,,,,,,,,,,,,,,
12924,12820,12874,12818,12847,12857,12818,12823,12822,12822,12820,12822,12825,12820,12822,12821,12825,12977,,,,,,,,,,,,,,,,,,,,,,,,,,,,,,,,,,,,,,,
12918,12814,12868,12812,12841,12851,12813,12817,12816,12815,12812,12820,12813,12813,12811,12814,12818,12962,,,,,,,,,,,,,,,,,,,,,,,,,,,,,,,,,,,,,,,
12920,12818,12872,12817,12845,12856,12823,12822,12820,12819,12816,12819,12817,12817,12815,12817,12821,12958,,,,,,,,,,,,,,,,,,,,,,,,,,,,,,,,,,,,,,,
12915,12811,12867,12811,12840,12852,12812,12817,12815,12815,12811,12813,12811,12811,12808,12810,12812,12943,,,,,,,,,,,,,,,,,,,,,,,,,,,,,,,,,,,,,,,
12905,12799,12856,12798,12829,12841,12802,12806,12803,12804,12799,12800,12799,12802,12794,12796,12798,12923,,,,,,,,,,,,,,,,,,,,,,,,,,,,,,,,,,,,,,,
12873,12759,12817,12759,12790,12802,12762,12765,12763,12763,12760,12760,12762,12756,12753,12754,12756,12880,,,,,,,,,,,,,,,,,,,,,,,,,,,,,,,,,,,,,,,
12869,12756,12814,12758,12787,12799,12759,12761,12759,12758,12755,12756,12752,12750,12752,12749,12750,12868,,,,,,,,,,,,,,,,,,,,,,,,,,,,,,,,,,,,,,,
12859,12742,12801,12745,12773,12786,12747,12748,12745,12744,12740,12741,12736,12735,12732,12740,12735,12849,,,,,,,,,,,,,,,,,,,,,,,,,,,,,,,,,,,,,,,
12839,12720,12778,12727,12750,12762,12722,12724,12721,12721,12715,12716,12711,12711,12707,12709,12712,12820,,,,,,,,,,,,,,,,,,,,,,,,,,,,,,,,,,,,,,,
12843,12724,12782,12727,12752,12764,12725,12727,12723,12724,12719,12718,12714,12714,12711,12713,12715,12819,,,,,,,,,,,,,,,,,,,,,,,,,,,,,,,,,,,,,,,
12828,12708,12767,12708,12734,12746,12705,12707,12705,12706,12706,12701,12697,12697,12694,12695,12696,12798,,,,,,,,,,,,,,,,,,,,,,,,,,,,,,,,,,,,,,,
12820,12701,12758,12699,12729,12737,12696,12698,12696,12695,12692,12692,12688,12688,12685,12685,12687,12783,,,,,,,,,,,,,,,,,,,,,,,,,,,,,,,,,,,,,,,
12816,12700,12755,12763,12749,12734,12692,12693,12691,12690,12688,12690,12685,12684,12681,12682,12684,12775,,,,,,,,,,,,,,,,,,,,,,,,,,,,,,,,,,,,,,,
12799,12682,12743,12684,12710,12721,12679,12681,12679,12677,12675,12676,12672,12673,12669,12670,12672,12756,,,,,,,,,,,,,,,,,,,,,,,,,,,,,,,,,,,,,,,
12789,12677,12735,12677,12703,12714,12673,12674,12671,12671,12668,12669,12665,12666,12662,12662,12665,12742,,,,,,,,,,,,,,,,,,,,,,,,,,,,,,,,,,,,,,,
12778,12667,12725,12720,12702,12705,12662,12665,12662,12662,12659,12660,12656,12656,12653,12654,12655,12727,,,,,,,,,,,,,,,,,,,,,,,,,,,,,,,,,,,,,,,
12757,12640,12704,12645,12672,12688,12641,12645,12642,12643,12639,12639,12636,12636,12633,12633,12635,12701,,,,,,,,,,,,,,,,,,,,,,,,,,,,,,,,,,,,,,,
12752,12632,12697,12638,12663,12676,12633,12637,12639,12635,12630,12632,12628,12628,12625,12626,12628,12687,,,,,,,,,,,,,,,,,,,,,,,,,,,,,,,,,,,,,,,
12734,12611,12680,12615,12640,12654,12611,12614,12610,12610,12607,12609,12605,12606,12608,12605,12606,12663,,,,,,,,,,,,,,,,,,,,,,,,,,,,,,,,,,,,,,,
12736,12609,12673,12612,12636,12650,12607,12610,12607,12610,12603,12605,12601,12602,12608,12602,12605,12656,,,,,,,,,,,,,,,,,,,,,,,,,,,,,,,,,,,,,,,
12726,12598,12660,12599,12622,12635,12592,12600,12593,12591,12589,12591,12588,12592,12595,12589,12591,12639,,,,,,,,,,,,,,,,,,,,,,,,,,,,,,,,,,,,,,,
12717,12589,12650,12604,12613,12624,12582,12584,12582,12581,12579,12581,12579,12586,12586,12579,12581,12628,,,,,,,,,,,,,,,,,,,,,,,,,,,,,,,,,,,,,,,
12708,12577,12638,12576,12599,12612,12569,12571,12569,12569,12566,12568,12568,12574,12574,12568,12571,12616,,,,,,,,,,,,,,,,,,,,,,,,,,,,,,,,,,,,,,,
12687,12548,12608,12546,12571,12583,12539,12542,12539,12540,12537,12538,12541,12545,12547,12541,12546,12590,,,,,,,,,,,,,,,,,,,,,,,,,,,,,,,,,,,,,,,
12667,12589,12618,12567,12594,12630,12521,12528,12571,12519,12583,12525,12525,12530,12531,12527,12534,12573,,,,,,,,,,,,,,,,,,,,,,,,,,,,,,,,,,,,,,,
12677,12546,12606,12546,12569,12580,12538,12539,12533,12535,12537,12547,12544,12550,12553,12551,12560,12591,,,,,,,,,,,,,,,,,,,,,,,,,,,,,,,,,,,,,,,
12676,12546,12605,12545,12568,12580,12537,12541,12537,12541,12544,12550,12546,12552,12554,12557,12571,12596,,,,,,,,,,,,,,,,,,,,,,,,,,,,,,,,,,,,,,,
12541,12569,12618,12560,12584,12598,12556,12561,12561,12566,12568,12571,12566,12571,12572,12580,12612,12509,,,,,,,,,,,,,,,,,,,,,,,,,,,,,,,,,,,,,,,
3000,12000,12000,12000,12000,12000,12000,12000,12000,12000,12000,12000,12000,12000,12000,12000,12000,3000,,,,,,,,,,,,,,,,,,,,,,,,,,,,,,,,,,,,,,,
#,raw_row_delta_max,,,,,,,,,,,,,,,,,,,,,,,,,,,,,,,,,,,,,,,,,,,,,,,,,,,,,,,
5000,5000,5000,5000,5000,5000,2000,2000,2000,2000,2000,2000,2000,2000,2000,2000,2000,5000,,,,,,,,,,,,,,,,,,,,,,,,,,,,,,,,,,,,,,,
5000,5000,5000,5000,5000,5000,1500,1500,1500,1500,1500,1500,1500,1500,1500,1500,1500,1124,,,,,,,,,,,,,,,,,,,,,,,,,,,,,,,,,,,,,,,
1025,1041,1001,1026,1012,998,1048,1052,1048,1058,1053,1059,1051,1048,1048,1045,1049,1013,,,,,,,,,,,,,,,,,,,,,,,,,,,,,,,,,,,,,,,
1020,1021,1033,1032,1026,1024,1017,1028,1024,1023,1031,1029,1028,1032,1029,1026,1006,997,,,,,,,,,,,,,,,,,,,,,,,,,,,,,,,,,,,,,,,
1026,1035,1042,1037,1033,1034,1145,1041,1035,1039,1055,1044,1132,1101,1151,1128,1039,1010,,,,,,,,,,,,,,,,,,,,,,,,,,,,,,,,,,,,,,,
1065,1077,1087,1081,1075,1069,977,1075,1085,1078,1077,1077,997,1014,969,982,1074,1039,,,,,,,,,,,,,,,,,,,,,,,,,,,,,,,,,,,,,,,
1004,1028,1019,1022,1016,1015,1016,1019,1022,1009,1010,1018,1015,1015,1010,1022,1028,993,,,,,,,,,,,,,,,,,,,,,,,,,,,,,,,,,,,,,,,
1052,1075,1075,1071,1070,1072,1070,1078,1088,1087,1090,1093,1089,1078,1073,1068,1080,1048,,,,,,,,,,,,,,,,,,,,,,,,,,,,,,,,,,,,,,,
1033,1040,1034,1035,1039,1041,1035,1031,1035,1032,1029,1031,1038,1038,1034,1029,1037,1018,,,,,,,,,,,,,,,,,,,,,,,,,,,,,,,,,,,,,,,
1027,1029,1033,1030,1033,1029,1029,1040,1039,1035,1046,1043,1050,1043,1046,1039,1029,1028,,,,,,,,,,,,,,,,,,,,,,,,,,,,,,,,,,,,,,,
1035,1044,1055,1052,1052,1049,1055,1056,1052,1048,1045,1049,1039,1047,1046,1043,1051,1022,,,,,,,,,,,,,,,,,,,,,,,,,,,,,,,,,,,,,,,
1045,1043,1050,1036,1035,1041,1055,1055,1045,1041,1038,1029,1051,1037,1038,1043,1041,1017,,,,,,,,,,,,,,,,,,,,,,,,,,,,,,,,,,,,,,,
1003,988,998,995,995,999,993,999,1000,1009,1001,1002,1011,998,994,1001,998,988,,,,,,,,,,,,,,,,,,,,,,,,,,,,,,,,,,,,,,,
1010,1028,1030,1022,1030,1022,1023,1027,1028,1033,1041,1034,1033,1031,1028,1029,1020,1001,,,,,,,,,,,,,,,,,,,,,,,,,,,,,,,,,,,,,,,
967,966,965,962,960,970,976,975,970,965,965,965,963,958,966,961,958,949,,,,,,,,,,,,,,,,,,,,,,,,,,,,,,,,,,,,,,,
1030,1065,1056,1055,1047,1048,1043,1042,1050,1055,1056,1054,1043,1046,1055,1039,1051,1028,,,,,,,,,,,,,,,,,,,,,,,,,,,,,,,,,,,,,,,
1057,1070,1068,1067,1063,1057,1063,1063,1064,1064,1065,1063,1061,1069,1070,1074,1072,1034,,,,,,,,,,,,,,,,,,,,,,,,,,,,,,,,,,,,,,,
1087,1105,1098,1108,1107,1095,1103,1103,1105,1108,1099,1107,1101,1095,1101,1090,1097,1064,,,,,,,,,,,,,,,,,,,,,,,,,,,,,,,,,,,,,,,
1025,1031,1036,1035,1038,1033,1042,1039,1039,1046,1044,1040,1038,1042,1046,1042,1037,1023,,,,,,,,,,,,,,,,,,,,,,,,,,,,,,,,,,,,,,,
1027,1045,1040,1029,1029,1026,1036,1031,1030,1033,1040,1031,1028,1035,1034,1032,1034,1023,,,,,,,,,,,,,,,,,,,,,,,,,,,,,,,,,,,,,,,
1058,1083,1083,1084,1095,1080,1086,1082,1077,1081,1075,1082,1074,1078,1082,1081,1073,1045,,,,,,,,,,,,,,,,,,,,,,,,,,,,,,,,,,,,,,,
1030,1036,1026,1127,1061,1019,1029,1029,1020,1029,1027,1040,1033,1034,1025,1031,1031,1016,,,,,,,,,,,,,,,,,,,,,,,,,,,,,,,,,,,,,,,
1030,1006,1006,923,974,1006,1011,1003,1001,1004,1005,994,1012,1003,999,1001,1003,990,,,,,,,,,,,,,,,,,,,,,,,,,,,,,,,,,,,,,,,
1064,1085,1092,1087,1088,1087,1085,1084,1084,1094,1085,1085,1086,1078,1086,1081,1088,1061,,,,,,,,,,,,,,,,,,,,,,,,,,,,,,,,,,,,,,,
1002,1002,1002,1076,1007,995,1004,1013,1008,1007,1002,1004,1000,993,998,999,999,985,,,,,,,,,,,,,,,,,,,,,,,,,,,,,,,,,,,,,,,
993,990,996,925,977,994,987,995,999,990,992,998,1004,997,990,995,991,975,,,,,,,,,,,,,,,,,,,,,,,,,,,,,,,,,,,,,,,
1041,1062,1053,1051,1053,1053,1064,1064,1072,1059,1055,1055,1050,1056,1050,1048,1054,1028,,,,,,,,,,,,,,,,,,,,,,,,,,,,,,,,,,,,,,,
1030,1045,1041,1036,1033,1029,1033,1034,1028,1037,1029,1037,1026,1024,1032,1032,1043,1028,,,,,,,,,,,,,,,,,,,,,,,,,,,,,,,,,,,,,,,
1059,1066,1053,1057,1061,1050,1053,1054,1051,1060,1059,1058,1056,1062,1068,1076,1066,1045,,,,,,,,,,,,,,,,,,,,,,,,,,,,,,,,,,,,,,,
1048,1059,1047,1055,1052,1050,1057,1063,1057,1056,1063,1052,1059,1054,1057,1051,1050,1045,,,,,,,,,,,,,,,,,,,,,,,,,,,,,,,,,,,,,,,
993,995,997,1023,1003,1004,1011,995,1001,999,996,996,1000,1001,1001,1006,1018,998,,,,,,,,,,,,,,,,,,,,,,,,,,,,,,,,,,,,,,,
1019,1032,1029,1003,1021,1025,1035,1037,1034,1031,1022,1032,1038,1043,1037,1037,1044,1015,,,,,,,,,,,,,,,,,,,,,,,,,,,,,,,,,,,,,,,
1013,1008,1018,1015,1012,1022,1025,1026,1022,1017,1021,1017,1036,1032,1021,1019,1029,1029,,,,,,,,,,,,,,,,,,,,,,,,,,,,,,,,,,,,,,,
1028,1140,1110,1130,1119,1156,1063,1070,1140,1064,1163,1079,1083,1075,1077,1084,1079,1053,,,,,,,,,,,,,,,,,,,,,,,,,,,,,,,,,,,,,,,
1123,1074,1110,1089,1078,1057,1140,1137,1057,1130,1060,1137,1153,1154,1147,1148,1164,1121,,,,,,,,,,,,,,,,,,,,,,,,,,,,,,,,,,,,,,,
1084,1105,1094,1104,1109,1113,1117,1104,1109,1119,1121,1114,1100,1096,1091,1107,1121,1088,,,,,,,,,,,,,,,,,,,,,,,,,,,,,,,,,,,,,,,
850,1082,1058,1065,1070,1077,1065,1073,1074,1078,1076,1073,1063,1069,1064,1076,1102,921,,,,,,,,,,,,,,,,,,,,,,,,,,,,,,,,,,,,,,,
5000,1582,1713,1871,1770,1708,1724,1733,1732,1731,1740,1741,1738,1742,1763,1753,1654,5000,,,,,,,,,,,,,,,,,,,,,,,,,,,,,,,,,,,,,,,
#,raw_row_delta_min,,,,,,,,,,,,,,,,,,,,,,,,,,,,,,,,,,,,,,,,,,,,,,,,,,,,,,,
-5000,-5000,-5000,-5000,-5000,-5000,-2000,-2000,-2000,-2000,-2000,-2000,-2000,-2000,-2000,-2000,-2000,-5000,,,,,,,,,,,,,,,,,,,,,,,,,,,,,,,,,,,,,,,
-5000,-5000,-5000,-5000,-5000,-5000,-1302,-1262,-1269,-1277,-1273,-1272,-1338,-1260,-1278,-1263,-1276,-1046,,,,,,,,,,,,,,,,,,,,,,,,,,,,,,,,,,,,,,,
-996,-1036,-1087,-1046,-1072,-1069,-1021,-1018,-1016,-1026,-1018,-1019,-1016,-1015,-1014,-1015,-1023,-1019,,,,,,,,,,,,,,,,,,,,,,,,,,,,,,,,,,,,,,,
-976,-974,-978,-977,-973,-968,-959,-975,-969,-970,-978,-977,-975,-980,-974,-972,-958,-986,,,,,,,,,,,,,,,,,,,,,,,,,,,,,,,,,,,,,,,
-1013,-1027,-1031,-1025,-1018,-1019,-935,-1028,-1024,-1028,-1047,-1028,-950,-969,-934,-946,-1033,-1037,,,,,,,,,,,,,,,,,,,,,,,,,,,,,,,,,,,,,,,
-1072,-1078,-1088,-1080,-1074,-1069,-1173,-1074,-1085,-1076,-1075,-1082,-1169,-1137,-1179,-1159,-1080,-1066,,,,,,,,,,,,,,,,,,,,,,,,,,,,,,,,,,,,,,,
-983,-1007,-1000,-1001,-996,-992,-992,-995,-998,-987,-986,-992,-989,-992,-989,-998,-1008,-998,,,,,,,,,,,,,,,,,,,,,,,,,,,,,,,,,,,,,,,
-1065,-1092,-1091,-1088,-1084,-1083,-1085,-1089,-1096,-1097,-1099,-1103,-1099,-1090,-1088,-1085,-1097,-1088,,,,,,,,,,,,,,,,,,,,,,,,,,,,,,,,,,,,,,,
-1063,-1077,-1070,-1069,-1072,-1074,-1069,-1062,-1067,-1066,-1063,-1065,-1070,-1069,-1068,-1066,-1060,-1070,,,,,,,,,,,,,,,,,,,,,,,,,,,,,,,,,,,,,,,
-1021,-1022,-1023,-1020,-1025,-1021,-1018,-1028,-1029,-1023,-1038,-1035,-1031,-1034,-1026,-1034,-1036,-1044,,,,,,,,,,,,,,,,,,,,,,,,,,,,,,,,,,,,,,,
-1051,-1061,-1073,-1068,-1068,-1063,-1069,-1072,-1069,-1066,-1066,-1056,-1071,-1066,-1074,-1063,-1071,-1060,,,,,,,,,,,,,,,,,,,,,,,,,,,,,,,,,,,,,,,
-1038,-1031,-1038,-1023,-1024,-1029,-1028,-1044,-1033,-1030,-1028,-1032,-1039,-1026,-1027,-1035,-1034,-1029,,,,,,,,,,,,,,,,,,,,,,,,,,,,,,,,,,,,,,,
-1017,-1005,-1012,-1012,-1010,-1010,-1021,-1012,-1014,-1020,-1014,-1017,-1028,-1015,-1014,-1021,-1020,-1027,,,,,,,,,,,,,,,,,,,,,,,,,,,,,,,,,,,,,,,
-1037,-1061,-1061,-1054,-1058,-1051,-1052,-1058,-1060,-1063,-1071,-1068,-1065,-1053,-1065,-1065,-1058,-1054,,,,,,,,,,,,,,,,,,,,,,,,,,,,,,,,,,,,,,,
-1052,-1072,-1068,-1066,-1064,-1073,-1081,-1082,-1077,-1074,-1070,-1070,-1061,-1083,-1075,-1071,-1071,-1065,,,,,,,,,,,,,,,,,,,,,,,,,,,,,,,,,,,,,,,
-1040,-1075,-1065,-1059,-1055,-1056,-1050,-1052,-1060,-1068,-1069,-1066,-1070,-1062,-1058,-1054,-1066,-1058,,,,,,,,,,,,,,,,,,,,,,,,,,,,,,,,,,,,,,,
-1085,-1107,-1102,-1102,-1101,-1093,-1097,-1099,-1104,-1102,-1105,-1103,-1104,-1110,-1124,-1098,-1111,-1086,,,,,,,,,,,,,,,,,,,,,,,,,,,,,,,,,,,,,,,
-1141,-1162,-1158,-1156,-1169,-1158,-1167,-1165,-1166,-1170,-1165,-1172,-1167,-1159,-1166,-1171,-1160,-1140,,,,,,,,,,,,,,,,,,,,,,,,,,,,,,,,,,,,,,,
-1013,-1020,-1026,-1035,-1032,-1028,-1036,-1033,-1034,-1036,-1035,-1033,-1029,-1034,-1037,-1034,-1030,-1027,,,,,,,,,,,,,,,,,,,,,,,,,,,,,,,,,,,,,,,
-1068,-1088,-1081,-1080,-1077,-1075,-1088,-1082,-1079,-1082,-1073,-1077,-1075,-1080,-1078,-1079,-1083,-1080,,,,,,,,,,,,,,,,,,,,,,,,,,,,,,,,,,,,,,,
-1079,-1104,-1108,-1109,-1107,-1103,-1112,-1107,-1102,-1110,-1114,-1106,-1097,-1101,-1107,-1108,-1098,-1084,,,,,,,,,,,,,,,,,,,,,,,,,,,,,,,,,,,,,,,
-1039,-1038,-1033,-957,-1009,-1027,-1039,-1041,-1032,-1043,-1039,-1046,-1042,-1045,-1035,-1037,-1038,-1037,,,,,,,,,,,,,,,,,,,,,,,,,,,,,,,,,,,,,,,
-1076,-1053,-1039,-1134,-1078,-1040,-1044,-1037,-1034,-1039,-1039,-1033,-1045,-1033,-1031,-1035,-1036,-1040,,,,,,,,,,,,,,,,,,,,,,,,,,,,,,,,,,,,,,,
-1091,-1098,-1112,-1107,-1107,-1106,-1102,-1101,-1104,-1111,-1104,-1103,-1105,-1098,-1104,-1101,-1108,-1099,,,,,,,,,,,,,,,,,,,,,,,,,,,,,,,,,,,,,,,
-1032,-1028,-1030,-961,-1009,-1020,-1032,-1037,-1032,-1029,-1026,-1028,-1025,-1019,-1023,-1023,-1024,-1026,,,,,,,,,,,,,,,,,,,,,,,,,,,,,,,,,,,,,,,
-1048,-1064,-1052,-1126,-1058,-1037,-1042,-1049,-1050,-1043,-1046,-1051,-1058,-1050,-1044,-1050,-1044,-1044,,,,,,,,,,,,,,,,,,,,,,,,,,,,,,,,,,,,,,,
-1056,-1082,-1072,-1069,-1077,-1087,-1084,-1086,-1082,-1079,-1078,-1075,-1069,-1077,-1071,-1067,-1073,-1063,,,,,,,,,,,,,,,,,,,,,,,,,,,,,,,,,,,,,,,
-1077,-1100,-1086,-1098,-1094,-1088,-1092,-1094,-1103,-1103,-1092,-1098,-1087,-1083,-1078,-1089,-1100,-1092,,,,,,,,,,,,,,,,,,,,,,,,,,,,,,,,,,,,,,,
-1054,-1072,-1072,-1064,-1071,-1061,-1065,-1065,-1061,-1060,-1069,-1068,-1068,-1072,-1066,-1083,-1071,-1065,,,,,,,,,,,,,,,,,,,,,,,,,,,,,,,,,,,,,,,
-1073,-1089,-1082,-1091,-1091,-1090,-1097,-1089,-1094,-1108,-1100,-1091,-1094,-1081,-1092,-1086,-1085,-1089,,,,,,,,,,,,,,,,,,,,,,,,,,,,,,,,,,,,,,,
-1017,-1018,-1023,-1008,-1027,-1033,-1038,-1037,-1030,-1024,-1022,-1022,-1025,-1017,-1025,-1031,-1044,-1027,,,,,,,,,,,,,,,,,,,,,,,,,,,,,,,,,,,,,,,
-1044,-1064,-1062,-1079,-1057,-1057,-1070,-1072,-1068,-1064,-1056,-1067,-1066,-1075,-1069,-1068,-1072,-1048,,,,,,,,,,,,,,,,,,,,,,,,,,,,,,,,,,,,,,,
-1068,-1087,-1096,-1093,-1088,-1099,-1104,-1105,-1100,-1095,-1099,-1096,-1109,-1108,-1094,-1091,-1095,-1100,,,,,,,,,,,,,,,,,,,,,,,,,,,,,,,,,,,,,,,
-1082,-1031,-1085,-1075,-1056,-1031,-1112,-1107,-1056,-1119,-1042,-1116,-1127,-1117,-1118,-1121,-1111,-1096,,,,,,,,,,,,,,,,,,,,,,,,,,,,,,,,,,,,,,,
-1094,-1188,-1141,-1146,-1146,-1189,-1094,-1106,-1159,-1089,-1180,-1077,-1101,-1100,-1088,-1084,-1094,-1075,,,,,,,,,,,,,,,,,,,,,,,,,,,,,,,,,,,,,,,
-1087,-1105,-1096,-1106,-1112,-1113,-1117,-1099,-1096,-1101,-1105,-1107,-1094,-1091,-1088,-1093,-1092,-1073,,,,,,,,,,,,,,,,,,,,,,,,,,,,,,,,,,,,,,,
-1211,-1021,-1025,-1023,-1025,-1031,-1016,-1021,-1012,-1013,-1009,-1017,-1010,-1020,-1018,-1012,-991,-1152,,,,,,,,,,,,,,,,,,,,,,,,,,,,,,,,,,,,,,,
-5000,-1000,-1000,-1000,-1000,-1000,-1000,-1000,-1000,-1000,-1000,-1000,-1000,-1000,-1000,-1000,-1000,-5000,,,,,,,,,,,,,,,,,,,,,,,,,,,,,,,,,,,,,,,
#,raw_col_delta_max,,,,,,,,,,,,,,,,,,,,,,,,,,,,,,,,,,,,,,,,,,,,,,,,,,,,,,,
5000,5000,5000,5000,5000,5000,901,923,914,920,923,920,920,928,939,750,5000,,,,,,,,,,,,,,,,,,,,,,,,,,,,,,,,,,,,,,,,
5000,5000,5000,5000,5000,5000,875,914,901,907,909,979,841,914,908,956,1050,,,,,,,,,,,,,,,,,,,,,,,,,,,,,,,,,,,,,,,,
810,1047,800,977,933,822,903,900,890,904,905,891,902,900,916,920,1245,,,,,,,,,,,,,,,,,,,,,,,,,,,,,,,,,,,,,,,,
788,974,823,935,912,846,910,894,896,904,911,890,899,902,904,908,1224,,,,,,,,,,,,,,,,,,,,,,,,,,,,,,,,,,,,,,,,
789,971,818,931,908,851,907,899,905,897,906,890,894,898,907,902,1207,,,,,,,,,,,,,,,,,,,,,,,,,,,,,,,,,,,,,,,,
797,972,815,927,910,958,812,903,904,895,908,981,885,947,896,821,1197,,,,,,,,,,,,,,,,,,,,,,,,,,,,,,,,,,,,,,,,
800,976,817,931,912,855,905,896,908,895,910,891,902,893,929,906,1198,,,,,,,,,,,,,,,,,,,,,,,,,,,,,,,,,,,,,,,,
799,960,826,928,917,849,908,901,911,899,902,896,898,899,904,914,1163,,,,,,,,,,,,,,,,,,,,,,,,,,,,,,,,,,,,,,,,
791,966,826,928,915,847,913,903,907,903,897,890,892,900,897,906,1142,,,,,,,,,,,,,,,,,,,,,,,,,,,,,,,,,,,,,,,,
782,967,824,935,911,841,905,907,905,903,898,890,897,896,903,905,1132,,,,,,,,,,,,,,,,,,,,,,,,,,,,,,,,,,,,,,,,
782,974,825,939,908,840,903,906,911,899,901,899,894,899,899,902,1136,,,,,,,,,,,,,,,,,,,,,,,,,,,,,,,,,,,,,,,,
787,973,827,942,908,840,906,909,919,897,918,894,895,900,899,898,1135,,,,,,,,,,,,,,,,,,,,,,,,,,,,,,,,,,,,,,,,
791,972,825,938,915,857,895,906,921,896,907,902,903,900,899,903,1123,,,,,,,,,,,,,,,,,,,,,,,,,,,,,,,,,,,,,,,,
788,974,821,935,921,839,903,901,908,904,900,899,898,894,898,892,1123,,,,,,,,,,,,,,,,,,,,,,,,,,,,,,,,,,,,,,,,
778,978,818,941,918,834,900,895,906,900,902,895,899,885,896,889,1116,,,,,,,,,,,,,,,,,,,,,,,,,,,,,,,,,,,,,,,,
762,975,814,935,906,836,901,905,910,892,912,896,886,891,902,893,1105,,,,,,,,,,,,,,,,,,,,,,,,,,,,,,,,,,,,,,,,
773,974,811,936,906,845,894,906,907,896,909,888,889,898,898,891,1096,,,,,,,,,,,,,,,,,,,,,,,,,,,,,,,,,,,,,,,,
768,977,824,935,907,849,895,903,910,894,909,886,887,890,905,887,1065,,,,,,,,,,,,,,,,,,,,,,,,,,,,,,,,,,,,,,,,
784,973,839,929,910,852,894,901,913,902,909,886,888,890,895,898,1057,,,,,,,,,,,,,,,,,,,,,,,,,,,,,,,,,,,,,,,,
783,970,828,925,913,855,904,899,916,900,909,893,894,889,899,892,1052,,,,,,,,,,,,,,,,,,,,,,,,,,,,,,,,,,,,,,,,
771,974,812,926,912,844,901,900,909,898,892,896,895,882,900,901,1059,,,,,,,,,,,,,,,,,,,,,,,,,,,,,,,,,,,,,,,,
757,967,816,937,907,840,901,899,910,889,894,902,893,884,895,897,1057,,,,,,,,,,,,,,,,,,,,,,,,,,,,,,,,,,,,,,,,
769,973,924,890,886,838,899,899,901,895,903,897,901,891,895,897,1041,,,,,,,,,,,,,,,,,,,,,,,,,,,,,,,,,,,,,,,,
769,983,820,933,919,843,899,901,892,906,905,899,905,888,896,903,1039,,,,,,,,,,,,,,,,,,,,,,,,,,,,,,,,,,,,,,,,
786,984,818,936,918,857,900,904,900,899,911,888,904,890,901,902,1026,,,,,,,,,,,,,,,,,,,,,,,,,,,,,,,,,,,,,,,,
781,981,895,889,911,839,915,910,900,901,910,886,902,895,904,904,1008,,,,,,,,,,,,,,,,,,,,,,,,,,,,,,,,,,,,,,,,
780,989,812,937,924,838,910,904,899,890,902,889,900,897,896,905,1004,,,,,,,,,,,,,,,,,,,,,,,,,,,,,,,,,,,,,,,,
770,986,814,930,914,842,907,913,898,882,905,899,892,897,897,902,1002,,,,,,,,,,,,,,,,,,,,,,,,,,,,,,,,,,,,,,,,
760,990,797,924,925,850,911,914,904,897,903,896,892,906,893,900,997,,,,,,,,,,,,,,,,,,,,,,,,,,,,,,,,,,,,,,,,
748,982,808,932,921,847,906,917,918,897,907,903,893,912,891,903,979,,,,,,,,,,,,,,,,,,,,,,,,,,,,,,,,,,,,,,,,
757,987,818,938,920,847,925,907,920,895,907,902,902,903,888,899,978,,,,,,,,,,,,,,,,,,,,,,,,,,,,,,,,,,,,,,,,
760,989,839,924,921,849,914,907,923,897,904,902,908,903,889,920,1003,,,,,,,,,,,,,,,,,,,,,,,,,,,,,,,,,,,,,,,,
753,987,808,944,919,838,916,907,914,895,900,903,913,901,892,905,1005,,,,,,,,,,,,,,,,,,,,,,,,,,,,,,,,,,,,,,,,
743,987,817,942,914,839,915,911,906,897,905,932,916,902,918,918,1008,,,,,,,,,,,,,,,,,,,,,,,,,,,,,,,,,,,,,,,,
851,941,835,948,955,770,921,973,853,989,827,903,908,905,905,916,1004,,,,,,,,,,,,,,,,,,,,,,,,,,,,,,,,,,,,,,,,
798,977,832,938,909,861,919,914,914,915,918,895,910,912,916,923,991,,,,,,,,,,,,,,,,,,,,,,,,,,,,,,,,,,,,,,,,
816,992,840,934,929,861,924,920,903,910,919,904,913,920,922,932,972,,,,,,,,,,,,,,,,,,,,,,,,,,,,,,,,,,,,,,,,
1050,1006,857,936,940,857,948,911,913,918,918,904,914,929,940,967,812,,,,,,,,,,,,,,,,,,,,,,,,,,,,,,,,,,,,,,,,
5000,1158,1063,861,885,874,950,920,936,926,928,901,927,950,956,900,5000,,,,,,,,,,,,,,,,,,,,,,,,,,,,,,,,,,,,,,,,
#,raw_col_delta_min,,,,,,,,,,,,,,,,,,,,,,,,,,,,,,,,,,,,,,,,,,,,,,,,,,,,,,,
-5000,-5000,-5000,-5000,-5000,-5000,-945,-920,-910,-914,-900,-899,-912,-887,-902,-1143,-5000,,,,,,,,,,,,,,,,,,,,,,,,,,,,,,,,,,,,,,,,
-5000,-5000,-5000,-5000,-5000,-5000,-961,-918,-898,-912,-908,-832,-981,-885,-908,-896,-878,,,,,,,,,,,,,,,,,,,,,,,,,,,,,,,,,,,,,,,,
-1056,-824,-1022,-863,-905,-1023,-896,-902,-886,-908,-903,-894,-898,-900,-890,-894,-632,,,,,,,,,,,,,,,,,,,,,,,,,,,,,,,,,,,,,,,,
-1058,-842,-978,-862,-894,-949,-896,-899,-893,-905,-904,-897,-896,-901,-883,-886,-643,,,,,,,,,,,,,,,,,,,,,,,,,,,,,,,,,,,,,,,,
-1056,-831,-973,-858,-888,-953,-898,-901,-904,-897,-902,-896,-891,-895,-887,-885,-663,,,,,,,,,,,,,,,,,,,,,,,,,,,,,,,,,,,,,,,,
-1069,-830,-970,-853,-888,-865,-1000,-907,-903,-899,-896,-822,-933,-858,-911,-980,-688,,,,,,,,,,,,,,,,,,,,,,,,,,,,,,,,,,,,,,,,
-1067,-833,-969,-857,-891,-957,-898,-901,-904,-899,-904,-898,-900,-892,-910,-894,-709,,,,,,,,,,,,,,,,,,,,,,,,,,,,,,,,,,,,,,,,
-1067,-819,-978,-855,-892,-951,-901,-906,-910,-901,-894,-902,-900,-900,-885,-906,-699,,,,,,,,,,,,,,,,,,,,,,,,,,,,,,,,,,,,,,,,
-1062,-824,-978,-851,-888,-953,-901,-906,-907,-905,-889,-896,-896,-903,-881,-898,-701,,,,,,,,,,,,,,,,,,,,,,,,,,,,,,,,,,,,,,,,
-1060,-825,-975,-857,-884,-947,-892,-910,-907,-906,-890,-894,-900,-903,-889,-883,-720,,,,,,,,,,,,,,,,,,,,,,,,,,,,,,,,,,,,,,,,
-1059,-829,-974,-863,-881,-944,-888,-911,-911,-906,-894,-892,-907,-894,-901,-892,-733,,,,,,,,,,,,,,,,,,,,,,,,,,,,,,,,,,,,,,,,
-1064,-829,-975,-865,-879,-943,-893,-914,-920,-906,-897,-912,-895,-905,-891,-888,-750,,,,,,,,,,,,,,,,,,,,,,,,,,,,,,,,,,,,,,,,
-1064,-827,-973,-863,-885,-945,-899,-910,-923,-906,-899,-906,-903,-905,-895,-893,-757,,,,,,,,,,,,,,,,,,,,,,,,,,,,,,,,,,,,,,,,
-1063,-826,-972,-858,-889,-944,-890,-906,-907,-915,-894,-905,-898,-902,-893,-884,-774,,,,,,,,,,,,,,,,,,,,,,,,,,,,,,,,,,,,,,,,
-1060,-827,-971,-860,-886,-939,-890,-901,-904,-912,-900,-899,-890,-908,-890,-882,-782,,,,,,,,,,,,,,,,,,,,,,,,,,,,,,,,,,,,,,,,
-1066,-821,-968,-853,-873,-943,-893,-911,-911,-899,-911,-892,-902,-899,-898,-889,-774,,,,,,,,,,,,,,,,,,,,,,,,,,,,,,,,,,,,,,,,
-1077,-818,-961,-858,-874,-950,-890,-911,-910,-904,-907,-898,-895,-893,-906,-887,-780,,,,,,,,,,,,,,,,,,,,,,,,,,,,,,,,,,,,,,,,
-1080,-818,-975,-860,-873,-953,-893,-911,-912,-904,-908,-898,-890,-898,-884,-898,-762,,,,,,,,,,,,,,,,,,,,,,,,,,,,,,,,,,,,,,,,
-1101,-817,-977,-868,-876,-959,-889,-908,-915,-916,-907,-900,-889,-898,-890,-892,-767,,,,,,,,,,,,,,,,,,,,,,,,,,,,,,,,,,,,,,,,
-1101,-816,-975,-860,-880,-960,-900,-908,-914,-914,-911,-904,-896,-897,-894,-887,-774,,,,,,,,,,,,,,,,,,,,,,,,,,,,,,,,,,,,,,,,
-1089,-818,-969,-857,-880,-953,-895,-906,-906,-896,-906,-908,-895,-889,-898,-897,-790,,,,,,,,,,,,,,,,,,,,,,,,,,,,,,,,,,,,,,,,
-1075,-815,-974,-855,-887,-951,-895,-906,-911,-898,-893,-913,-893,-893,-896,-890,-802,,,,,,,,,,,,,,,,,,,,,,,,,,,,,,,,,,,,,,,,
-1080,-825,-904,-926,-926,-951,-895,-905,-903,-901,-896,-911,-902,-900,-891,-891,-799,,,,,,,,,,,,,,,,,,,,,,,,,,,,,,,,,,,,,,,,
-1081,-821,-978,-863,-890,-955,-895,-906,-896,-911,-903,-907,-903,-898,-895,-897,-814,,,,,,,,,,,,,,,,,,,,,,,,,,,,,,,,,,,,,,,,
-1084,-829,-975,-865,-888,-968,-896,-913,-900,-907,-908,-897,-904,-898,-901,-897,-819,,,,,,,,,,,,,,,,,,,,,,,,,,,,,,,,,,,,,,,,
-1075,-828,-909,-935,-905,-953,-907,-920,-899,-910,-908,-896,-902,-902,-903,-900,-818,,,,,,,,,,,,,,,,,,,,,,,,,,,,,,,,,,,,,,,,
-1094,-818,-970,-864,-881,-964,-900,-910,-899,-901,-900,-900,-899,-905,-895,-899,-830,,,,,,,,,,,,,,,,,,,,,,,,,,,,,,,,,,,,,,,,
-1090,-814,-971,-861,-881,-955,-898,-908,-908,-894,-900,-908,-893,-905,-895,-896,-843,,,,,,,,,,,,,,,,,,,,,,,,,,,,,,,,,,,,,,,,
-1087,-807,-971,-856,-889,-963,-903,-924,-904,-907,-897,-906,-892,-901,-901,-896,-845,,,,,,,,,,,,,,,,,,,,,,,,,,,,,,,,,,,,,,,,
-1085,-813,-970,-866,-886,-961,-898,-925,-908,-917,-900,-914,-891,-895,-908,-896,-841,,,,,,,,,,,,,,,,,,,,,,,,,,,,,,,,,,,,,,,,
-1100,-822,-982,-876,-886,-962,-902,-927,-925,-900,-901,-910,-891,-894,-905,-893,-850,,,,,,,,,,,,,,,,,,,,,,,,,,,,,,,,,,,,,,,,
-1101,-826,-962,-900,-892,-961,-907,-915,-924,-902,-899,-909,-889,-902,-906,-916,-877,,,,,,,,,,,,,,,,,,,,,,,,,,,,,,,,,,,,,,,,
-1101,-826,-973,-881,-885,-953,-909,-913,-915,-901,-896,-902,-899,-900,-908,-898,-883,,,,,,,,,,,,,,,,,,,,,,,,,,,,,,,,,,,,,,,,
-1115,-825,-982,-878,-880,-956,-908,-917,-906,-903,-901,-925,-904,-899,-933,-905,-891,,,,,,,,,,,,,,,,,,,,,,,,,,,,,,,,,,,,,,,,
-1060,-864,-971,-876,-859,-1062,-902,-858,-992,-819,-982,-903,-895,-902,-915,-898,-899,,,,,,,,,,,,,,,,,,,,,,,,,,,,,,,,,,,,,,,,
-1148,-817,-993,-877,-877,-975,-915,-931,-909,-907,-892,-904,-894,-904,-921,-900,-909,,,,,,,,,,,,,,,,,,,,,,,,,,,,,,,,,,,,,,,,
-1164,-834,-1002,-873,-895,-976,-914,-930,-894,-903,-902,-914,-898,-914,-917,-895,-905,,,,,,,,,,,,,,,,,,,,,,,,,,,,,,,,,,,,,,,,
-975,-875,-1010,-872,-905,-969,-934,-912,-900,-911,-912,-917,-902,-926,-917,-882,-1086,,,,,,,,,,,,,,,,,,,,,,,,,,,,,,,,,,,,,,,,
-5000,-804,-867,-988,-971,-965,-928,-911,-909,-916,-908,-924,-910,-913,-942,-994,-5000,,,,,,,,,,,,,,,,,,,,,,,,,,,,,,,,,,,,,,,,
#,line_max,,,,,,,,,,,,,,,,,,,,,,,,,,,,,,,,,,,,,,,,,,,,,,,,,,,,,,,
42434,42539,42590,42188,42618,42411,42445,42505,42403,42294,42393,42478,42397,42552,42501,42471,42533,42338,42391,42149,42536,41990,42436,42455,41887,42271,42026,42465,42100,41891,42286,42097,42379,41972,42573,42315,42365,42392,41745,42018,42129,42046,42151,42185,42451,42348,42431,42647,42433,41757,41988,41782,42184,41996,42136,41979,42325
#,line_min,,,,,,,,,,,,,,,,,,,,,,,,,,,,,,,,,,,,,,,,,,,,,,,,,,,,,,,
22849,22905,22932,22716,22948,22836,22854,22887,22831,22773,22826,22872,22828,22912,22885,22868,22902,22796,22825,22695,22903,22609,22849,22860,22554,22761,22628,22865,22668,22556,22769,22667,22819,22600,22923,22784,22811,22826,22477,22624,22684,22639,22696,22714,22858,22802,22847,22963,22848,22484,22608,22497,22714,22613,22688,22604,22790
,,,,,,,,,,,,,,,,,,,,,,,,,,,,,,,,,,,,,,,,,,,,,,,,,,,,,,,,
#,full_max,,,,,,,,,,,,,,,,,,,,,,,,,,,,,,,,,,,,,,,,,,,,,,,,,,,,,,,
5000,5000,5000,5000,5000,5000,1524,1516,1519,1520,1522,1531,1530,1529,1534,1528,1474,5000,,,,,,,,,,,,,,,,,,,,,,,,,,,,,,,,,,,,,,,
5000,5000,5000,5000,5000,5000,1510,1496,1498,1499,1500,1505,1522,1500,1503,1492,1500,1394,,,,,,,,,,,,,,,,,,,,,,,,,,,,,,,,,,,,,,,
1246,1472,1493,1492,1500,1509,1497,1496,1498,1499,1500,1505,1502,1500,1499,1491,1493,1445,,,,,,,,,,,,,,,,,,,,,,,,,,,,,,,,,,,,,,,
1246,1468,1477,1485,1487,1495,1496,1496,1498,1499,1500,1506,1502,1500,1499,1491,1493,1441,,,,,,,,,,,,,,,,,,,,,,,,,,,,,,,,,,,,,,,
1244,1465,1475,1483,1485,1493,1495,1494,1496,1496,1498,1504,1500,1497,1497,1488,1490,1433,,,,,,,,,,,,,,,,,,,,,,,,,,,,,,,,,,,,,,,
1244,1463,1473,1482,1483,1492,1519,1492,1494,1494,1495,1502,1521,1512,1523,1510,1487,1426,,,,,,,,,,,,,,,,,,,,,,,,,,,,,,,,,,,,,,,
1242,1461,1471,1480,1481,1490,1491,1490,1492,1493,1494,1500,1496,1493,1493,1484,1485,1421,,,,,,,,,,,,,,,,,,,,,,,,,,,,,,,,,,,,,,,
1242,1462,1471,1480,1482,1491,1492,1491,1493,1493,1494,1501,1497,1494,1493,1485,1485,1418,,,,,,,,,,,,,,,,,,,,,,,,,,,,,,,,,,,,,,,
1232,1450,1459,1468,1470,1480,1480,1480,1482,1482,1484,1490,1486,1483,1482,1472,1473,1404,,,,,,,,,,,,,,,,,,,,,,,,,,,,,,,,,,,,,,,
1234,1452,1461,1470,1473,1482,1483,1483,1484,1484,1486,1492,1489,1485,1484,1475,1477,1403,,,,,,,,,,,,,,,,,,,,,,,,,,,,,,,,,,,,,,,
1228,1445,1455,1464,1466,1475,1476,1476,1478,1478,1479,1485,1483,1478,1478,1467,1468,1393,,,,,,,,,,,,,,,,,,,,,,,,,,,,,,,,,,,,,,,
1227,1444,1453,1463,1465,1474,1475,1475,1477,1477,1477,1485,1480,1477,1476,1466,1466,1389,,,,,,,,,,,,,,,,,,,,,,,,,,,,,,,,,,,,,,,
1224,1440,1450,1459,1461,1470,1474,1472,1473,1473,1473,1480,1477,1474,1472,1462,1462,1382,,,,,,,,,,,,,,,,,,,,,,,,,,,,,,,,,,,,,,,
1218,1433,1444,1453,1455,1464,1466,1465,1467,1467,1467,1473,1469,1467,1465,1454,1455,1372,,,,,,,,,,,,,,,,,,,,,,,,,,,,,,,,,,,,,,,
1217,1432,1442,1451,1454,1463,1464,1464,1465,1465,1465,1471,1468,1466,1462,1452,1452,1368,,,,,,,,,,,,,,,,,,,,,,,,,,,,,,,,,,,,,,,
1208,1421,1432,1440,1443,1453,1454,1453,1454,1454,1455,1461,1458,1453,1451,1441,1441,1355,,,,,,,,,,,,,,,,,,,,,,,,,,,,,,,,,,,,,,,
1205,1417,1428,1438,1440,1449,1451,1449,1451,1451,1451,1456,1452,1449,1449,1437,1437,1348,,,,,,,,,,,,,,,,,,,,,,,,,,,,,,,,,,,,,,,
1200,1412,1423,1432,1434,1443,1445,1443,1445,1445,1445,1450,1445,1443,1441,1432,1431,1340,,,,,,,,,,,,,,,,,,,,,,,,,,,,,,,,,,,,,,,
1202,1413,1424,1436,1436,1445,1447,1445,1447,1447,1447,1452,1447,1445,1443,1432,1432,1339,,,,,,,,,,,,,,,,,,,,,,,,,,,,,,,,,,,,,,,
1193,1403,1414,1425,1425,1434,1436,1435,1436,1436,1436,1441,1437,1434,1432,1422,1422,1327,,,,,,,,,,,,,,,,,,,,,,,,,,,,,,,,,,,,,,,
1194,1405,1416,1425,1426,1435,1437,1436,1437,1438,1440,1443,1439,1436,1435,1423,1423,1326,,,,,,,,,,,,,,,,,,,,,,,,,,,,,,,,,,,,,,,
1190,1401,1412,1421,1423,1431,1432,1431,1432,1433,1433,1439,1434,1431,1430,1418,1419,1320,,,,,,,,,,,,,,,,,,,,,,,,,,,,,,,,,,,,,,,
1181,1392,1402,1434,1421,1421,1422,1421,1422,1422,1423,1429,1424,1422,1420,1409,1409,1309,,,,,,,,,,,,,,,,,,,,,,,,,,,,,,,,,,,,,,,
1176,1387,1399,1408,1409,1418,1419,1418,1419,1419,1420,1426,1421,1419,1417,1405,1405,1303,,,,,,,,,,,,,,,,,,,,,,,,,,,,,,,,,,,,,,,
1172,1384,1395,1405,1406,1415,1416,1415,1416,1416,1417,1423,1418,1416,1414,1402,1402,1297,,,,,,,,,,,,,,,,,,,,,,,,,,,,,,,,,,,,,,,
1165,1378,1389,1417,1403,1409,1410,1409,1410,1411,1411,1417,1412,1410,1408,1397,1397,1289,,,,,,,,,,,,,,,,,,,,,,,,,,,,,,,,,,,,,,,
1160,1371,1384,1393,1395,1406,1405,1404,1406,1406,1406,1412,1408,1405,1403,1392,1392,1282,,,,,,,,,,,,,,,,,,,,,,,,,,,,,,,,,,,,,,,
1158,1368,1381,1391,1391,1401,1402,1401,1404,1403,1403,1409,1405,1402,1400,1389,1389,1277,,,,,,,,,,,,,,,,,,,,,,,,,,,,,,,,,,,,,,,
1153,1362,1376,1384,1384,1395,1396,1395,1396,1396,1397,1403,1398,1396,1395,1383,1383,1271,,,,,,,,,,,,,,,,,,,,,,,,,,,,,,,,,,,,,,,
1153,1360,1373,1382,1382,1392,1393,1392,1394,1395,1394,1401,1396,1394,1395,1381,1381,1267,,,,,,,,,,,,,,,,,,,,,,,,,,,,,,,,,,,,,,,
1151,1358,1370,1379,1379,1389,1390,1391,1390,1390,1391,1397,1393,1392,1392,1378,1378,1262,,,,,,,,,,,,,,,,,,,,,,,,,,,,,,,,,,,,,,,
1144,1350,1362,1377,1371,1381,1382,1381,1382,1382,1383,1390,1385,1385,1385,1370,1370,1254,,,,,,,,,,,,,,,,,,,,,,,,,,,,,,,,,,,,,,,
1141,1347,1358,1367,1367,1377,1377,1376,1378,1378,1379,1385,1382,1381,1381,1366,1367,1250,,,,,,,,,,,,,,,,,,,,,,,,,,,,,,,,,,,,,,,
1141,1344,1356,1365,1365,1375,1375,1374,1376,1376,1377,1383,1381,1380,1379,1365,1366,1249,,,,,,,,,,,,,,,,,,,,,,,,,,,,,,,,,,,,,,,
1134,1360,1360,1373,1374,1392,1369,1370,1388,1370,1394,1379,1376,1375,1374,1361,1363,1244,,,,,,,,,,,,,,,,,,,,,,,,,,,,,,,,,,,,,,,
1134,1340,1351,1361,1360,1370,1371,1370,1370,1371,1373,1383,1378,1377,1378,1365,1367,1246,,,,,,,,,,,,,,,,,,,,,,,,,,,,,,,,,,,,,,,
1134,1341,1352,1361,1360,1371,1371,1371,1372,1373,1376,1384,1379,1378,1379,1367,1372,1248,,,,,,,,,,,,,,,,,,,,,,,,,,,,,,,,,,,,,,,
1084,1349,1356,1366,1366,1376,1378,1377,1379,1382,1384,1391,1386,1385,1384,1375,1386,1350,,,,,,,,,,,,,,,,,,,,,,,,,,,,,,,,,,,,,,,
5000,1362,1399,1451,1428,1422,1424,1424,1427,1431,1434,1442,1435,1435,1439,1431,1420,5000,,,,,,,,,,,,,,,,,,,,,,,,,,,,,,,,,,,,,,,
,,,,,,,,,,,,,,,,,,,,,,,,,,,,,,,,,,,,,,,,,,,,,,,,,,,,,,,,
#,full_min,,,,,,,,,,,,,,,,,,,,,,,,,,,,,,,,,,,,,,,,,,,,,,,,,,,,,,,
-5000,-5000,-5000,-5000,-5000,-5000,577,574,575,576,577,580,580,579,581,579,559,-5000,,,,,,,,,,,,,,,,,,,,,,,,,,,,,,,,,,,,,,,
-5000,-5000,-5000,-5000,-5000,-5000,572,567,568,568,568,570,577,568,570,565,568,528,,,,,,,,,,,,,,,,,,,,,,,,,,,,,,,,,,,,,,,
472,558,565,565,568,572,567,567,567,568,568,570,569,568,568,565,566,548,,,,,,,,,,,,,,,,,,,,,,,,,,,,,,,,,,,,,,,
472,556,559,563,563,566,567,567,568,568,568,571,569,568,568,565,566,546,,,,,,,,,,,,,,,,,,,,,,,,,,,,,,,,,,,,,,,
471,555,559,562,563,566,566,566,567,567,567,570,568,567,567,564,564,543,,,,,,,,,,,,,,,,,,,,,,,,,,,,,,,,,,,,,,,
471,554,558,561,562,565,576,565,566,566,567,569,576,573,577,572,563,540,,,,,,,,,,,,,,,,,,,,,,,,,,,,,,,,,,,,,,,
470,554,557,561,561,564,565,565,565,565,566,568,567,566,566,562,562,538,,,,,,,,,,,,,,,,,,,,,,,,,,,,,,,,,,,,,,,
471,554,557,561,561,565,565,565,566,566,566,569,567,566,566,562,563,537,,,,,,,,,,,,,,,,,,,,,,,,,,,,,,,,,,,,,,,
467,549,553,556,557,561,561,561,561,562,562,565,563,562,561,558,558,532,,,,,,,,,,,,,,,,,,,,,,,,,,,,,,,,,,,,,,,
467,550,554,557,558,561,562,562,562,562,563,565,564,563,562,559,559,531,,,,,,,,,,,,,,,,,,,,,,,,,,,,,,,,,,,,,,,
465,547,551,555,555,559,559,559,560,560,560,563,562,560,560,556,556,528,,,,,,,,,,,,,,,,,,,,,,,,,,,,,,,,,,,,,,,
465,547,551,554,555,558,559,559,559,559,560,563,561,560,559,555,556,526,,,,,,,,,,,,,,,,,,,,,,,,,,,,,,,,,,,,,,,
463,546,549,553,554,557,558,557,558,558,558,561,559,558,558,554,554,524,,,,,,,,,,,,,,,,,,,,,,,,,,,,,,,,,,,,,,,
461,543,547,550,551,555,555,555,556,556,556,558,557,556,555,551,551,520,,,,,,,,,,,,,,,,,,,,,,,,,,,,,,,,,,,,,,,
461,542,546,550,551,554,555,554,555,555,555,557,556,555,554,550,550,518,,,,,,,,,,,,,,,,,,,,,,,,,,,,,,,,,,,,,,,
457,538,542,546,547,550,551,550,551,551,551,553,552,551,550,546,546,513,,,,,,,,,,,,,,,,,,,,,,,,,,,,,,,,,,,,,,,
456,537,541,545,545,549,550,549,550,550,550,552,550,549,549,544,544,511,,,,,,,,,,,,,,,,,,,,,,,,,,,,,,,,,,,,,,,
454,535,539,543,543,547,547,547,547,547,547,549,548,547,546,543,542,508,,,,,,,,,,,,,,,,,,,,,,,,,,,,,,,,,,,,,,,
455,535,540,544,544,547,548,548,548,548,548,550,548,547,547,543,543,507,,,,,,,,,,,,,,,,,,,,,,,,,,,,,,,,,,,,,,,
452,532,536,540,540,543,544,543,544,544,544,546,544,543,543,539,539,503,,,,,,,,,,,,,,,,,,,,,,,,,,,,,,,,,,,,,,,
452,532,537,540,540,544,544,544,544,545,545,547,545,544,543,539,539,502,,,,,,,,,,,,,,,,,,,,,,,,,,,,,,,,,,,,,,,
451,531,535,538,539,542,543,542,543,543,543,545,543,542,542,537,537,500,,,,,,,,,,,,,,,,,,,,,,,,,,,,,,,,,,,,,,,
447,527,531,543,538,538,539,538,539,539,539,541,540,539,538,534,534,496,,,,,,,,,,,,,,,,,,,,,,,,,,,,,,,,,,,,,,,
445,525,530,533,534,537,538,537,538,538,538,540,538,537,537,532,532,494,,,,,,,,,,,,,,,,,,,,,,,,,,,,,,,,,,,,,,,
444,524,529,532,532,536,537,536,536,536,537,539,537,536,536,531,531,491,,,,,,,,,,,,,,,,,,,,,,,,,,,,,,,,,,,,,,,
441,522,526,537,531,534,534,534,534,534,535,537,535,534,533,529,529,488,,,,,,,,,,,,,,,,,,,,,,,,,,,,,,,,,,,,,,,
439,519,524,528,528,533,532,532,533,533,533,535,533,532,532,527,527,486,,,,,,,,,,,,,,,,,,,,,,,,,,,,,,,,,,,,,,,
439,518,523,527,527,531,531,531,532,532,532,534,532,531,531,526,526,484,,,,,,,,,,,,,,,,,,,,,,,,,,,,,,,,,,,,,,,
437,516,521,524,524,528,529,528,529,529,529,531,530,529,529,524,524,481,,,,,,,,,,,,,,,,,,,,,,,,,,,,,,,,,,,,,,,
437,515,520,523,524,527,528,527,528,528,528,531,529,528,528,523,523,480,,,,,,,,,,,,,,,,,,,,,,,,,,,,,,,,,,,,,,,
436,514,519,522,522,526,526,527,527,527,527,529,528,527,527,522,522,478,,,,,,,,,,,,,,,,,,,,,,,,,,,,,,,,,,,,,,,
433,512,516,521,519,523,523,523,524,524,524,526,525,525,524,519,519,475,,,,,,,,,,,,,,,,,,,,,,,,,,,,,,,,,,,,,,,
432,510,515,518,518,522,522,521,522,522,522,525,524,523,523,518,518,474,,,,,,,,,,,,,,,,,,,,,,,,,,,,,,,,,,,,,,,
432,509,514,517,517,521,521,521,521,521,522,524,523,523,523,517,518,473,,,,,,,,,,,,,,,,,,,,,,,,,,,,,,,,,,,,,,,
429,515,515,520,520,527,519,519,526,519,528,522,521,521,521,515,516,471,,,,,,,,,,,,,,,,,,,,,,,,,,,,,,,,,,,,,,,
429,508,512,515,515,519,519,519,519,519,520,524,522,522,522,517,518,472,,,,,,,,,,,,,,,,,,,,,,,,,,,,,,,,,,,,,,,
429,508,512,515,515,519,519,519,520,520,521,524,522,522,522,518,520,473,,,,,,,,,,,,,,,,,,,,,,,,,,,,,,,,,,,,,,,
410,511,514,518,517,521,522,522,523,523,524,527,525,525,524,521,525,461,,,,,,,,,,,,,,,,,,,,,,,,,,,,,,,,,,,,,,,
-5000,516,530,550,541,539,539,539,541,542,543,546,544,544,545,542,538,-5000,,,,,,,,,,,,,,,,,,,,,,,,,,,,,,,,,,,,,,,
,,,,,,,,,,,,,,,,,,,,,,,,,,,,,,,,,,,,,,,,,,,,,,,,,,,,,,,,
#,full_row_delta_max,,,,,,,,,,,,,,,,,,,,,,,,,,,,,,,,,,,,,,,,,,,,,,,,,,,,,,,
10000,4000,4000,4000,4000,4000,4000,4000,4000,4000,4000,4000,4000,4000,4000,4000,4000,4000,4000,4000,4000,4000,4000,4000,4000,4000,4000,4000,4000,4000,4000,4000,4000,4000,4000,4000,4000,10000,,,,,,,,,,,,,,,,,,,
#,full_row_delta_min,,,,,,,,,,,,,,,,,,,,,,,,,,,,,,,,,,,,,,,,,,,,,,,,,,,,,,,
-10000,-4000,-4000,-4000,-4000,-4000,-4000,-4000,-4000,-4000,-4000,-4000,-4000,-4000,-4000,-4000,-4000,-4000,-4000,-4000,-4000,-4000,-4000,-4000,-4000,-4000,-4000,-4000,-4000,-4000,-4000,-4000,-4000,-4000,-4000,-4000,-4000,-10000,,,,,,,,,,,,,,,,,,,
#,full_col_delta_max,,,,,,,,,,,,,,,,,,,,,,,,,,,,,,,,,,,,,,,,,,,,,,,,,,,,,,,
10000,4000,4000,4000,4000,4000,4000,4000,4000,4000,4000,4000,4000,4000,4000,4000,10000,,,,,,,,,,,,,,,,,,,,,,,,,,,,,,,,,,,,,,,,
#,,,,,,,,,,,,,,,,,,,,,,,,,,,,,,,,,,,,,,,,,,,,,,,,,,,,,,,,
-10000,-4000,-4000,-4000,-4000,-4000,-4000,-4000,-4000,-4000,-4000,-4000,-4000,-4000,-4000,-4000,-10000,,,,,,,,,,,,,,,,,,,,,,,,,,,,,,,,,,,,,,,,
