{
    "id": "travel",
    "title_id": "story_template_title_travel",
    "music": "Resource/music/out.aac",
    "template_desc_id": "travel_template_desc_1",
	"resolution": [1920, 1080],
    "segments": [
	    {
            "camera_id": 0,
            "duration": 4.3,
            "clip_desc_id": "auto_shoot_video_2",
            "demo_offset": [0, 4.3],
            "audio_offset": 0,
            "algo_scripts":{
                "operation_mode":"panning",
                "operation_param":"0,50,50,50"
            },
            "holder_scripts": {
                "delay_before_shoot_pos":0.5,
                "gimbal_before_shoot_pos":[0,0.2,0,0,-25,1],
                "gimbal_start_pos":[0,0.2,0,0,0,1],
                "gimbal_move":[
                    [0.5,4.2,0,0,25,1]
                ]
            }
        },
        {
            "camera_id": 0,
            "duration": 7.4,
            "shot_mode": "normal_video",
            "clip_desc_id": "travel_clip_desc_2",
            "demo_offset": [3.8, 11],
            "audio_offset": 4.3,
            "algo_scripts": {
            },
            "holder_scripts": {
            }
        },
        {
            "camera_id": 0,
            "duration": 3.4,
            "clip_desc_id": "auto_shoot_video_3",
            "demo_offset": [10.5, 13.9],
            "audio_offset": 10.5,
            "algo_scripts":{
                "operation_mode":"zoom",
                "operation_param":"1.2,1.5"
            },
            "holder_scripts": {
            }
        },
        {
            "camera_id": 0,
            "duration": 3.4,
            "clip_desc_id": "auto_shoot_video_4",
            "demo_offset": [13.4, 16.8],
            "audio_offset": 13.4,
            "algo_scripts":{
                "operation_mode":"panning",
                "operation_param":"50,50,20,50"
            },
            "holder_scripts": {
                "delay_before_shoot_pos":0.5,
                "gimbal_before_shoot_pos":[0,0.2,0,0,15,1],
                "gimbal_start_pos":[0,0.2,0,0,0,1],
                "gimbal_move":[
                    [0.5,2.1,0,0,-15,1]
                ]
            }
        },
        {
            "camera_id": 0,
            "duration": 5.66,
			"shot_mode": "normal_video",
            "clip_desc_id": "travel_clip_desc_5",
            "demo_offset": [16.3, 21.96],
            "audio_offset": 16.8,
            "camera_effects": {
			    "ai_video_type": "1"
            },
            "holder_scripts": {
            }
        }
    ]
}