{
    "AsrParams":{
        "Enrollment":[false, 0, 240, 2000, 100, 0, 30000, 1, 0, 1, 20000, 20, 0.3, 0.03, -0.1, 0.38, 0.1, 0],
        "Recognition":[false, 0, 240, 2000, 400, 0, 30000, 1, 0, 1, 20000, 20, 0.34, 0.1, -0.25, 0.34, 0.1, -0.25],
        "E2ERecognition":[false, 0, 240, 2000, 400, 0, 30000, 1, 0, 1, 20000, 20, 0.34, 0.1, -0.25, 0.34, 0.1, -0.25],
        "AecParam":[false, 0, 240, 2000, 400, 0, 30000, 1, 1, 1, 20000, 20, 0.31, 0.03, -0.48, 0.31, 0.03, -0.48],
        "BoundaryParam":[false, 0, 240, 2000, 400, 0, 30000, 1, 0, 1, 20000, 20, -0.99, -0.99, -0.99, -0.99, -0.99, -0.99],
        "DriveModeThres":[
            [0.03, -0.5, 0.3, 0.03, -0.5, 0.3, 1],
            [0.03, -0.5, 0.3, 0.03, -0.5, 0.3, 1],
            [0.03, -0.5, 0.3, 0.03, -0.5, 0.3, 1],
            [0.03, -0.5, 0.3, 0.03, -0.5, 0.3, 1],
            [0.03, -0.5, 0.3, 0.03, -0.5, 0.3, 1],
            [0.03, -0.5, 0.3, 0.03, -0.5, 0.3, 1],
            [0.03, -0.5, 0.3, 0.03, -0.5, 0.3, 1],
            [0.03, -0.5, 0.3, 0.03, -0.5, 0.3, 1],
            [0.03, -0.5, 0.3, 0.03, -0.5, 0.3, 0],
            [0.03, -0.5, 0.3, 0.03, -0.5, 0.3, 0],
            [0.03, -0.5, 0.3, 0.03, -0.5, 0.3, 0],
            [0.03, -0.5, 0.3, 0.03, -0.5, 0.3, 0],
            [0.03, -0.5, 0.3, 0.03, -0.5, 0.3, 0],
            [0.03, -0.5, 0.3, 0.03, -0.5, 0.3, 0],
            [0.03, -0.5, 0.3, 0.03, -0.5, 0.3, 0],
            [0.03, -0.5, 0.3, 0.03, -0.5, 0.3, 0],
            [0.03, -0.5, 0.3, 0.03, -0.5, 0.3, 0],
            [0.03, -0.5, 0.3, 0.03, -0.5, 0.3, 0],
            [0.03, -0.5, 0.3, 0.03, -0.5, 0.3, 0],
            [0.03, -0.5, 0.3, 0.03, -0.5, 0.3, 0],
            [0.03, -0.5, 0.3, 0.03, -0.5, 0.3, 0],
            [0.03, -0.5, 0.3, 0.03, -0.5, 0.3, 0],
            [0.03, -0.5, 0.3, 0.03, -0.5, 0.3, 0],
            [0.03, -0.5, 0.3, 0.03, -0.5, 0.3, 0],
            [0.03, -0.5, 0.3, 0.03, -0.5, 0.3, 0],
            [0.03, -0.5, 0.3, 0.03, -0.5, 0.3, 0],
            [0.03, -0.5, 0.3, 0.03, -0.5, 0.3, 0],
            [0.03, -0.5, 0.3, 0.03, -0.5, 0.3, 0],
            [0.03, -0.5, 0.3, 0.03, -0.5, 0.3, 0],
            [0.03, -0.5, 0.3, 0.03, -0.5, 0.3, 0],
            [0.03, -0.5, 0.3, 0.03, -0.5, 0.3, 0],
            [0.03, -0.5, 0.3, 0.03, -0.5, 0.3, 0],
            [0.03, -0.5, 0.3, 0.03, -0.5, 0.3, 1],
            [0.03, -0.5, 0.3, 0.03, -0.5, 0.3, 1],
            [0.03, -0.5, 0.3, 0.03, -0.5, 0.3, 1],
            [0.03, -0.5, 0.3, 0.03, -0.5, 0.3, 1],
            [0.03, -0.5, 0.3, 0.03, -0.5, 0.3, 1],
            [0.03, -0.5, 0.3, 0.03, -0.5, 0.3, 1],
            [0.03, -0.5, 0.3, 0.03, -0.5, 0.3, 1],
            [0.03, -0.5, 0.3, 0.03, -0.5, 0.3, 1],
            [0.03, -0.5, 0.3, 0.03, -0.5, 0.3, 1],
            [0.03, -0.5, 0.3, 0.03, -0.5, 0.3, 1],
            [0.03, -0.5, 0.3, 0.03, -0.5, 0.3, 1],
            [0.03, -0.5, 0.3, 0.03, -0.5, 0.3, 1],
            [0.03, -0.5, 0.3, 0.03, -0.5, 0.3, 1],
            [0.03, -0.5, 0.3, 0.03, -0.5, 0.3, 1],
            [0.03, -0.5, 0.3, 0.03, -0.5, 0.3, 1],
            [0.03, -0.5, 0.3, 0.03, -0.5, 0.3, 1],
            [0.03, -0.5, 0.3, 0.03, -0.5, 0.3, 1],
            [0.03, -0.5, 0.3, 0.03, -0.5, 0.3, 1],
            [0.03, -0.5, 0.3, 0.03, -0.5, 0.3, 1],
            [0.03, -0.5, 0.3, 0.03, -0.5, 0.3, 1],
            [0.03, -0.5, 0.3, 0.03, -0.5, 0.3, 1],
            [0.03, -0.5, 0.3, 0.03, -0.5, 0.3, 1],
            [0.03, -0.5, 0.3, 0.03, -0.5, 0.3, 1],
            [0.03, -0.5, 0.3, 0.03, -0.5, 0.3, 1],
            [0.03, -0.5, 0.3, 0.03, -0.5, 0.3, 1],
            [0.03, -0.5, 0.3, 0.03, -0.5, 0.3, 1],
            [0.03, -0.5, 0.3, 0.03, -0.5, 0.3, 1],
            [0.03, -0.5, 0.3, 0.03, -0.5, 0.3, 1],
            [0.03, -0.5, 0.3, 0.03, -0.5, 0.3, 1],
            [0.03, -0.5, 0.3, 0.03, -0.5, 0.3, 1],
            [0.03, -0.5, 0.3, 0.03, -0.5, 0.3, 1],
            [0.03, -0.5, 0.3, 0.03, -0.5, 0.3, 1],
            [0.03, -0.5, 0.3, 0.03, -0.5, 0.3, 1],
            [0.03, -0.5, 0.3, 0.03, -0.5, 0.3, 1],
            [0.03, -0.5, 0.3, 0.03, -0.5, 0.3, 1],
            [0.03, -0.5, 0.3, 0.03, -0.5, 0.3, 1],
            [0.03, -0.5, 0.3, 0.03, -0.5, 0.3, 1],
            [0.03, -0.5, 0.3, 0.03, -0.5, 0.3, 1],
            [0.03, -0.5, 0.3, 0.03, -0.5, 0.3, 1],
            [0.03, -0.5, 0.3, 0.03, -0.5, 0.3, 1],
            [0.03, -0.5, 0.3, 0.03, -0.5, 0.3, 1],
            [0.03, -0.5, 0.3, 0.03, -0.5, 0.3, 1],
            [0.03, -0.5, 0.3, 0.03, -0.5, 0.3, 1],
            [0.03, -0.5, 0.3, 0.03, -0.5, 0.3, 1],
            [0.03, -0.5, 0.3, 0.03, -0.5, 0.3, 1],
            [0.03, -0.5, 0.3, 0.03, -0.5, 0.3, 1],
            [0.03, -0.5, 0.3, 0.03, -0.5, 0.3, 1],
            [0.03, -0.5, 0.3, 0.03, -0.5, 0.3, 1],
            [0.03, -0.5, 0.3, 0.03, -0.5, 0.3, 1],
            [0.03, -0.5, 0.3, 0.03, -0.5, 0.3, 1],
            [0.03, -0.5, 0.3, 0.03, -0.5, 0.3, 1]
	    ],
        "WakeupModeThres":[
            [0.03, -0.5, 0.25, 0.03, -0.5, 0.25, 1],
            [0.03, -0.5, 0.25, 0.03, -0.5, 0.25, 1],
            [0.03, -0.5, 0.25, 0.03, -0.5, 0.25, 1],
            [0.03, -0.5, 0.25, 0.03, -0.5, 0.25, 1],
            [0.03, -0.5, 0.25, 0.03, -0.5, 0.25, 1],
            [0.03, -0.5, 0.6, 0.03, -0.5, 0.6, 1],
            [0.03, -0.5, 0.6, 0.03, -0.5, 0.6, 1],
            [0.03, -0.5, 0.6, 0.03, -0.5, 0.6, 1],
            [0.03, -0.5, 0.6, 0.03, -0.5, 0.6, 1],
            [0.03, -0.5, 0.4, 0.03, -0.5, 0.4, 1],
            [0.03, -0.5, 0.34, 0.03, -0.5, 0.34, 1],
            [0.1, -0.25, 0.34, 0.1, -0.25, 0.34, 1]
	    ]
    },
    "SensibilityParams":{
        "comment":"array element 0:low, 1:middle, 2:high",
        "AsrUnconfidentPhonesNum":[0, 1, 2],
        "DspSentenceThresholds":{
            "Default":[84, 84, 77, 73, 73, 67],
            "UserDefined":[88, 88, 88, 88, 88, 88]
        }
    },
	"DefaultPhrase":{
        "你好小E":[73, 73, 67, 73, 73, 67],
        "你好小易":[73, 73, 67, 73, 73, 67],
        "你好华为":[73, 73, 67, 73, 73, 67],
        "小艺小艺":[95, 95, 95,73, 73, 67],
        "你好悠悠":[88, 88, 88, 88, 88, 88],
        "我的荣耀":[73, 73, 67, 73, 73, 67]
	},
    "Features":["conf_upgrade","drv_optimization","unencrypted","native_bind","third_platform","no_hotword","border_offset","aec_composite","lp_composite","drv_composite","aec_dnn_e2e","drv_dnn_e2e","cloud_enable"],
	"ControlParams":["half_model","skip_frame","aec_slide","pcm_encrypt"],
     "PruneType":[1,1,6,4],
	"EnrollLoudParams":[77, 77, 0.69, 0.69],
	"EnrollSnrThrd":10.0,
	"EnrollSilThrd":20,
	"LowVolumeThres":[6.0, 45.0],
    "ConfidenceThres":[
        {"Text":"小艺小艺", "Threshold":[ [0.411, 0.443, 0.47, 0.533], [0.384, 0.421, 0.448, 0.473] ]},
        {"Text":"Default", "Threshold":[ [0.405, 0.438, 0.473, 0.648], [0.402, 0.449, 0.478, 0.505] ]}
    ],
    "E2EDecoderParams":{
        "E2ENpuComputeType": 3,
        "E2ENpuInitType": 2,
        "E2ENpuComputeAsyn": true,
        "E2ENpuLibraryPath": "/hw_product/lib64/libE2E.so",
        "E2ENpuModelName": "kws2_acousticsModel4.pb",
        "E2ENpuModelId": "kws2_acousticsModel4",
        "E2EWakeupPhrase": "小艺小艺",
        "E2EWakeupPinyin": "(xiao3)^(yi4)^(xiao3)^(yi)",
        "E2EScoreThres": 0.58,
        "E2EOutDimension": 2,
        "inputTensorNames": ["fingerprint_input", "input_state"],
        "outputTensorNames": ["AM_softmax_layer/cosine:0", "AM_softmax_layer/last_state:0"],
        "Dimension": 10,
        "LastStateSize":154,
        "OutConfig": [
            [0, "", "", 0],
            [1, "小艺小艺", "((xiao3)^(yi4)^(xiao3)^(yi)", 0.568]
        ],
        "ModelType": 2

    },
    "LPE2EDecoderParams":{
        "E2ENpuComputeType": 3,
        "E2ENpuInitType": 2,
        "E2ENpuComputeAsyn": true,
        "E2ENpuLibraryPath": "/hw_product/lib64/libE2E.so",
        "E2ENpuModelName": "kws2_acousticsModel4.pb",
        "E2ENpuModelId": "kws2_acousticsModel4",
        "E2EWakeupPhrase": "小艺小艺",
        "E2EWakeupPinyin": "(xiao3)^(yi4)^(xiao3)^(yi)",
        "E2EScoreThres": 0.58,
        "E2EOutDimension": 2,
        "inputTensorNames": ["fingerprint_input", "input_state"],
        "outputTensorNames": ["AM_softmax_layer/cosine:0", "AM_softmax_layer/last_state:0"],
        "Dimension": 10,
        "LastStateSize":154,
        "OutConfig": [
            [0, "", "", 0],
            [1, "小艺小艺", "((xiao3)^(yi4)^(xiao3)^(yi)", 0.568]
        ],
        "ModelType": 2

    },
    "AecE2EDecoderParams":{
        "E2ENpuComputeType": 3,
        "E2ENpuInitType": 2,
        "E2ENpuComputeAsyn": true,
        "E2ENpuLibraryPath": "/hw_product/lib64/libE2E.so",
        "E2ENpuModelName": "kws2_acousticsModel4.pb",
        "E2ENpuModelId": "kws2_acousticsModel4",
        "E2EWakeupPhrase": "小艺小艺",
        "E2EWakeupPinyin": "(xiao3)^(yi4)^(xiao3)^(yi)",
        "E2EScoreThres": 0.56,
        "E2EOutDimension": 2,
        "inputTensorNames": ["fingerprint_input", "input_state"],
        "outputTensorNames": ["AM_softmax_layer/cosine:0", "AM_softmax_layer/last_state:0"],
        "Dimension": 10,
        "LastStateSize":154,
        "OutConfig": [
            [0, "", "", 0],
            [1, "小艺小艺", "((xiao3)^(yi4)^(xiao3)^(yi)", 0.568]
        ],
        "ModelType": 2
    },
    "Oneshot_always" : 1
}
