{
    "id": "makeups",
    "title_id": "capture_mode_makeup",
    "music": "Resource/music/out.aac",
    "template_desc_id": "makeups_clip_desc_1",
    "resolution": [2384, 1080],
	"timer": "2",
    "segments": [
	    {
            "camera_id": 0,
            "duration": 3.8,
            "shot_mode": "normal_video",
            "clip_desc_id": "makeups_clip_desc_2",
            "demo_offset": [0, 3.4],
            "audio_offset": 0,
            "algo_scripts": {
            },
            "holder_scripts": {
				"zoom_ratio": "1"
            }
        },
	    {
            "camera_id": 1,
            "duration": 4,
            "shot_mode": "normal_video",
            "clip_desc_id": "makeups_clip_desc_3",
            "demo_offset": [3.8, 7],
            "audio_offset": 3.8,
            "algo_scripts": {
            },
            "holder_scripts": {
            },
			"camera_effects": {
			    "zoom_ratio": "0.8",
				"exhibition_mode": "1"
            }
        },
	    {
            "camera_id": 1,
            "duration": 3.6,
            "shot_mode": "normal_video",
            "clip_desc_id": "makeups_clip_desc_4",
            "demo_offset": [7.1, 10.4],
            "audio_offset": 7.1,
            "algo_scripts": {
            },
            "holder_scripts": {
            },
			"camera_effects": {
			    "zoom_ratio": "0.8"
            }
        },
	    {
            "camera_id": 1,
            "duration": 3.8,
            "shot_mode": "normal_video",
            "clip_desc_id": "makeups_clip_desc_5",
            "demo_offset": [10.65, 13.95],
            "audio_offset": 10.5,
            "algo_scripts": {
            },
            "holder_scripts": {
            },
            "camera_effects": {
			    "zoom_ratio": "2"
            }
        },
	    {
            "camera_id": 1,
            "duration": 4.1,
            "shot_mode": "dual_video_front",
            "clip_desc_id": "makeups_clip_desc_6",
            "demo_offset": [14.5, 17.7],
            "audio_offset": 14.5,
            "algo_scripts": {
            },
            "holder_scripts": {
            }
        },
	    {
            "camera_id": 1,
            "duration": 3.8,
            "shot_mode": "normal_video",
            "clip_desc_id": "makeups_clip_desc_7",
            "demo_offset": [18, 21.3],
            "audio_offset": 17.9,
            "algo_scripts": {
            },
            "holder_scripts": {
            }
        }
    ]
}