[
 {
    "config_filename": ".\/config.json",
	"FairLight_Type": 0
 },
 {
    "config_filename": ".\/config.json",
	"FairLight_Type": 1
 },
 {
    "config_filename": ".\/config.json",
	"FairLight_Type": 2
 },
 {
    "config_filename": ".\/config.json",
	"FairLight_Type": 3
 },
 {
    "config_filename": ".\/config.json",
	"FairLight_Type": 4
 }, 
 {
    "config_filename": ".\/config.json",
	"FairLight_Type": 5
 },
  {
    "config_filename": ".\/config-stainedglass.json",
	"FairLight_Type": 8
 },
  {
    "config_filename": ".\/config-neonlight.json",
	"FairLight_Type": 9
 },
  {
    "config_filename": ".\/config-blind.json",
	"FairLight_Type": 10
 },
 {
    "config_filename": ".\/config-leafyshade.json",
	"FairLight_Type": 12
 },
  {
    "config_filename": ".\/config-booth.json",
	"FairLight_Type": 15
 },
   {
    "config_filename": ".\/config-studiolight-male.json",
	"FairLight_Type": 17
 },
   {
    "config_filename": ".\/config-studiolight-female.json",
	"FairLight_Type": 18
 },
   {
    "config_filename": ".\/config-studiolight-noshading.json",
	"FairLight_Type": 19
 }
]
