{
  "config":{
    "hw_platform": ["QRD", "IDP"],
    "soc_id": ["475", "497", "498", "515"]
  },
  "mmc56x3x_0":{
    "owner": "sns_mmc56x3x",
    ".mag":{
      "owner": "sns_mmc56x3x",
      ".config":{
        "owner": "sns_mmc56x3x",
        "is_dri":{ "type": "int", "ver": "0",
          "data": "0"
        },
        "hw_id":{ "type": "int", "ver": "0",
          "data": "0"
        },
        "res_idx":{ "type": "int", "ver": "0",
          "data": "0"
        },
        "sync_stream":{ "type": "int", "ver": "0",
          "data": "0"
        }
      }
	}
  },
  "mmc56x3x_0_platform":{
    "owner": "sns_mmc56x3x",
    ".config":{
      "owner": "sns_mmc56x3x",
      "bus_type":{ "type": "int", "ver": "0",
        "data": "0"
      },
      "bus_instance":{ "type": "int", "ver": "0",
        "data": "1"
      },
      "slave_config":{ "type": "int", "ver": "0",
        "data": "48"
      },
      "i3c_address":{ "type": "int", "ver": "0",
        "data": "20"
      },
      "min_bus_speed_khz":{ "type": "int", "ver": "0",
        "data": "100"
      },
      "max_bus_speed_khz":{ "type": "int", "ver": "0",
        "data": "400"
      },
      "reg_addr_type":{ "type": "int", "ver": "0",
        "data": "0"
      },
      "num_rail":{ "type": "int", "ver": "0",
        "data": "1"
      },
      "rail_on_state":{ "type": "int", "ver": "0",
        "data": "1"
      },
      "vddio_rail":{ "type": "str", "ver": "0",
        "data": "/pmic/client/sensor_vddio"
      },
      "rigid_body_type":{ "type": "int", "ver": "0",
      "data": "0"
      }
    },
    ".orient":{
      "owner": "sns_mmc56x3x",
      "x":{ "type": "str", "ver": "0",
        "data": "+y"
      },
      "y":{ "type": "str", "ver": "0",
        "data": "+x"
      },
      "z":{ "type": "str", "ver": "0",
        "data": "-z"
      }
    },
    ".corr_mat_nfc":{
    "owner": "sns_mmc56x3x",
    "0_0":{ "type": "flt", "ver": "1",
            "data": "0.996031"
          },
    "0_1":{ "type": "flt", "ver": "1",
            "data": "-0.080963"
          },
    "0_2":{ "type": "flt", "ver": "1",
            "data": "0.035824"
          },
    "1_0":{ "type": "flt", "ver": "1",
            "data": "-0.057722"
          },
    "1_1":{ "type": "flt", "ver": "1",
            "data": "1.130547"
          },
    "1_2":{ "type": "flt", "ver": "1",
            "data": "-0.070343"
          },
    "2_0":{ "type": "flt", "ver": "1",
            "data": "0.052242"
          },
    "2_1":{ "type": "flt", "ver": "1",
            "data": "-0.001877"
          },
    "2_2":{ "type": "flt", "ver": "1",
            "data": "1.171114"
          }
    },
    ".mag":{
      "owner": "sns_mmc56x3x",
      ".fac_cal":{
        "owner": "sns_mmc56x3x",
        ".corr_mat":{
          "owner": "sns_mmc56x3x",
          "0_0":{ "type": "flt", "ver": "0",
            "data": "0.996031"
          },
          "0_1":{ "type": "flt", "ver": "0",
            "data": "-0.080963"
          },
          "0_2":{ "type": "flt", "ver": "0",
            "data": "0.035824"
          },
          "1_0":{ "type": "flt", "ver": "0",
            "data": "-0.057722"
          },
          "1_1":{ "type": "flt", "ver": "0",
            "data": "1.130547"
          },
          "1_2":{ "type": "flt", "ver": "0",
            "data": "-0.070343"
          },
          "2_0":{ "type": "flt", "ver": "0",
            "data": "0.052242"
          },
          "2_1":{ "type": "flt", "ver": "0",
            "data": "-0.001877"
          },
          "2_2":{ "type": "flt", "ver": "0",
            "data": "1.171114"
          }
        },
        ".bias":{
          "owner": "sns_mmc56x3x",
          "x":{ "type": "flt", "ver": "0",
            "data": "0.0"
          },
          "y":{ "type": "flt", "ver": "0",
            "data": "0.0"
          },
          "z":{ "type": "flt", "ver": "0",
            "data": "0.0"
          }
        }
      },
      ".charging_comp":{
          "owner": "sns_mmc56x3x",
          ".mode":{
            "owner": "sns_mmc56x3x",
            "x":{ "type": "int", "ver": "0",
              "data": "1"
            }
          },
          ".5v2a":{
            "owner": "sns_mmc56x3x",
            "x":{ "type": "flt", "ver": "0",
              "data": "-0.000106395"
            },
            "y":{ "type": "flt", "ver": "0",
              "data": "-0.00039672"
            },
            "z":{ "type": "flt", "ver": "0",
              "data": "0.002279962"
            }
          },
          ".5v4a":{
            "owner": "sns_mmc56x3x",
            "x":{ "type": "flt", "ver": "0",
              "data": "-1.01596E-05"
            },
            "y":{ "type": "flt", "ver": "0",
              "data": "2.08146E-05"
            },
            "z":{ "type": "flt", "ver": "0",
              "data": "0.00087812"
            }
          },
          ".10v4a":{
            "owner": "sns_mmc56x3x",
            "x":{ "type": "flt", "ver": "0",
              "data": "-1.58136E-05"
            },
            "y":{ "type": "flt", "ver": "0",
              "data": "-2.62809E-05"
            },
            "z":{ "type": "flt", "ver": "0",
              "data": "0.001569315"
            }
          },
         ".9v2a":{
            "owner": "sns_mmc56x3x",
            "x":{ "type": "flt", "ver": "0",
              "data": "0.000285145"
            },
            "y":{ "type": "flt", "ver": "0",
              "data": "-0.000408175"
            },
            "z":{ "type": "flt", "ver": "0",
              "data": "0.000792656"
            }
          },
          ".5v4anfc":{
            "owner": "sns_mmc56x3x",
            "x":{ "type": "flt", "ver": "0",
              "data": "-1.01596E-05"
            },
            "y":{ "type": "flt", "ver": "0",
              "data": "2.08146E-05"
            },
            "z":{ "type": "flt", "ver": "0",
              "data": "0.00087812"
            }
          },
          ".10v4anfc":{
            "owner": "sns_mmc56x3x",
            "x":{ "type": "flt", "ver": "0",
              "data": "-1.58136E-05"
            },
            "y":{ "type": "flt", "ver": "0",
              "data": "-2.62809E-05"
            },
            "z":{ "type": "flt", "ver": "0",
              "data": "0.001569315"
            }
          }
        }
    },
    ".placement":{
      "owner": "sns_mmc56x3x",
      "0":{ "type": "flt", "ver": "0",
        "data": "0.0"
      },
      "1":{ "type": "flt", "ver": "0",
        "data": "0.0"
      },
      "2":{ "type": "flt", "ver": "0",
        "data": "0.0"
      },
      "3":{ "type": "flt", "ver": "0",
        "data": "0.0"
      },
      "4":{ "type": "flt", "ver": "0",
        "data": "0.0"
      },
      "5":{ "type": "flt", "ver": "0",
        "data": "0.0"
      },
      "6":{ "type": "flt", "ver": "0",
        "data": "0.0"
      },
      "7":{ "type": "flt", "ver": "0",
        "data": "0.0"
      },
      "8":{ "type": "flt", "ver": "0",
        "data": "0.0"
      },
      "9":{ "type": "flt", "ver": "0",
        "data": "0.0"
      },
      "10":{ "type": "flt", "ver": "0",
        "data": "0.0"
      },
      "11":{ "type": "flt", "ver": "0",
        "data": "0.0"
      }
    }
  }
}
