{
  "anti_touch_callback": {
    "value": [
      "anti_touch_none",
      "anti_touch_none",
      "anti_touch_none"
    ]
  },
  "cap_cali_data_is_ok": {
    "value": true
  },
  "cap_para_is_bad_image": {
    "value": [
      30,
      20
    ]
  },
  "cap_rm_templates_support": {
    "value": true
  },
  "cap_support_apns": {
    "value": false
  },
  "cap_support_slide_enroll": {
    "value": false
  },
  "fp_face_recognization_support": {
    "value": false
  },
  "fp_face_support_angle_judge": {
    "value": false
  },
  "fp_sensor_frequency": {
    "value": 0
  },
  "ud_mmie_para_name_use_id": {
    "value": true
  },
  "ud_need_low_power_deep_sleep": {
    "value": true
  },
  "ud_need_wait_tp_stable": {
    "value": false
  },
  "ud_no_need_maintenance_calibration": {
    "value": false
  },
  "ud_para_ai_spoof": {
    "value": []
  },
  "ud_para_enroll_fake_press_times": {
    "value": 10
  },
  "ud_para_highlight_color": {
    "value": 16777215
  },
  "ud_para_logo_position": {
    "value": []
  },
  "ud_para_mmie_location_cirle": {
    "value": []
  },
  "ud_silead_factory_data_need_append_dumpsuffix": {
    "value": true
  },
  "ud_support_2p_3p": {
    "value": false
  },
  "ud_support_face_recognization_fingerup": {
    "value": false
  },
  "ud_support_mmie_para": {
    "value": false
  },
  "ud_support_pressure_adjust": {
    "value": false
  },
  "ud_support_unlock_learning": {
    "value": false
  },
  "yaml_debug_simplify_json": {
    "value": false
  },
  "yaml_description": {
    "value": "base config file, modify by lengxuntai 00294297 on 2022.4.1"
  }
}
