﻿{
	"centerX" : 0.5,
	"centerY" : 0.5,
	"angle" : 0,
	"scale" : 1,
	"width" : 102,
	"height" : 116,
	"contents" : [{
			"type" : "image",
			"resource" : {
				"type" : "static",
				"path" : "res/cai dan.png"
			},
			"centerX" : 0.5,
			"centerY" : 0.5,
			"width" : 102,
			"height" : 116,
			"angle" : 0,
			"zorder" : 1
		},
		{
            "type": "text",
            "centerX": 0.38,
            "centerY": 0.45,
            "width": 10,
            "height": 25,
            "angle": 0,
            "color": "#ff5f3a24",
            "isVertical": 0,
            "alignment": 0,
            "text": "￥",
            "textEn": "$",
            "textsize": 30,
            "zorder": 2
        },
		{
            "type": "text",
            "centerX": 0.6,
            "centerY": 0.45,
            "width": 30,
            "height": 25,
            "angle": 0,
            "texttype": "7",
            "color": "#ff5f3a24",
            "isVertical": 0,
            "alignment": 0,
            "editable":true,
            "text": "88",
            "textsize": 30,
            "zorder": 2
        },
		{
            "type": "text",
            "centerX": 0.5,
            "centerY": 0.72,
            "width": 70,
            "height": 13,
            "angle": 0,
            "color": "#ff848484",
            "isVertical": 0,
            "alignment": 0,
            "text": "{yyyy/MM/dd a hh:mm}",
            "textsize": 18,
            "zorder": 2
        }
	]
}
