{
    "resId":"nlu_nspBAName_local_group_comp",
    "domain":"nlu",
    "district":"china",
    "deviceType":"common",
    "productName":"common",
    "romVersion":"common",
    "osVersion":"common",
    "version":"0x01010000",
    "releaseNotes":"",
    "digest":"",
    "fileName":"",
    "ResMetaData":[
        {
            "origin_id":"0x000000000200009d",
            "res_value":"",
            "res_path":"nlu/domainDic/static/124.dat",
            "domain":"nlu",
            "data_version":"0x01010000",
            "encrypt_mode":"0"
        },
        {
            "origin_id":"0x000000000200009e",
            "res_value":"",
            "res_path":"nlu/domainDic/static/124.pos",
            "domain":"nlu",
            "data_version":"0x01010000",
            "encrypt_mode":"0"
        }
    ]
}