her there are	CMD
i i see	CMD
sharleen	CMD
show year	CMD
columbia	CMD
halimeda	CMD
zillion	CMD
aeclimian	CMD
shawe	CMD
hesird	CMD
zhaoqiuya	CMD
harbison	CMD
mitigated	CMD
professional	CMD
smeltzer	CMD
tebuthiuron	CMD
walraven	CMD
gastonia	CMD
perturbation	CMD
tritium	CMD
unethical	CMD
halleluyah	CMD