{
  "config":{
    "hw_platform": ["QRD"],
    "soc_id": ["515"]
  },
  "sns_ultrasonic":{
    "owner":"sns_ultrasonic",
    ".config":{
      "owner":"sns_ultrasonic",
      "is_exist":{ "type": "flt", "ver": "0",
        "data": "7315"
      }
    }
  }
}