{
	"centerX" : 0.5,
	"centerY" : 0.5,
	"width" : 228,
    "height" : 134,
    "angle" : 0,
	"scale" : 1,
	"contents" : [{
            "type":"image",
			"resource":{
                "type":"static",
				"path":"res/holiday.png"
			},
            "centerX":0.5,
            "centerY":0.4,
            "width":218,
            "height":100,
            "angle": 0,
            "zorder" : 1
        },
        {
            "type":"image",
			"resource":{
                "type":"static",
				"path":"res/location.png"
			},
            "centerX":0.504,
            "centerY":0.903,
            "width":24,
            "height":24,
            "angle": 0,
            "zorder" : 1
		},
		{
            "type": "text",
            "centerX": 0.75,
            "centerY":0.903,
            "width": 86,
            "height": 16,
            "color": "#ffffffff",
            "alignment":1,
            "editable":true,
            "text": "{LOCATION1}",
            "angle": 0,
            "zorder": 2
        }
	]
}
