[
  {
    "color": [
      0.93267613649368286,
      0.93267190456390381,
      0.93267190456390381
    ],
    "ignore_ext_mv": true,
    "intensity_diff": 80,
    "intensity_spec": 0,
    "ltc_two_sided": true,
    "name": "key",
    "onnoff": true,
    "rel_rot": [
      0.020561814308166504,
      -0.2037140280008316,
      0
    ],
    "rel_scale": [
      2,
      1
    ],
    "rel_trans": [
      -1.579742431640625,
      -0.16058202087879181,
      7.6471366882324219
    ],
    "shadow_cast": false,
    "type": "AREA"
  },
  {
    "color": [
      0.55111479759216309,
      0.55111229419708252,
      0.55111229419708252
    ],
    "ignore_ext_mv": true,
    "intensity_diff": 10,
    "intensity_spec": 0,
    "ltc_two_sided": true,
    "name": "fill",
    "onnoff": false,
    "rel_rot": [
      0,
      0.90986084938049316,
      5
    ],
    "rel_scale": [
      2,
      2
    ],
    "rel_trans": [
      2.5720000267028809,
      0,
      2
    ],
    "shadow_cast": false,
    "type": "AREA"
  },
  {
    "color": [
      0.70990538597106934,
      0.70990216732025146,
      0.70990216732025146
    ],
    "ignore_ext_mv": true,
    "intensity_diff": 10,
    "intensity_spec": 0.10000000149011612,
    "ltc_two_sided": true,
    "name": "back",
    "onnoff": false,
    "rel_rot": [
      0,
      -0.90986084938049316,
      0
    ],
    "rel_scale": [
      1,
      1
    ],
    "rel_trans": [
      -2.5720000267028809,
      0,
      2
    ],
    "shadow_cast": false,
    "type": "AREA"
  }
]
