{
	"centerX" : 0.5,
	"centerY" : 0.5,
	"angle" : 0,
	"scale" : 1,
	"width" : 158,
	"height" : 158,
	"contents" : [
		{
            "type": "text",
            "centerX": 0.38,
            "centerY": 0.114,
            "width": 80,
            "height": 16,
            "angle": 0,
            "color": "#ffffffff",
            "isVertical": 0,
			"alignment": 1,
            "text": "{EEEE}",
            "font":"roboto",
            "zorder": 2
		},
		{
            "type": "text",
            "centerX": 0.38,
            "centerY": 0.234,
            "width": 80,
            "height": 16,
            "angle": 0,
            "color": "#ffffffff",
            "isVertical": 0,
            "alignment": 1,
            "font":"roboto",
            "text": "{yyyy-MM-dd}",
            "zorder": 2
		},
		{
            "type": "text",
            "centerX": 0.35,
            "centerY" : 0.5,
            "width": 90,
            "height": 100,
            "angle": 0,
            "color": "#ffffffff",
            "isVertical": 0,
            "alignment": 1,
            "font":"robotothin",
			"text": "{TEMPERATURE}",
            "zorder": 2
        },
		{
			"type" : "image",
			"resource":{
                "type":"dynamic",
                "resKey":"{TEMPERATURE_UNIT}",
                "resources":[
                    {
                        "key":"du",
                        "path":"res/du.png"
                    },
                    {
                        "key":"du_en",
                        "path":"res/du_en.png"
                    },{
                        "key":"du_arabic",
                        "path":"res/du_arabic.png"
                    }
                ]
            },
			"centerX" : 0.75,
			"centerY" : 0.42,
			"width" : 20,
			"height" : 20,
			"angle" : 0,
			"zorder" : 1
		},
		{
            "type": "text",
            "centerX": 0.75,
            "centerY": 0.72,
            "width": 40,
            "height": 16,
            "angle": 0,
            "color": "#ffffffff",
            "isVertical": 0,
            "alignment": 0,
            "font":"roboto",
			"text": "{WEATHER}",
            "zorder": 2
		},
		{
            "type": "text",
            "centerX": 0.35,
            "centerY": 0.88,
            "width": 80,
            "height": 16,
            "angle": 0,
            "color": "#ffffffff",
            "isVertical": 0,
			"alignment": 0,
            "text": "{LOCATION}",
            "font":"roboto",
			"editable":true,
            "zorder": 2
		},
		{
			"type" : "image",
			"resource" : {
				"type" : "static",
				"path" : "res/location.png"
			},
			"centerX" : 0.75,
			"centerY" : 0.88,
			"width" : 10,
			"height" : 16,
			"angle" : 0,
			"zorder" : 1
		}
	]
}
