{
	"centerX" : 0.5,
	"centerY" : 0.5,
	"angle" : 0,
	"scale" : 1,
	"width" : 134,
	"height" : 110,
	"contents" : [
		{
			"type" : "image",
			"resource" : {
				"type" : "static",
				"path" : "res/wind.png"
			},
			"centerX" : 0.336,
			"centerY" : 0.5,
			"width" : 90,
			"height" : 108,
			"angle" : 0,
			"zorder" : 1
		},
		{
            "type": "text",
            "centerX": 0.8,
            "centerY" : 0.6,
            "width": 50,
            "height": 16,
            "angle": 0,
            "color": "#ffffffff",
            "isVertical": 0,
			"alignment": 1,
            "text": "{WIND_DIRECTION}",
            "zorder": 2
        },
		{
            "type": "text",
            "centerX": 0.8,
            "centerY": 0.74,
            "width": 50,
            "height": 16,
            "angle": 0,
            "color": "#ffffffff",
            "isVertical": 0,
			"alignment": 1,
            "text": "{WIND_SPEED}",
            "zorder": 2
		},
		{
            "type": "text",
            "centerX": 0.8,
            "centerY": 0.88,
            "width": 50,
            "height": 16,
            "angle": 0,
            "color": "#ffffffff",
            "isVertical": 0,
			"alignment": 1,
			"text": "{LOCATION}",
			"editable":true,
            "zorder": 2
		}
	]
}
