0.218663 0.650104
0.207781 0.548898
0.207300 0.540454
0.206229 0.514098
0.205577 0.487889
0.205244 0.470564
0.205235 0.444478
0.204938 0.403987
0.206019 0.360933
0.215106 0.584207
0.215376 0.521970
0.215158 0.513040
0.214804 0.477970
0.214960 0.443148
0.214674 0.418279
0.214160 0.394991
0.219767 0.312150
0.225608 0.612737
0.225183 0.607096
0.220691 0.552732
0.220331 0.543900
0.224227 0.494455
0.224129 0.476711
0.224258 0.433236
0.223814 0.393522
0.224833 0.338218
0.231238 0.601776
0.228451 0.520814
0.225984 0.688858
0.233127 0.502418
0.233365 0.493496
0.234064 0.448886
0.233336 0.391935
0.242023 0.629746
0.239770 0.617527
0.236596 0.560149
0.236654 0.533858
0.240359 0.643059
0.242653 0.483631
0.243611 0.456527
0.243695 0.430421
0.243453 0.413484
0.241359 0.341348
0.244048 0.575704
0.245505 0.515294
0.244967 0.281911
0.251348 0.492307
0.252121 0.474022
0.252956 0.455787
0.251904 0.381025
0.243887 0.655337
0.250309 0.589496
0.252857 0.534043
0.253990 0.515289
0.258255 0.441632
0.257580 0.398951
0.262979 0.418993
0.241243 0.693353
0.261051 0.635078
0.262592 0.627898
0.257851 0.613898
0.256326 0.595578
0.260201 0.542892
0.265031 0.486970
0.266401 0.468573
0.266894 0.459079
0.267405 0.405350
0.272286 0.426198
0.271486 0.388257
0.267238 0.343064
0.256636 0.259821
0.247516 0.688696
0.249929 0.675311
0.263757 0.582491
0.267929 0.542822
0.268983 0.534270
0.270940 0.515218
0.273106 0.495949
0.275503 0.468004
0.276339 0.449106
0.277029 0.412292
0.274640 0.328632
0.268099 0.602716
0.271377 0.575731
0.279089 0.515452
0.281685 0.496468
0.283732 0.477408
0.285076 0.458220
0.285382 0.448416
0.286156 0.429418
0.286440 0.410602
0.286093 0.393194
0.282092 0.356938
0.274711 0.630664
0.279429 0.289743
0.256169 0.707899
0.283117 0.543701
0.285999 0.525346
0.288889 0.506367
0.291550 0.487454
0.294287 0.458044
0.295163 0.437987
0.295990 0.409089
0.295623 0.391605
0.290885 0.355230
0.286251 0.323421
0.283012 0.269354
0.264210 0.696415
0.264842 0.688929
0.266404 0.673842
0.268360 0.658299
0.283408 0.582818
0.292512 0.535169
0.295853 0.516157
0.300277 0.488157
0.302698 0.468230
0.304114 0.447613
0.305339 0.427168
0.304573 0.381802
0.310387 0.412115
0.297625 0.318854
0.282923 0.244257
0.268377 0.714060
0.270805 0.691669
0.275640 0.651706
0.281180 0.642145
0.286763 0.626219
0.286515 0.619553
0.289167 0.589858
0.295182 0.561925
0.304348 0.516989
0.307563 0.498041
0.310188 0.478210
0.312500 0.458202
0.314709 0.426786
0.314855 0.388355
0.308406 0.352658
0.304748 0.340287
0.299069 0.289443
0.318413 0.442274
0.319715 0.421610
0.299611 0.272804
0.276465 0.702671
0.278807 0.672544
0.292233 0.635844
0.294191 0.629301
0.294105 0.608206
0.297253 0.590545
0.298629 0.583895
0.300275 0.576856
0.303576 0.562889
0.309268 0.536764
0.317937 0.489191
0.320489 0.468585
0.325099 0.405705
0.319197 0.357978
0.307576 0.295212
0.295609 0.243456
0.294491 0.639911
0.329250 0.421734
0.329921 0.401091
0.318006 0.343034
0.312670 0.317456
0.305672 0.264563
0.281765 0.720315
0.284379 0.698242
0.285654 0.684003
0.288677 0.661177
0.292841 0.652005
0.300579 0.617898
0.301692 0.608018
0.321674 0.519098
0.325462 0.500020
0.328584 0.480239
0.329878 0.469760
0.330839 0.459179
0.331937 0.448597
0.333343 0.432616
0.331847 0.371582
0.311871 0.274552
0.338719 0.422316
0.339130 0.411850
0.328556 0.349804
0.291178 0.709327
0.292484 0.702242
0.293136 0.695320
0.297368 0.668054
0.301427 0.657372
0.310025 0.629121
0.310413 0.626184
0.309932 0.616738
0.311291 0.607313
0.315172 0.589581
0.316478 0.582916
0.321300 0.563355
0.335944 0.491317
0.340125 0.460637
0.337386 0.366634
0.326610 0.327114
0.322816 0.295002
0.320797 0.281151
0.313175 0.645934
0.330823 0.543202
0.346596 0.445454
0.347997 0.423819
0.347720 0.394172
0.345501 0.377109
0.325370 0.284798
0.315508 0.238800
0.297153 0.725696
0.302394 0.700053
0.304351 0.687837
0.309907 0.674445
0.313709 0.663255
0.322086 0.625217
0.321871 0.615533
0.322969 0.606067
0.326182 0.589831
0.327544 0.582582
0.328871 0.576489
0.343675 0.502944
0.346994 0.483332
0.349375 0.462701
0.352366 0.435609
0.351396 0.390913
0.334495 0.320064
0.330038 0.288515
0.325901 0.266635
0.322708 0.250678
0.325696 0.649872
0.357473 0.415643
0.353714 0.379680
0.336338 0.304432
0.308923 0.715440
0.310459 0.709729
0.316855 0.694860
0.324863 0.681925
0.327395 0.667743
0.335161 0.625985
0.334332 0.616495
0.335141 0.606190
0.338151 0.590418
0.356251 0.485132
0.358669 0.465108
0.360057 0.454217
0.361067 0.402765
0.353473 0.362813
0.350582 0.347775
0.348490 0.340643
0.344047 0.327563
0.338044 0.289314
0.324697 0.223910
0.338402 0.652611
0.340615 0.640363
0.366817 0.418346
0.337445 0.263811
0.334444 0.246282
0.315075 0.730187
0.320963 0.713354
0.326221 0.705595
0.333059 0.693866
0.337102 0.685646
0.340429 0.670269
0.350073 0.628220
0.348764 0.617424
0.348925 0.607497
0.349626 0.599055
0.350216 0.591494
0.352263 0.579066
0.353255 0.566554
0.356423 0.542684
0.359134 0.524912
0.364234 0.497352
0.365978 0.487718
0.371843 0.435297
0.371288 0.415298
0.367804 0.387728
0.365588 0.371325
0.362793 0.355409
0.360984 0.348239
0.358543 0.340878
0.355496 0.335186
0.349132 0.321762
0.348329 0.314209
0.346922 0.302475
0.343231 0.276823
0.355720 0.633293
0.376958 0.431597
0.375875 0.411755
0.339219 0.227632
0.325512 0.731567
0.344120 0.697834
0.348911 0.687871
0.354752 0.671082
0.358414 0.650818
0.363466 0.631138
0.362508 0.621029
0.362601 0.610656
0.362683 0.602435
0.363775 0.587823
0.363975 0.575669
0.366527 0.544848
0.370842 0.518268
0.374518 0.500361
0.376236 0.490986
0.377573 0.480953
0.381042 0.459894
0.381733 0.449364
0.381692 0.428242
0.379401 0.398494
0.377848 0.379921
0.376511 0.363868
0.374754 0.355623
0.372840 0.348631
0.369374 0.342032
0.354858 0.323997
0.353703 0.310168
0.349469 0.270538
0.347622 0.252079
0.333141 0.723257
0.361521 0.670053
0.364896 0.646990
0.385913 0.414148
0.336601 0.732754
0.343345 0.717263
0.349616 0.710433
0.365780 0.678602
0.370525 0.658440
0.373045 0.633047
0.373111 0.623450
0.373705 0.614166
0.375136 0.585850
0.374826 0.564395
0.378378 0.538735
0.381049 0.521308
0.382860 0.512396
0.385313 0.503394
0.388457 0.494714
0.390942 0.463224
0.392631 0.453597
0.392573 0.442592
0.391992 0.431931
0.389847 0.399427
0.389560 0.389193
0.388829 0.371088
0.388246 0.362033
0.360680 0.326714
0.358521 0.319088
0.357319 0.281921
0.354615 0.243220
0.364799 0.695562
0.375118 0.662233
0.377959 0.620247
0.396261 0.415849
0.348391 0.733113
0.352118 0.721981
0.369267 0.700558
0.381419 0.657202
0.380940 0.652808
0.380160 0.636704
0.384887 0.608875
0.385938 0.601359
0.386179 0.595716
0.385911 0.589608
0.384834 0.575324
0.386315 0.558524
0.387273 0.550037
0.389864 0.532413
0.391506 0.524168
0.392551 0.514754
0.396215 0.486384
0.397363 0.475254
0.400506 0.452436
0.402739 0.444091
0.402621 0.433124
0.398937 0.354628
0.395909 0.350215
0.364829 0.293734
0.364007 0.266025
0.363011 0.244304
0.365458 0.711595
0.384003 0.672323
0.385890 0.690082
0.388493 0.677804
0.391093 0.664281
0.388089 0.651258
0.388110 0.643765
0.388132 0.634470
0.387740 0.626838
0.394890 0.611794
0.395941 0.606194
0.395973 0.600653
0.395348 0.577782
0.396254 0.560799
0.397610 0.543720
0.398854 0.534892
0.402292 0.517276
0.401260 0.506642
0.400967 0.495541
0.402046 0.487988
0.402054 0.474510
0.403583 0.461665
0.406892 0.449231
0.410793 0.432178
0.410393 0.420787
0.412003 0.360952
0.410182 0.356143
0.397897 0.344276
0.389412 0.338884
0.371010 0.323641
0.367259 0.319846
0.367779 0.313962
0.372131 0.297666
0.372334 0.257703
0.376239 0.731753
0.376965 0.723464
0.379486 0.716373
0.397336 0.674180
0.398862 0.658528
0.395884 0.645798
0.395776 0.640818
0.398156 0.626439
0.402280 0.621071
0.403952 0.615690
0.404934 0.610667
0.404823 0.596550
0.405260 0.579892
0.406029 0.554372
0.406578 0.545791
0.407250 0.536615
0.408213 0.518131
0.407510 0.507888
0.407386 0.498379
0.407146 0.486901
0.409130 0.473575
0.410285 0.458773
0.411678 0.446452
0.414400 0.437899
0.420846 0.398373
0.421696 0.387532
0.423890 0.366699
0.423968 0.360997
0.413149 0.350869
0.388989 0.328457
0.378636 0.324202
0.380948 0.273553
0.379956 0.234091
0.410855 0.504052
0.390336 0.731780
0.393759 0.711175
0.396877 0.700193
0.401576 0.683155
0.403312 0.670220
0.402766 0.653746
0.406945 0.628364
0.411308 0.618879
0.413888 0.613215
0.415941 0.590219
0.415847 0.573565
0.415383 0.547034
0.415739 0.538148
0.415931 0.528450
0.415116 0.519479
0.414532 0.510274
0.416536 0.486653
0.417254 0.472963
0.416603 0.459422
0.416653 0.444656
0.424310 0.425683
0.433605 0.375642
0.435979 0.364436
0.427512 0.356638
0.417248 0.346264
0.388462 0.290628
0.390214 0.280208
0.394185 0.255190
0.407201 0.718650
0.406009 0.705396
0.408053 0.692627
0.408972 0.669509
0.404795 0.648338
0.418553 0.626715
0.421321 0.620947
0.426195 0.601203
0.425402 0.575769
0.424755 0.566952
0.424019 0.529479
0.423424 0.520627
0.423135 0.511119
0.423930 0.498872
0.425272 0.486928
0.424378 0.474866
0.422253 0.461284
0.423425 0.442864
0.427443 0.430400
0.432252 0.423267
0.436839 0.413597
0.440446 0.397071
0.444593 0.371157
0.440794 0.361620
0.431401 0.351796
0.421405 0.335781
0.385449 0.316685
0.398295 0.221633
0.429249 0.554425
0.404088 0.270917
0.404397 0.254690
0.419824 0.731516
0.417921 0.684563
0.417013 0.672973
0.414375 0.660397
0.414774 0.653359
0.415459 0.648040
0.416597 0.641114
0.424498 0.633810
0.429416 0.629056
0.433978 0.617090
0.435596 0.594800
0.433123 0.540345
0.432666 0.530288
0.432477 0.521285
0.433685 0.497634
0.434560 0.486947
0.431693 0.477135
0.429521 0.462942
0.430522 0.444736
0.435428 0.428490
0.450722 0.387769
0.454467 0.367773
0.445096 0.357755
0.397629 0.316935
0.401088 0.302496
0.410458 0.293159
0.409078 0.278930
0.424523 0.714412
0.439872 0.566223
0.439124 0.556770
0.438152 0.503485
0.435272 0.471902
0.434270 0.454489
0.437802 0.435054
0.452246 0.407323
0.415653 0.269195
0.416077 0.225883
0.431473 0.717265
0.430278 0.701468
0.426944 0.676751
0.426682 0.667864
0.426833 0.659891
0.427095 0.648829
0.431089 0.641417
0.440100 0.631790
0.443977 0.619770
0.446279 0.590114
0.445894 0.581352
0.443288 0.542757
0.443045 0.508847
0.443461 0.497270
0.443983 0.488173
0.442267 0.480508
0.438243 0.467116
0.439554 0.442743
0.447267 0.424961
0.453680 0.415740
0.457766 0.403801
0.459185 0.388189
0.457943 0.363329
0.453645 0.358424
0.449952 0.352674
0.446026 0.348385
0.413387 0.317698
0.423683 0.288922
0.422259 0.275689
0.422247 0.259711
0.422689 0.244868
0.438735 0.726061
0.437693 0.709645
0.448995 0.549419
0.447986 0.538329
0.448277 0.502852
0.446884 0.472931
0.444187 0.459409
0.448535 0.434753
0.429168 0.251716
0.429174 0.237895
0.442949 0.694885
0.442653 0.661185
0.442972 0.655381
0.445889 0.645668
0.455498 0.566007
0.453835 0.545284
0.452767 0.533408
0.452798 0.520264
0.453132 0.508584
0.453617 0.497185
0.455367 0.489645
0.455788 0.484734
0.456153 0.477835
0.451832 0.461121
0.449996 0.446652
0.457570 0.422611
0.465478 0.413707
0.466765 0.405011
0.466596 0.388852
0.468516 0.368381
0.456834 0.348986
0.452868 0.339478
0.429404 0.318155
0.432606 0.300918
0.434603 0.295089
0.437961 0.285824
0.435479 0.273228
0.435878 0.258286
0.435718 0.219350
0.452326 0.715293
0.448693 0.686002
0.448243 0.679502
0.464453 0.476062
0.460706 0.460496
0.458647 0.444373
0.460800 0.433746
0.443110 0.250823
0.443340 0.237552
0.443100 0.225470
0.460107 0.724892
0.458505 0.707515
0.456462 0.689792
0.455995 0.677117
0.457293 0.665132
0.459814 0.654921
0.462977 0.645377
0.465955 0.634240
0.466885 0.627860
0.468184 0.604583
0.468085 0.595694
0.467770 0.577862
0.466023 0.558403
0.463341 0.535452
0.463819 0.522512
0.464372 0.509146
0.464743 0.497655
0.466095 0.490374
0.470274 0.483074
0.472630 0.473811
0.469115 0.455073
0.466298 0.441924
0.470968 0.421442
0.475188 0.415484
0.475884 0.406494
0.474672 0.389658
0.471474 0.357716
0.469583 0.351453
0.445345 0.316898
0.447218 0.301826
0.449872 0.294409
0.451822 0.288894
0.452692 0.283386
0.450699 0.271523
0.450328 0.250556
0.450602 0.219007
0.464873 0.692728
0.472313 0.493637
0.477949 0.476864
0.478707 0.457594
0.474708 0.444876
0.477029 0.433904
0.478078 0.420107
0.454932 0.309237
0.458346 0.264650
0.458353 0.250478
0.458847 0.237632
0.459189 0.226009
0.475765 0.732124
0.474015 0.708255
0.473168 0.696055
0.472727 0.678563
0.473029 0.667386
0.474706 0.654353
0.477646 0.644401
0.479390 0.631773
0.480960 0.608187
0.480226 0.590246
0.479888 0.580157
0.478712 0.560401
0.477805 0.549880
0.476723 0.524830
0.477032 0.509734
0.478581 0.498223
0.479723 0.488707
0.482213 0.480690
0.486626 0.470212
0.488450 0.451070
0.480912 0.426060
0.485372 0.418040
0.484829 0.407894
0.483705 0.400488
0.481984 0.390160
0.481531 0.377934
0.481478 0.367120
0.481398 0.361356
0.478064 0.344930
0.476378 0.337527
0.462478 0.318508
0.465178 0.299379
0.466978 0.292610
0.467752 0.282558
0.465907 0.271913
0.466714 0.257887
0.467834 0.220332
0.481635 0.698699
0.488859 0.470407
0.491616 0.454916
0.490321 0.435686
0.488799 0.422811
0.472692 0.310706
0.474857 0.265331
0.474845 0.251044
0.475114 0.243858
0.475513 0.238393
0.476131 0.226537
0.491367 0.713266
0.489523 0.678128
0.489582 0.663782
0.491977 0.646218
0.492777 0.626020
0.492660 0.609512
0.491322 0.571647
0.491275 0.561906
0.489761 0.539423
0.489911 0.524647
0.489883 0.508606
0.490768 0.497191
0.492756 0.486374
0.492209 0.479592
0.492050 0.472824
0.495764 0.459202
0.496136 0.439999
0.495001 0.427093
0.491991 0.353535
0.490610 0.342827
0.480324 0.321130
0.482026 0.303525
0.483597 0.294364
0.484134 0.288158
0.483787 0.282224
0.483716 0.273002
0.483145 0.258541
0.484593 0.233433
0.484914 0.219416
0.500504 0.728214
0.496799 0.509647
0.496950 0.503293
0.497256 0.497003
0.494301 0.282987
0.494260 0.273899
0.494153 0.266586
0.493974 0.252268
0.494366 0.239711
0.494602 0.227114
0.494750 0.220252
0.509123 0.724165
0.507690 0.688633
0.507147 0.672698
0.506726 0.663785
0.506161 0.647046
0.505735 0.626123
0.504628 0.591630
0.503958 0.562656
0.503653 0.539229
0.503721 0.523463
0.503767 0.510056
0.503694 0.503285
0.503722 0.496711
0.503549 0.490340
0.503436 0.484064
0.503065 0.473298
0.502501 0.457552
0.501961 0.428440
0.501877 0.421167
0.501804 0.416323
0.502363 0.389814
0.502360 0.383461
0.502434 0.376608
0.502671 0.362723
0.502756 0.356317
0.502723 0.351568
0.502698 0.342352
0.502241 0.332741
0.501857 0.330597
0.504479 0.301734
0.504572 0.294295
0.504644 0.287572
0.504721 0.283874
0.504849 0.275094
0.504752 0.259833
0.504568 0.246070
0.504492 0.234633
0.504612 0.221018
0.510684 0.509632
0.510421 0.503269
0.514865 0.304447
0.515326 0.267335
0.515130 0.252878
0.514629 0.240068
0.514442 0.227450
0.514432 0.220725
0.525952 0.712955
0.525720 0.701589
0.525027 0.678131
0.524312 0.668233
0.520030 0.645851
0.518282 0.625684
0.518118 0.600260
0.517622 0.581354
0.516611 0.561650
0.516814 0.550729
0.517395 0.538984
0.517480 0.524490
0.517601 0.508650
0.516556 0.497103
0.514122 0.486436
0.514268 0.479592
0.513968 0.472891
0.509143 0.459444
0.507967 0.439727
0.509109 0.426545
0.510210 0.420333
0.510681 0.408652
0.514073 0.357643
0.513400 0.347201
0.514975 0.342360
0.525592 0.323238
0.526300 0.305945
0.525160 0.296304
0.524926 0.289980
0.525334 0.283785
0.525524 0.274279
0.526013 0.259793
0.524222 0.234213
0.524040 0.220186
0.516756 0.470337
0.513116 0.454799
0.514000 0.435161
0.515451 0.422292
0.535167 0.313949
0.534243 0.267113
0.533956 0.252553
0.533593 0.245153
0.533140 0.239562
0.532624 0.227566
0.543122 0.732027
0.542599 0.713666
0.542611 0.695902
0.541799 0.678587
0.539712 0.663198
0.537224 0.653980
0.533642 0.643947
0.531207 0.631336
0.528990 0.608025
0.528658 0.590059
0.528478 0.580099
0.528931 0.560116
0.529536 0.549224
0.530701 0.524873
0.530167 0.509569
0.528433 0.498097
0.526946 0.488764
0.524038 0.480669
0.519033 0.470157
0.516249 0.450690
0.523316 0.425242
0.518941 0.417516
0.518937 0.413032
0.520877 0.399523
0.523735 0.376332
0.524127 0.365663
0.524220 0.354914
0.529292 0.336668
0.544494 0.322562
0.543519 0.302965
0.541908 0.295613
0.541101 0.285150
0.543038 0.274204
0.542024 0.259900
0.542007 0.244711
0.540676 0.221591
0.534292 0.493437
0.527950 0.476596
0.526006 0.456737
0.529803 0.443497
0.527299 0.432949
0.526052 0.419112
0.553023 0.314065
0.550255 0.267162
0.549964 0.252409
0.549331 0.239309
0.548982 0.227510
0.558012 0.724380
0.557887 0.682901
0.556536 0.670635
0.554943 0.664790
0.551730 0.654411
0.547734 0.644956
0.544345 0.633666
0.541708 0.619923
0.540779 0.595437
0.540773 0.567826
0.541562 0.558011
0.543893 0.535022
0.543542 0.522211
0.542554 0.508878
0.541863 0.497402
0.540291 0.490012
0.535867 0.482705
0.532939 0.473286
0.535651 0.453848
0.538369 0.439924
0.532974 0.420210
0.528796 0.414269
0.528700 0.405158
0.529333 0.397778
0.530347 0.387717
0.536284 0.349595
0.562508 0.323288
0.561072 0.307081
0.558741 0.298602
0.556700 0.292466
0.555697 0.286748
0.557591 0.274476
0.557717 0.252639
0.557251 0.220779
0.564272 0.709392
0.564620 0.691351
0.541216 0.475464
0.544271 0.459177
0.545842 0.442434
0.544181 0.430829
0.564553 0.252993
0.564207 0.239361
0.564311 0.227304
0.571483 0.687373
0.571039 0.673638
0.569965 0.666313
0.567433 0.654182
0.564292 0.644223
0.552287 0.565451
0.552647 0.555381
0.554461 0.532733
0.554248 0.519762
0.552849 0.496750
0.550816 0.489034
0.550264 0.483999
0.549503 0.476977
0.553328 0.459817
0.554153 0.445289
0.546226 0.420981
0.538683 0.412329
0.538276 0.386690
0.537048 0.366091
0.543464 0.356036
0.549162 0.346028
0.553019 0.336489
0.579459 0.327044
0.575290 0.306821
0.569645 0.289696
0.571931 0.276455
0.571424 0.260822
0.571434 0.221326
0.579577 0.725089
0.576929 0.697241
0.557277 0.602995
0.558611 0.548621
0.559390 0.537658
0.558381 0.502558
0.558603 0.471946
0.561053 0.457968
0.557833 0.432712
0.578171 0.269704
0.577775 0.253858
0.577568 0.239773
0.582218 0.706388
0.584186 0.684935
0.584364 0.675516
0.583739 0.666469
0.582952 0.658230
0.582086 0.646818
0.577913 0.639424
0.569196 0.630257
0.565255 0.618799
0.562360 0.589269
0.562504 0.580568
0.563470 0.508339
0.562918 0.496788
0.562130 0.487667
0.563542 0.479756
0.567233 0.466130
0.566131 0.440774
0.557357 0.422786
0.548084 0.407964
0.545817 0.385602
0.559798 0.344523
0.594630 0.322207
0.591830 0.307326
0.583188 0.292652
0.584461 0.278646
0.592097 0.718240
0.568529 0.555861
0.568252 0.503118
0.570387 0.471029
0.571169 0.452802
0.567173 0.432858
0.555329 0.411659
0.551183 0.397988
0.590707 0.271561
0.589961 0.240884
0.590129 0.227653
0.598964 0.731025
0.590417 0.709316
0.595655 0.693060
0.594262 0.683698
0.593727 0.671828
0.595170 0.658649
0.594332 0.651397
0.593339 0.645759
0.591776 0.638435
0.584059 0.631406
0.574925 0.615732
0.573078 0.593658
0.573198 0.568184
0.573764 0.549600
0.574382 0.539548
0.574427 0.529466
0.574301 0.520674
0.574276 0.515490
0.572724 0.497243
0.571612 0.486599
0.574255 0.476473
0.576186 0.461693
0.574790 0.442452
0.569549 0.426221
0.551746 0.369156
0.551068 0.364646
0.560773 0.354171
0.565286 0.348754
0.574382 0.332831
0.609378 0.319078
0.605061 0.305057
0.595922 0.296019
0.596702 0.288642
0.596119 0.248305
0.562031 0.405917
0.601846 0.272683
0.613091 0.730986
0.604663 0.692184
0.601222 0.668404
0.604725 0.646232
0.600922 0.634451
0.589831 0.623928
0.587114 0.618767
0.582606 0.591097
0.582782 0.582628
0.583101 0.574416
0.583618 0.565415
0.583300 0.538166
0.583179 0.528534
0.583509 0.519693
0.583506 0.510128
0.582779 0.498295
0.581054 0.486631
0.581810 0.474097
0.583644 0.459772
0.582001 0.440288
0.577493 0.427641
0.572749 0.420502
0.561558 0.372343
0.620355 0.317296
0.615362 0.306710
0.607382 0.222948
0.612158 0.294726
0.611447 0.272682
0.611380 0.256371
0.624044 0.722583
0.617115 0.700158
0.610245 0.682628
0.607348 0.669155
0.607280 0.651933
0.601471 0.625030
0.596944 0.616137
0.594514 0.610818
0.592798 0.588368
0.592802 0.571957
0.592553 0.545348
0.591670 0.527166
0.592180 0.518233
0.592495 0.509161
0.592275 0.498409
0.590182 0.486091
0.589017 0.472031
0.589397 0.457655
0.589126 0.441985
0.577621 0.413025
0.574369 0.393505
0.571513 0.371453
0.569511 0.360407
0.578073 0.352603
0.588336 0.342202
0.595884 0.329413
0.620326 0.269639
0.640472 0.731859
0.637346 0.719050
0.633218 0.711402
0.614212 0.673247
0.611895 0.656806
0.614092 0.643130
0.614020 0.637612
0.610545 0.622932
0.606076 0.617584
0.604246 0.612561
0.603386 0.607515
0.603424 0.586333
0.603353 0.577759
0.602779 0.560691
0.601693 0.543964
0.600649 0.534879
0.599178 0.516616
0.599875 0.506527
0.599813 0.497056
0.600005 0.485776
0.597594 0.472346
0.595973 0.456822
0.594206 0.444105
0.591108 0.435309
0.587664 0.426020
0.581277 0.362185
0.581304 0.356687
0.592305 0.346736
0.626082 0.321754
0.625700 0.295084
0.650817 0.720095
0.638223 0.703160
0.627739 0.689166
0.623897 0.676634
0.620436 0.662552
0.622092 0.649127
0.621906 0.640764
0.621281 0.630920
0.621253 0.623135
0.616227 0.615702
0.613377 0.608193
0.612215 0.602737
0.612263 0.597539
0.613049 0.583870
0.612257 0.558419
0.610750 0.541586
0.609304 0.532744
0.606280 0.505040
0.605309 0.486490
0.604939 0.472735
0.603132 0.459435
0.599395 0.446860
0.593485 0.384272
0.593239 0.356722
0.595107 0.351913
0.607493 0.340735
0.615992 0.335457
0.632341 0.324223
0.636855 0.313953
0.633128 0.257593
0.633637 0.246059
0.628374 0.670797
0.667056 0.732736
0.662902 0.720251
0.657031 0.712183
0.645853 0.698698
0.632601 0.665325
0.630082 0.655015
0.630228 0.650359
0.629559 0.632861
0.625224 0.613462
0.621977 0.592455
0.622388 0.586609
0.623594 0.572522
0.621157 0.547475
0.618400 0.530041
0.616333 0.521805
0.615051 0.512535
0.612055 0.503209
0.610999 0.493864
0.608495 0.460197
0.605883 0.450315
0.603197 0.441796
0.602824 0.430484
0.603850 0.406640
0.606487 0.350918
0.609539 0.346576
0.624114 0.334594
0.640298 0.293040
0.642528 0.244367
0.650183 0.693218
0.637181 0.659880
0.678278 0.731862
0.662123 0.703192
0.658361 0.696727
0.647816 0.676317
0.642232 0.655329
0.636781 0.628732
0.636571 0.619200
0.635539 0.610219
0.634384 0.601179
0.633310 0.594232
0.633089 0.582372
0.633485 0.576428
0.630147 0.536011
0.627034 0.518858
0.618635 0.492814
0.615345 0.460977
0.613419 0.451279
0.613304 0.440176
0.614217 0.417455
0.615140 0.395253
0.616555 0.366941
0.617158 0.357949
0.644204 0.322591
0.646140 0.316080
0.648605 0.272262
0.649994 0.253293
0.651873 0.232833
0.651658 0.667516
0.647489 0.644541
0.626209 0.495517
0.618956 0.421717
0.688729 0.730032
0.685018 0.717223
0.676590 0.704743
0.670715 0.693989
0.665372 0.684883
0.658543 0.668205
0.647063 0.626889
0.647657 0.616634
0.646911 0.606596
0.644554 0.583701
0.643302 0.550571
0.639150 0.524547
0.633050 0.497907
0.625190 0.457558
0.624259 0.446779
0.623889 0.425353
0.624848 0.404379
0.625936 0.394516
0.626747 0.384562
0.627538 0.375517
0.629052 0.359585
0.630838 0.351565
0.632751 0.344646
0.636287 0.338232
0.649985 0.320293
0.651071 0.307693
0.656962 0.260778
0.662035 0.222460
0.661181 0.650401
0.655377 0.629549
0.633735 0.472114
0.628784 0.428893
0.697769 0.721480
0.687727 0.700244
0.676947 0.681705
0.672777 0.666397
0.668378 0.653035
0.661036 0.623697
0.661677 0.612940
0.660796 0.603112
0.659535 0.594511
0.658567 0.586762
0.655457 0.568811
0.654955 0.562648
0.652029 0.539451
0.645136 0.503992
0.643426 0.494636
0.641511 0.485486
0.639865 0.475626
0.638138 0.464985
0.634129 0.432619
0.634500 0.411999
0.638509 0.375349
0.641152 0.359138
0.644565 0.344250
0.646908 0.337114
0.649900 0.331332
0.655840 0.318255
0.656606 0.311110
0.658173 0.300052
0.640535 0.396361
0.667857 0.262560
0.670373 0.245336
0.707253 0.724806
0.702658 0.704513
0.698931 0.693927
0.696554 0.688551
0.688505 0.676914
0.685694 0.662975
0.678679 0.638267
0.675991 0.621358
0.676199 0.611729
0.674743 0.601595
0.670715 0.586228
0.667963 0.572500
0.651542 0.482783
0.644104 0.419164
0.644852 0.399648
0.648244 0.373408
0.652000 0.358829
0.653506 0.351401
0.654913 0.344006
0.667569 0.287354
0.669937 0.273452
0.675262 0.240886
0.687144 0.645541
0.649085 0.402974
0.666336 0.320866
0.669478 0.301947
0.682473 0.228166
0.715516 0.721506
0.712959 0.707163
0.710164 0.693195
0.708310 0.680690
0.702749 0.667885
0.698615 0.656686
0.691377 0.635008
0.689015 0.619924
0.688589 0.610288
0.687062 0.600808
0.682707 0.584576
0.662536 0.490369
0.660650 0.480713
0.657910 0.460196
0.656350 0.449442
0.654139 0.433022
0.668317 0.330737
0.678126 0.272466
0.680405 0.257551
0.699115 0.640755
0.677241 0.539009
0.659085 0.431985
0.658265 0.391111
0.660147 0.373965
0.676717 0.311092
0.679552 0.289633
0.719573 0.695478
0.718797 0.687680
0.717734 0.674006
0.714233 0.660131
0.710041 0.649200
0.701101 0.623267
0.700585 0.620147
0.700404 0.610812
0.698545 0.601483
0.693661 0.584084
0.691966 0.577625
0.688180 0.565206
0.684642 0.550575
0.677110 0.516815
0.673627 0.498073
0.668480 0.468204
0.664441 0.436514
0.677872 0.331184
0.683278 0.292864
0.670984 0.451846
0.669724 0.441165
0.668715 0.430467
0.667537 0.409168
0.667606 0.380385
0.675618 0.353645
0.693175 0.254536
0.730244 0.714276
0.728206 0.699033
0.727142 0.690726
0.722170 0.652407
0.717768 0.643036
0.709879 0.621247
0.709805 0.611068
0.708080 0.601549
0.703317 0.584382
0.680657 0.486884
0.689462 0.308463
0.691605 0.286421
0.693415 0.273151
0.714858 0.630843
0.680225 0.450383
0.678076 0.429388
0.676630 0.398363
0.687771 0.340342
0.704612 0.241065
0.732619 0.671106
0.732012 0.663588
0.718447 0.629637
0.716847 0.622273
0.715757 0.601399
0.709711 0.578288
0.705948 0.564606
0.704223 0.557499
0.693104 0.504422
0.688919 0.480645
0.686716 0.465442
0.683271 0.434093
0.681460 0.402970
0.683590 0.368762
0.698081 0.293561
0.699733 0.280659
0.686915 0.418681
0.705074 0.271208
0.743201 0.706898
0.739216 0.674623
0.734253 0.642530
0.728495 0.633643
0.723920 0.612101
0.721222 0.591340
0.718340 0.577778
0.707080 0.530831
0.699993 0.494195
0.697034 0.474801
0.695511 0.465015
0.693379 0.444429
0.691280 0.385595
0.697503 0.350252
0.702435 0.331922
0.695795 0.399701
0.710354 0.285317
0.713974 0.265874
0.746744 0.688304
0.745874 0.680192
0.744065 0.663972
0.740741 0.649151
0.730189 0.616286
0.721669 0.563359
0.711708 0.511868
0.706874 0.484280
0.704176 0.464811
0.703332 0.454423
0.701821 0.434085
0.700528 0.395755
0.704515 0.357911
0.705544 0.414728
0.705496 0.388004
0.714225 0.330256
0.754947 0.700162
0.740624 0.634649
0.733943 0.589639
0.731216 0.576322
0.724361 0.538193
0.721398 0.520223
0.718323 0.501941
0.715391 0.483506
0.713036 0.464277
0.709920 0.406127
0.714523 0.352768
0.736161 0.622058
0.716184 0.444565
0.720293 0.343933
0.722802 0.318601
0.725096 0.287865
0.733315 0.251529
0.757796 0.682369
0.741565 0.602296
0.735128 0.562376
0.730486 0.528760
0.726495 0.501584
0.720008 0.435442
0.719572 0.425977
0.719116 0.407437
0.719228 0.390226
0.727029 0.473483
0.760341 0.665434
0.738897 0.537136
0.736628 0.519599
0.735678 0.510295
0.733235 0.491522
0.730453 0.464053
0.728751 0.435970
0.728584 0.384261
0.733488 0.330067
0.746016 0.617334
0.733809 0.450223
0.732455 0.413842
0.732432 0.401123
0.735640 0.353316
0.769179 0.684492
0.748591 0.622794
0.750910 0.582811
0.747162 0.545131
0.745308 0.528442
0.744372 0.519397
0.740655 0.482632
0.739087 0.464475
0.737281 0.393736
0.742039 0.441774
0.741807 0.432670
0.742412 0.375575
0.752290 0.519248
0.750689 0.500965
0.748459 0.473647
0.746078 0.403170
0.752850 0.269087
0.765185 0.637379
0.752131 0.460553
0.750983 0.442631
0.750581 0.425004
0.753050 0.343041
0.763714 0.588918
0.763011 0.576106
0.761695 0.545110
0.759496 0.510047
0.762123 0.487979
0.760399 0.452136
0.759836 0.426019
0.761432 0.331452
0.768782 0.610121
0.769787 0.599442
0.769351 0.561518
0.779795 0.664658
0.770993 0.497514
0.770278 0.479505
0.768782 0.395305
0.769446 0.339221
0.773820 0.615883
0.776336 0.545824
0.776079 0.528535
0.775735 0.515183
0.778854 0.462853
0.778400 0.445413
0.778273 0.428258
0.778157 0.412147
0.777254 0.334197
0.782140 0.641838
0.783967 0.554296
0.787488 0.668824
0.787098 0.580198
0.788055 0.533680
0.788035 0.516235
0.788006 0.498917
0.787944 0.481610
0.787463 0.421403
0.786823 0.361790
0.781198 0.305109
0.790998 0.609304
0.796602 0.516953
0.796748 0.491221
0.796893 0.482474
0.796965 0.456596
0.796438 0.439122
0.796589 0.414704
0.796321 0.399072
0.795255 0.356087
0.153292 0.727292
0.139576 0.707031
0.113757 0.660115
0.101315 0.633963
0.092802 0.613286
0.079272 0.575473
0.070587 0.543085
0.067203 0.527050
0.065042 0.502327
0.065695 0.468580
0.068534 0.443442
0.076254 0.404358
0.090099 0.360740
0.100143 0.336504
0.117428 0.302642
0.125267 0.289034
0.143460 0.260990
0.101564 0.604698
0.094027 0.582102
0.087128 0.558659
0.082974 0.542519
0.079271 0.526744
0.136405 0.673246
0.083405 0.485445
0.090115 0.416002
0.099169 0.378368
0.117247 0.329731
0.146093 0.276231
0.127757 0.643745
0.101426 0.565714
0.090817 0.513572
0.158423 0.696116
0.116790 0.599308
0.104443 0.553562
0.099400 0.529760
0.109513 0.378019
0.116044 0.356726
0.135726 0.309615
0.146365 0.290166
0.115031 0.572949
0.102432 0.505586
0.103107 0.443350
0.143271 0.644362
0.127616 0.598503
0.113010 0.537494
0.135477 0.329176
0.161924 0.666475
0.142095 0.611382
0.132602 0.575540
0.128977 0.560493
0.127300 0.552596
0.165816 0.284972
0.145066 0.582268
0.134824 0.528595
0.133696 0.520346
0.134979 0.405998
0.142988 0.362075
0.153061 0.328375
0.166740 0.297221
0.174084 0.652031
0.166956 0.628994
0.161711 0.609818
0.147325 0.535936
0.142100 0.461101
0.143580 0.428469
0.157557 0.341079
0.176197 0.628227
0.169506 0.602648
0.161404 0.559598
0.159209 0.543648
0.156242 0.519184
0.154353 0.493962
0.153530 0.476977
0.153094 0.459921
0.155959 0.403424
0.159446 0.374221
0.169973 0.327375
0.200308 0.684018
0.188487 0.638695
0.180453 0.608612
0.172516 0.567056
0.169447 0.543158
0.167586 0.526781
0.165247 0.492792
0.163916 0.458639
0.165602 0.409785
0.189449 0.297196
0.201189 0.663781
0.189410 0.607963
0.186779 0.595390
0.183346 0.574406
0.178561 0.534126
0.176784 0.508693
0.175451 0.482929
0.174666 0.457228
0.174670 0.440570
0.177348 0.378781
0.190268 0.313920
0.211901 0.683494
0.205989 0.647248
0.201228 0.619608
0.192928 0.574177
0.189928 0.550084
0.188495 0.533275
0.186168 0.490400
0.185150 0.464440
0.185228 0.430751
0.186279 0.384755
0.190707 0.343543
0.203591 0.296361
0.199272 0.585013
0.212378 0.635454
0.206350 0.606787
0.205265 0.600746
0.196914 0.506429
0.195718 0.480394
0.195384 0.463103
0.195236 0.437475
0.195250 0.421266
0.197056 0.362194
0.213709 0.286094
0.795700 0.601643
0.797449 0.590211
0.798991 0.570213
0.794885 0.631361
0.804549 0.542860
0.804892 0.534806
0.805484 0.500772
0.806257 0.474722
0.806246 0.448721
0.806140 0.415798
0.803781 0.357038
0.793590 0.301555
0.805560 0.584193
0.811790 0.566713
0.813457 0.543329
0.814285 0.527288
0.814646 0.510174
0.815201 0.493074
0.816097 0.467176
0.816121 0.433278
0.814574 0.379275
0.809888 0.338282
0.792168 0.281782
0.807058 0.654374
0.810746 0.623126
0.813409 0.612132
0.818257 0.587677
0.820078 0.574052
0.823475 0.535625
0.824366 0.519360
0.824915 0.502425
0.825793 0.476913
0.826222 0.451126
0.826235 0.434571
0.823217 0.373145
0.807765 0.302667
0.812437 0.660725
0.815673 0.645569
0.822058 0.612729
0.826189 0.594312
0.830290 0.566768
0.835170 0.503181
0.835841 0.486328
0.836601 0.452211
0.836564 0.435652
0.827928 0.346543
0.829643 0.619081
0.839755 0.566587
0.842470 0.543805
0.844603 0.520164
0.845687 0.503755
0.846435 0.487203
0.846915 0.470286
0.847148 0.453344
0.843396 0.389541
0.827362 0.315010
0.814472 0.285963
0.832413 0.642385
0.838578 0.619598
0.841642 0.607462
0.849587 0.566401
0.853729 0.535990
0.854527 0.528167
0.847081 0.354676
0.829857 0.671656
0.861222 0.558755
0.866457 0.520493
0.868029 0.504507
0.869097 0.463269
0.866488 0.414361
0.848606 0.328042
0.841003 0.308928
0.832304 0.290657
0.849654 0.641924
0.857676 0.617923
0.874678 0.543869
0.872386 0.384134
0.865631 0.355378
0.876094 0.588604
0.889338 0.520871
0.863340 0.321531
0.827941 0.258417
0.897746 0.497252
0.870807 0.635704
0.886591 0.589229
0.901417 0.520932
0.901346 0.431114
0.887033 0.362201
0.882569 0.348189
0.862995 0.301644
0.852276 0.282460
0.859923 0.670332
0.898926 0.563764
0.903903 0.540382
0.916164 0.489023
0.915937 0.476780
0.908460 0.407035
0.884051 0.327750
0.849912 0.703976
0.886579 0.634874
0.914566 0.548920
0.918077 0.533112
0.921288 0.517640
0.866079 0.694429
0.890553 0.649298
0.902458 0.623476
0.915688 0.588167
0.922932 0.565511
0.930541 0.533436
0.933426 0.517806
0.934958 0.493378
0.928920 0.425976
0.915213 0.372222
0.902511 0.337137
0.888120 0.307104
0.873043 0.280237
0.854870 0.252989
0.209474 0.701446
0.190056 0.727968
0.174174 0.753464
0.225365 0.701813
0.215535 0.733227
0.186207 0.766797
0.206110 0.754390
0.232577 0.714031
0.238027 0.706497
0.231046 0.735813
0.241691 0.715734
0.248872 0.712274
0.231710 0.763655
0.243823 0.742436
0.213103 0.794184
0.253391 0.721266
0.243662 0.760860
0.232458 0.795394
0.248144 0.779777
0.266716 0.726866
0.258985 0.768907
0.273823 0.723445
0.249211 0.808055
0.246550 0.822989
0.273198 0.770145
0.280903 0.732221
0.262781 0.818235
0.278185 0.784283
0.288923 0.729361
0.287749 0.771218
0.265864 0.838193
0.272034 0.825189
0.296676 0.738313
0.275617 0.845922
0.292822 0.806082
0.300193 0.782951
0.304363 0.762943
0.305377 0.735292
0.313920 0.757389
0.313734 0.744142
0.297516 0.861314
0.303194 0.846298
0.317183 0.804153
0.322841 0.780682
0.324058 0.746631
0.324459 0.739159
0.328667 0.777429
0.309320 0.869252
0.319918 0.838364
0.328288 0.809548
0.334520 0.763602
0.335302 0.748136
0.335840 0.740659
0.331899 0.844591
0.339860 0.814539
0.342779 0.801053
0.347139 0.766330
0.347481 0.749692
0.347700 0.741387
0.335882 0.885436
0.345184 0.851062
0.348884 0.834966
0.355323 0.805262
0.359271 0.779679
0.360041 0.768384
0.361568 0.750876
0.361413 0.746482
0.361249 0.741722
0.350369 0.892920
0.355006 0.874769
0.358766 0.857120
0.362507 0.840721
0.368963 0.809710
0.371332 0.795115
0.373188 0.782402
0.374657 0.770062
0.376736 0.759225
0.375894 0.750955
0.375538 0.741422
0.366234 0.900065
0.370297 0.881454
0.373781 0.863153
0.377408 0.846042
0.380589 0.830576
0.383468 0.814095
0.385703 0.798396
0.387394 0.784242
0.388307 0.770832
0.390449 0.758998
0.389656 0.750359
0.382485 0.907170
0.386155 0.887946
0.392255 0.850947
0.394940 0.834603
0.397751 0.818100
0.399975 0.801802
0.401027 0.793949
0.402917 0.771446
0.404038 0.757482
0.403666 0.749088
0.404045 0.740399
0.406345 0.811531
0.399248 0.913254
0.402503 0.893367
0.408408 0.855617
0.410544 0.838221
0.412971 0.821513
0.414744 0.804622
0.416370 0.787828
0.416626 0.771931
0.416901 0.759636
0.416677 0.749304
0.420375 0.740379
0.422711 0.797205
0.423448 0.780707
0.417301 0.918719
0.419820 0.898227
0.423830 0.868809
0.425022 0.859373
0.426590 0.841858
0.427891 0.824397
0.429277 0.807035
0.430428 0.789327
0.430270 0.773393
0.430405 0.751900
0.431014 0.741941
0.436297 0.816689
0.437298 0.799170
0.437705 0.782275
0.437541 0.768956
0.435705 0.923275
0.437856 0.902464
0.441652 0.862749
0.442910 0.844230
0.444379 0.808692
0.445217 0.791148
0.447019 0.904259
0.452449 0.818531
0.452998 0.800714
0.453108 0.783300
0.452732 0.769782
0.452497 0.759567
0.452545 0.741551
0.454780 0.927092
0.456260 0.905924
0.458847 0.865273
0.459719 0.846382
0.460444 0.828480
0.460909 0.774811
0.465409 0.907145
0.468086 0.856693
0.469156 0.819917
0.469523 0.801793
0.469632 0.792355
0.469321 0.783843
0.468388 0.760269
0.473592 0.929401
0.474561 0.908255
0.476995 0.857407
0.485720 0.848137
0.486194 0.820371
0.486385 0.801874
0.485379 0.770201
0.484389 0.743493
0.492909 0.930883
0.493076 0.920321
0.493220 0.909509
0.494155 0.848433
0.501747 0.751733
0.511846 0.930658
0.511746 0.909505
0.511858 0.848312
0.511557 0.801625
0.511392 0.792244
0.511254 0.783677
0.520761 0.867406
0.518674 0.751667
0.530752 0.929646
0.530261 0.908489
0.529398 0.847805
0.538060 0.856825
0.537113 0.819659
0.536456 0.783694
0.536232 0.770146
0.535911 0.760586
0.535641 0.743237
0.549565 0.926690
0.548485 0.905942
0.546592 0.865542
0.546050 0.846453
0.553821 0.818885
0.553253 0.801005
0.553222 0.791830
0.553001 0.783459
0.552692 0.759992
0.567799 0.923001
0.566305 0.902397
0.563741 0.862864
0.563016 0.844558
0.560966 0.774510
0.575127 0.900132
0.572033 0.861266
0.570263 0.817043
0.569536 0.799643
0.568971 0.782831
0.568757 0.769292
0.568555 0.759202
0.568099 0.749736
0.586286 0.917940
0.584037 0.897788
0.581146 0.868537
0.577946 0.807190
0.576932 0.790315
0.587840 0.848696
0.585798 0.814735
0.584830 0.797824
0.584031 0.781619
0.583795 0.768424
0.583330 0.757786
0.582718 0.747873
0.603973 0.912158
0.601241 0.892394
0.596441 0.855300
0.595136 0.838392
0.593888 0.821783
0.592716 0.805103
0.591401 0.788283
0.590984 0.772774
0.588707 0.741578
0.598914 0.795572
0.597953 0.779782
0.621208 0.905628
0.617962 0.886469
0.614936 0.868423
0.612143 0.850722
0.610264 0.834110
0.608183 0.818302
0.606485 0.802138
0.604789 0.786437
0.604293 0.771158
0.603460 0.759262
0.603235 0.749136
0.599046 0.740007
0.612590 0.793047
0.637333 0.898412
0.633589 0.880116
0.630349 0.862468
0.627290 0.845213
0.624841 0.829873
0.622330 0.814412
0.621132 0.806793
0.620246 0.798992
0.618341 0.784539
0.615755 0.757283
0.615680 0.749200
0.614845 0.740287
0.652755 0.890369
0.645197 0.855644
0.638479 0.825406
0.635967 0.809953
0.633684 0.795448
0.631880 0.782425
0.630803 0.770084
0.628478 0.758846
0.629037 0.750511
0.667612 0.882334
0.663012 0.865405
0.655621 0.833656
0.652551 0.819331
0.649360 0.805175
0.646990 0.791846
0.645297 0.780405
0.643616 0.769185
0.641354 0.759115
0.641886 0.750942
0.641824 0.741683
0.681401 0.874169
0.676141 0.857912
0.668435 0.827339
0.665247 0.813369
0.661969 0.800293
0.658125 0.777470
0.657053 0.767169
0.655504 0.750444
0.655480 0.746131
0.655364 0.741739
0.694002 0.865529
0.680558 0.821181
0.676812 0.807891
0.669467 0.774441
0.668703 0.748761
0.668300 0.741030
0.695844 0.828751
0.687637 0.802387
0.682430 0.780156
0.680832 0.761364
0.681069 0.753461
0.680205 0.746655
0.679308 0.739518
0.717051 0.849182
0.711566 0.835214
0.698007 0.796646
0.692457 0.775674
0.690508 0.744073
0.689885 0.737116
0.721751 0.827805
0.708077 0.790871
0.702053 0.770862
0.701029 0.745813
0.699947 0.740317
0.737585 0.833083
0.707850 0.731190
0.735370 0.801575
0.723071 0.770465
0.716202 0.733014
0.745339 0.809420
0.756592 0.817126
0.735069 0.774454
0.723376 0.723942
0.758675 0.798556
0.731411 0.725590
0.749643 0.771332
0.742133 0.754889
0.773885 0.801695
0.738046 0.716436
0.757489 0.766420
0.749812 0.750769
0.745147 0.718757
0.789664 0.786978
0.750543 0.709865
0.772493 0.756226
0.761263 0.735779
0.758040 0.712430
0.790578 0.764847
0.774767 0.744952
0.767774 0.731962
0.765492 0.714931
0.762259 0.703380
0.810334 0.765931
0.787367 0.735565
0.772726 0.697166
0.778130 0.704197
0.822386 0.752656
0.799692 0.716500
0.790919 0.693937
0.786216 0.684087
0.822566 0.709716
0.848722 0.719994
0.189535 0.262582
0.168255 0.257354
0.206829 0.261055
0.224755 0.257448
0.204300 0.245108
0.169997 0.227931
0.191051 0.230533
0.240648 0.257339
0.190642 0.220983
0.237417 0.230143
0.216847 0.213492
0.234466 0.215240
0.201820 0.194151
0.254511 0.224691
0.227186 0.184058
0.247828 0.194454
0.221919 0.174348
0.275809 0.227588
0.272755 0.203570
0.268596 0.197158
0.259738 0.184983
0.249916 0.173937
0.253361 0.161557
0.258599 0.142812
0.310491 0.222193
0.304554 0.205965
0.297683 0.189428
0.294063 0.181273
0.281713 0.158984
0.276892 0.152595
0.299448 0.167921
0.295466 0.159965
0.279126 0.127762
0.301574 0.146394
0.300097 0.132361
0.337053 0.217773
0.329241 0.187626
0.338266 0.201889
0.306347 0.119476
0.301619 0.113352
0.333338 0.163157
0.330089 0.152990
0.355273 0.216646
0.351392 0.193755
0.349340 0.182182
0.346988 0.170468
0.357295 0.198775
0.339214 0.121816
0.355260 0.155317
0.368618 0.209851
0.365805 0.184542
0.357274 0.136619
0.354805 0.126046
0.344480 0.099622
0.368657 0.164203
0.366684 0.151899
0.364534 0.140080
0.373770 0.156847
0.364066 0.111224
0.352157 0.086981
0.382859 0.201915
0.382551 0.188347
0.381828 0.174767
0.387805 0.208475
0.387438 0.166447
0.382219 0.128556
0.392874 0.158198
0.383031 0.099030
0.398426 0.193320
0.398281 0.142757
0.397550 0.136098
0.395572 0.124311
0.393666 0.112918
0.380745 0.075900
0.403927 0.214017
0.404902 0.168981
0.396885 0.095146
0.409857 0.206809
0.409932 0.191594
0.410630 0.175428
0.411675 0.159264
0.411421 0.152437
0.411076 0.145756
0.410476 0.132355
0.409402 0.120428
0.407360 0.109204
0.402584 0.088519
0.396524 0.070839
0.415944 0.198259
0.422544 0.189070
0.423606 0.172012
0.423698 0.164427
0.423950 0.157036
0.423933 0.149403
0.424124 0.141895
0.423806 0.135397
0.423536 0.129073
0.422322 0.117402
0.421127 0.105525
0.419340 0.094606
0.417598 0.084697
0.411470 0.067022
0.428888 0.212231
0.429239 0.196658
0.436204 0.204850
0.436562 0.187480
0.437238 0.169868
0.437710 0.162001
0.438329 0.154390
0.437855 0.146916
0.437519 0.139557
0.437330 0.133339
0.437336 0.127018
0.437063 0.120786
0.436823 0.114487
0.436129 0.102261
0.434846 0.091628
0.431388 0.072125
0.428762 0.063285
0.443539 0.211561
0.444789 0.177521
0.445495 0.160708
0.445644 0.145634
0.445226 0.132059
0.444645 0.119426
0.451995 0.202584
0.452585 0.185640
0.452954 0.176504
0.453363 0.167692
0.453382 0.159517
0.453384 0.151685
0.453538 0.144458
0.453642 0.137357
0.452997 0.130939
0.452466 0.124374
0.452063 0.111768
0.451622 0.100253
0.450311 0.089435
0.448688 0.068535
0.446149 0.059355
0.459645 0.210970
0.460627 0.184800
0.461159 0.175621
0.461749 0.166927
0.461611 0.158860
0.461385 0.151211
0.461437 0.143705
0.461679 0.136336
0.460934 0.130005
0.460088 0.117308
0.460053 0.110836
0.468603 0.192919
0.468863 0.183949
0.469539 0.174823
0.470276 0.166231
0.469956 0.158461
0.469537 0.150851
0.469542 0.143197
0.469662 0.135530
0.467607 0.123347
0.468039 0.110207
0.467679 0.098551
0.466606 0.086907
0.465739 0.067558
0.464255 0.057313
0.476659 0.210685
0.477270 0.192187
0.477371 0.183126
0.477546 0.174102
0.477796 0.165426
0.477701 0.157784
0.477589 0.150424
0.477772 0.142747
0.477983 0.135307
0.477466 0.129002
0.476814 0.122804
0.476982 0.116251
0.485572 0.201046
0.485738 0.191623
0.485786 0.182487
0.485541 0.173422
0.485226 0.164878
0.485465 0.157469
0.485588 0.150219
0.486022 0.142706
0.486417 0.135293
0.486224 0.128887
0.486045 0.122483
0.486405 0.109487
0.485330 0.097081
0.483960 0.086265
0.482849 0.066211
0.481681 0.056130
0.495245 0.191692
0.495261 0.182546
0.495179 0.172993
0.494960 0.163906
0.495050 0.156445
0.495050 0.149181
0.495235 0.142052
0.495382 0.135153
0.495230 0.128678
0.493512 0.085888
0.504743 0.201608
0.504665 0.191945
0.504763 0.182766
0.504301 0.135295
0.504132 0.128822
0.504008 0.122323
0.503859 0.116060
0.503601 0.109839
0.503214 0.096015
0.502757 0.085886
0.501594 0.064930
0.500886 0.055437
0.514249 0.192184
0.514302 0.182937
0.514363 0.173415
0.514432 0.164339
0.514234 0.156862
0.513988 0.149546
0.513593 0.142395
0.513234 0.135486
0.513195 0.128963
0.523691 0.201908
0.523705 0.192432
0.523528 0.183281
0.523880 0.174361
0.524058 0.165694
0.523777 0.158280
0.523389 0.150925
0.522839 0.143360
0.522193 0.135904
0.522219 0.129511
0.522114 0.122994
0.521580 0.116517
0.521004 0.110028
0.521023 0.097358
0.521493 0.086334
0.520506 0.065777
0.520323 0.055580
0.532298 0.211764
0.531996 0.193371
0.531870 0.184204
0.531663 0.175274
0.531334 0.166592
0.531400 0.158878
0.531291 0.151444
0.530848 0.143617
0.530425 0.136130
0.530811 0.129787
0.531151 0.123507
0.530569 0.116835
0.529968 0.110267
0.540614 0.212394
0.540257 0.194209
0.540079 0.185246
0.539343 0.176208
0.538666 0.167568
0.538930 0.159653
0.539110 0.152065
0.538930 0.144283
0.538567 0.136605
0.540030 0.124319
0.538942 0.110976
0.538449 0.099077
0.538514 0.087204
0.537516 0.066803
0.538011 0.056325
0.548660 0.212504
0.548173 0.194967
0.547873 0.186202
0.547443 0.177116
0.546934 0.168491
0.547004 0.160350
0.546978 0.152518
0.546685 0.145025
0.546304 0.137623
0.546833 0.131281
0.547045 0.118320
0.546676 0.111688
0.556069 0.204321
0.555627 0.187248
0.555220 0.178042
0.554877 0.169353
0.554876 0.161107
0.554668 0.153187
0.554270 0.145943
0.553960 0.138753
0.554310 0.132277
0.554633 0.125641
0.554401 0.112634
0.554147 0.100736
0.554577 0.089323
0.554386 0.068010
0.556190 0.058427
0.564027 0.213250
0.562990 0.179142
0.562307 0.162309
0.561827 0.147189
0.561832 0.133545
0.571015 0.206715
0.570761 0.189210
0.570147 0.171432
0.568995 0.155993
0.569278 0.148573
0.569379 0.141177
0.569313 0.128481
0.569358 0.121979
0.569200 0.115456
0.569076 0.102618
0.569570 0.091523
0.570732 0.081212
0.571715 0.071344
0.573623 0.062129
0.578000 0.214117
0.577730 0.198422
0.577118 0.181012
0.576357 0.164769
0.575905 0.149765
0.584590 0.207298
0.583208 0.173483
0.582771 0.158743
0.582350 0.143621
0.582528 0.137152
0.582654 0.130624
0.583364 0.118354
0.583941 0.105976
0.584976 0.094533
0.588282 0.074514
0.591024 0.065267
0.590491 0.199811
0.589163 0.167509
0.588729 0.152558
0.596393 0.208388
0.595669 0.176899
0.594680 0.161083
0.594975 0.147214
0.595215 0.140442
0.595323 0.133498
0.596012 0.121243
0.597397 0.109309
0.598922 0.097704
0.600968 0.087440
0.606356 0.069001
0.601933 0.215581
0.602085 0.201328
0.600882 0.156105
0.607465 0.194611
0.607249 0.144071
0.607792 0.137192
0.609522 0.124925
0.610818 0.112793
0.612999 0.101371
0.615209 0.091535
0.622072 0.074188
0.617634 0.195665
0.618047 0.182059
0.637028 0.078906
0.623744 0.176047
0.624729 0.162686
0.625391 0.156317
0.634357 0.102861
0.627427 0.209972
0.637083 0.120936
0.639826 0.110260
0.633644 0.191163
0.637878 0.152491
0.639969 0.140215
0.642066 0.128694
0.646949 0.136632
0.655214 0.106315
0.663505 0.091089
0.640799 0.216899
0.645392 0.180332
0.647039 0.167941
0.661043 0.130233
0.664293 0.120622
0.653258 0.194267
0.655110 0.182592
0.660586 0.206676
0.670261 0.162607
0.673192 0.152178
0.700713 0.111016
0.672003 0.197721
0.678186 0.193690
0.700031 0.134354
0.706919 0.124027
0.702469 0.155863
0.722672 0.124987
0.684913 0.219465
0.711308 0.151105
0.715610 0.144086
0.696037 0.213139
0.705388 0.188155
0.729878 0.144171
0.721306 0.177268
0.729761 0.163264
0.739256 0.151140
0.752100 0.146623
0.715137 0.211598
0.725574 0.189813
0.733902 0.176119
0.713197 0.227721
0.746444 0.176258
0.756820 0.165291
0.769938 0.161725
0.733583 0.212808
0.745116 0.194228
0.731134 0.236034
0.773069 0.179507
0.764390 0.200453
0.794115 0.184545
0.746777 0.237467
0.763494 0.226467
0.783163 0.208638
0.812343 0.202833
0.760937 0.253871
0.808603 0.214598
0.775492 0.245146
0.784708 0.237574
0.807516 0.233831
0.837992 0.231777
0.832512 0.241843
0.809546 0.256595
