<eps> 0
SIL 1
SIL_B 2
SIL_E 3
SIL_I 4
SIL_S 5
SPN 6
SPN_B 7
SPN_E 8
SPN_I 9
SPN_S 10
NSN 11
NSN_B 12
NSN_E 13
NSN_I 14
NSN_S 15
LAU 16
LAU_B 17
LAU_E 18
LAU_I 19
LAU_S 20
AA_B 21
AA_E 22
AA_I 23
AA_S 24
AA1_B 25
AA1_E 26
AA1_I 27
AA1_S 28
AA2_B 29
AA2_E 30
AA2_I 31
AA2_S 32
AA3_B 33
AA3_E 34
AA3_I 35
AA3_S 36
AA4_B 37
AA4_E 38
AA4_I 39
AA4_S 40
AA5_B 41
AA5_E 42
AA5_I 43
AA5_S 44
AE_B 45
AE_E 46
AE_I 47
AE_S 48
AE1_B 49
AE1_E 50
AE1_I 51
AE1_S 52
AE2_B 53
AE2_E 54
AE2_I 55
AE2_S 56
AE3_B 57
AE3_E 58
AE3_I 59
AE3_S 60
AE4_B 61
AE4_E 62
AE4_I 63
AE4_S 64
AE5_B 65
AE5_E 66
AE5_I 67
AE5_S 68
AH_B 69
AH_E 70
AH_I 71
AH_S 72
AH1_B 73
AH1_E 74
AH1_I 75
AH1_S 76
AH2_B 77
AH2_E 78
AH2_I 79
AH2_S 80
AH3_B 81
AH3_E 82
AH3_I 83
AH3_S 84
AH4_B 85
AH4_E 86
AH4_I 87
AH4_S 88
AH5_B 89
AH5_E 90
AH5_I 91
AH5_S 92
AO_B 93
AO_E 94
AO_I 95
AO_S 96
AO1_B 97
AO1_E 98
AO1_I 99
AO1_S 100
AO2_B 101
AO2_E 102
AO2_I 103
AO2_S 104
AO3_B 105
AO3_E 106
AO3_I 107
AO3_S 108
AO4_B 109
AO4_E 110
AO4_I 111
AO4_S 112
AO5_B 113
AO5_E 114
AO5_I 115
AO5_S 116
AW_B 117
AW_E 118
AW_I 119
AW_S 120
AW1_B 121
AW1_E 122
AW1_I 123
AW1_S 124
AW2_B 125
AW2_E 126
AW2_I 127
AW2_S 128
AW3_B 129
AW3_E 130
AW3_I 131
AW3_S 132
AW4_B 133
AW4_E 134
AW4_I 135
AW4_S 136
AW5_B 137
AW5_E 138
AW5_I 139
AW5_S 140
AY_B 141
AY_E 142
AY_I 143
AY_S 144
AY1_B 145
AY1_E 146
AY1_I 147
AY1_S 148
AY2_B 149
AY2_E 150
AY2_I 151
AY2_S 152
AY3_B 153
AY3_E 154
AY3_I 155
AY3_S 156
AY4_B 157
AY4_E 158
AY4_I 159
AY4_S 160
AY5_B 161
AY5_E 162
AY5_I 163
AY5_S 164
B_B 165
B_E 166
B_I 167
B_S 168
CH_B 169
CH_E 170
CH_I 171
CH_S 172
D_B 173
D_E 174
D_I 175
D_S 176
EH_B 177
EH_E 178
EH_I 179
EH_S 180
EH1_B 181
EH1_E 182
EH1_I 183
EH1_S 184
EH2_B 185
EH2_E 186
EH2_I 187
EH2_S 188
EH3_B 189
EH3_E 190
EH3_I 191
EH3_S 192
EH4_B 193
EH4_E 194
EH4_I 195
EH4_S 196
EH5_B 197
EH5_E 198
EH5_I 199
EH5_S 200
ER_B 201
ER_E 202
ER_I 203
ER_S 204
ER1_B 205
ER1_E 206
ER1_I 207
ER1_S 208
ER2_B 209
ER2_E 210
ER2_I 211
ER2_S 212
ER3_B 213
ER3_E 214
ER3_I 215
ER3_S 216
ER4_B 217
ER4_E 218
ER4_I 219
ER4_S 220
ER5_B 221
ER5_E 222
ER5_I 223
ER5_S 224
EY_B 225
EY_E 226
EY_I 227
EY_S 228
EY1_B 229
EY1_E 230
EY1_I 231
EY1_S 232
EY2_B 233
EY2_E 234
EY2_I 235
EY2_S 236
EY3_B 237
EY3_E 238
EY3_I 239
EY3_S 240
EY4_B 241
EY4_E 242
EY4_I 243
EY4_S 244
EY5_B 245
EY5_E 246
EY5_I 247
EY5_S 248
F_B 249
F_E 250
F_I 251
F_S 252
G_B 253
G_E 254
G_I 255
G_S 256
HH_B 257
HH_E 258
HH_I 259
HH_S 260
IY_B 261
IY_E 262
IY_I 263
IY_S 264
IY1_B 265
IY1_E 266
IY1_I 267
IY1_S 268
IY2_B 269
IY2_E 270
IY2_I 271
IY2_S 272
IY3_B 273
IY3_E 274
IY3_I 275
IY3_S 276
IY4_B 277
IY4_E 278
IY4_I 279
IY4_S 280
IY5_B 281
IY5_E 282
IY5_I 283
IY5_S 284
J_B 285
J_E 286
J_I 287
J_S 288
JH_B 289
JH_E 290
JH_I 291
JH_S 292
K_B 293
K_E 294
K_I 295
K_S 296
L_B 297
L_E 298
L_I 299
L_S 300
M_B 301
M_E 302
M_I 303
M_S 304
NG_B 305
NG_E 306
NG_I 307
NG_S 308
NG1_B 309
NG1_E 310
NG1_I 311
NG1_S 312
NG2_B 313
NG2_E 314
NG2_I 315
NG2_S 316
NG3_B 317
NG3_E 318
NG3_I 319
NG3_S 320
NG4_B 321
NG4_E 322
NG4_I 323
NG4_S 324
NG5_B 325
NG5_E 326
NG5_I 327
NG5_S 328
N_B 329
N_E 330
N_I 331
N_S 332
N1_B 333
N1_E 334
N1_I 335
N1_S 336
N2_B 337
N2_E 338
N2_I 339
N2_S 340
N3_B 341
N3_E 342
N3_I 343
N3_S 344
N4_B 345
N4_E 346
N4_I 347
N4_S 348
N5_B 349
N5_E 350
N5_I 351
N5_S 352
OW_B 353
OW_E 354
OW_I 355
OW_S 356
OW1_B 357
OW1_E 358
OW1_I 359
OW1_S 360
OW2_B 361
OW2_E 362
OW2_I 363
OW2_S 364
OW3_B 365
OW3_E 366
OW3_I 367
OW3_S 368
OW4_B 369
OW4_E 370
OW4_I 371
OW4_S 372
OW5_B 373
OW5_E 374
OW5_I 375
OW5_S 376
P_B 377
P_E 378
P_I 379
P_S 380
Q_B 381
Q_E 382
Q_I 383
Q_S 384
R_B 385
R_E 386
R_I 387
R_S 388
R2_B 389
R2_E 390
R2_I 391
R2_S 392
R3_B 393
R3_E 394
R3_I 395
R3_S 396
R4_B 397
R4_E 398
R4_I 399
R4_S 400
R5_B 401
R5_E 402
R5_I 403
R5_S 404
S_B 405
S_E 406
S_I 407
S_S 408
SH_B 409
SH_E 410
SH_I 411
SH_S 412
T_B 413
T_E 414
T_I 415
T_S 416
UH_B 417
UH_E 418
UH_I 419
UH_S 420
UH1_B 421
UH1_E 422
UH1_I 423
UH1_S 424
UH2_B 425
UH2_E 426
UH2_I 427
UH2_S 428
UH3_B 429
UH3_E 430
UH3_I 431
UH3_S 432
UH4_B 433
UH4_E 434
UH4_I 435
UH4_S 436
UH5_B 437
UH5_E 438
UH5_I 439
UH5_S 440
UW_B 441
UW_E 442
UW_I 443
UW_S 444
UW1_B 445
UW1_E 446
UW1_I 447
UW1_S 448
UW2_B 449
UW2_E 450
UW2_I 451
UW2_S 452
UW3_B 453
UW3_E 454
UW3_I 455
UW3_S 456
UW4_B 457
UW4_E 458
UW4_I 459
UW4_S 460
UW5_B 461
UW5_E 462
UW5_I 463
UW5_S 464
W_B 465
W_E 466
W_I 467
W_S 468
X_B 469
X_E 470
X_I 471
X_S 472
Y_B 473
Y_E 474
Y_I 475
Y_S 476
Z_B 477
Z_E 478
Z_I 479
Z_S 480
