{
    "resId":"nlu_reminder_NO_WAKE_UP_DELAY_RING_group_comp",
    "domain":"nlu",
    "district":"china",
    "deviceType":"common",
    "productName":"common",
    "romVersion":"common",
    "osVersion":"common",
    "version":"0x01010000",
    "releaseNotes":"",
    "digest":"",
    "fileName":"",
    "ResMetaData":[
        {
            "origin_id":"0x000000000200103f",
            "res_value":"",
            "res_path":"nlu/model/local/fst/zh/reminder/NO_WAKE_UP_DELAY_RING.far",
            "domain":"nlu",
            "data_version":"0x01010000",
            "encrypt_mode":"0"
        }
    ]
}