{
  "config":
  {
    "hw_platform": ["QRD"],
    "soc_id": ["515"]
  },
  "ltr311_0":{
    "owner": "sns_ltr311",
    ".ambient":{
      "owner": "sns_ltr311",
      ".config":{
        "owner": "sns_ltr311",
        "is_dri":{ "type": "int", "ver": "0",
          "data": "0"
        },
        "hw_id":{ "type": "int", "ver": "0",
          "data": "0"
        },
        "res_idx":{ "type": "int", "ver": "0",
          "data": "0"
        },
        "sync_stream":{ "type": "int", "ver": "0",
          "data": "0"
        }
      }
    }
  },
  "ltr311_0_platform":{
    "owner": "sns_ltr311",
    ".config":{
      "owner": "sns_ltr311",
      "bus_type":{ "type": "int", "ver": "0",
        "data": "0"
      },
      "bus_instance":{ "type": "int", "ver": "0",
        "data": "2"
      },
      "slave_config":{ "type": "int", "ver": "0",
        "data": "34"
      },
      "min_bus_speed_khz":{ "type": "int", "ver": "0",
        "data": "400"
      },
      "max_bus_speed_khz":{ "type": "int", "ver": "0",
        "data": "400"
      },
      "reg_addr_type":{ "type": "int", "ver": "0",
        "data": "0"
      },
      "dri_irq_num":{ "type": "int", "ver": "0",
        "data": "122"
      },
      "irq_pull_type":{ "type": "int", "ver": "0",
        "data": "3"
      },
      "irq_is_chip_pin":{ "type": "int", "ver": "0",
        "data": "1"
      },
      "irq_drive_strength":{ "type": "int", "ver": "0",
        "data": "0"
      },
      "irq_trigger_type":{ "type": "int", "ver": "0",
        "data": "1"
      },
      "num_rail":{ "type": "int", "ver": "0",
        "data": "2"
      },
      "rail_on_state":{ "type": "int", "ver": "0",
        "data": "2"
      },
      "vdd_rail":{ "type": "str", "ver": "0",
        "data": "/pmic/client/sensor_vdd"
      },
      "vddio_rail":{ "type": "str", "ver": "0",
        "data": "/pmic/client/sensor_vddio"
      },
      "rigid_body_type":{ "type": "int", "ver": "0",
      "data": "0"
      }
    },
    ".ambient":{
      "owner": "sns_ltr311",
      ".fac_cal":{
        "owner": "sns_ltr311",
        "scale":{ "type": "flt", "ver": "0",
          "data": "1.0"
        },
        "bias":{ "type": "flt", "ver": "0",
          "data": "0.0"
        }
      },
      ".def_config":{
        "owner": "sns_ltr311",
        "als_gain":{ "type": "flt", "ver": "0",
          "data": "100"
        },
        "als_time_scale":{ "type": "flt", "ver": "0",
          "data": "227"
        },
        "als_int_time":{ "type": "flt", "ver": "0",
          "data": "255"
        },
        "als_meas_rate":{ "type": "flt", "ver": "0",
          "data": "127"
        },
        "als_averaging":{ "type": "flt", "ver": "0",
          "data": "83"
        },
        "ir_enable":{ "type": "flt", "ver": "0",
          "data": "8"
        },
        "als_intr_ctrl_1":{ "type": "flt", "ver": "0",
          "data": "16"
        },
        "als_intr_ctrl_2":{ "type": "flt", "ver": "0",
          "data": "0"
        },
        "sample_rate_als":{ "type": "flt", "ver": "0",
          "data": "5.0"
        },
        "als_cal_lux":{ "type": "flt", "ver": "0",
          "data": "300.0"
        },
        "als_dark_count_target":{ "type": "flt", "ver": "0",
          "data": "-90"
        },
        "ir_dark_count_target":{ "type": "flt", "ver": "0",
          "data": "-130"
        }
      }
    },
    ".placement":{
      "owner": "sns_ltr311",
      "0":{ "type": "flt", "ver": "0",
        "data": "0.0"
      },
      "1":{ "type": "flt", "ver": "0",
        "data": "0.0"
      },
      "2":{ "type": "flt", "ver": "0",
        "data": "0.0"
      },
      "3":{ "type": "flt", "ver": "0",
        "data": "0.0"
      },
      "4":{ "type": "flt", "ver": "0",
        "data": "0.0"
      },
      "5":{ "type": "flt", "ver": "0",
        "data": "0.0"
      },
      "6":{ "type": "flt", "ver": "0",
        "data": "0.0"
      },
      "7":{ "type": "flt", "ver": "0",
        "data": "0.0"
      },
      "8":{ "type": "flt", "ver": "0",
        "data": "0.0"
      },
      "9":{ "type": "flt", "ver": "0",
        "data": "0.0"
      },
      "10":{ "type": "flt", "ver": "0",
        "data": "0.0"
      },
      "11":{ "type": "flt", "ver": "0",
        "data": "0.0"
      }
    }
  }
}