{
	"centerX" : 0.5,
	"centerY" : 0.5,
	"angle" : 0,
	"scale" : 1,
	"width" : 96,
	"height" : 88,
	"contents" : [{
			"type" : "image",
			"resource" : {
				"type" : "static",
				"path" : "res/bg.png"
			},
			"centerX" : 0.5,
			"centerY" : 0.5,
			"width" : 96,
			"height" : 88,
			"angle" : 0,
			"zorder" : 1
		},
		{
            "type": "text",
            "centerX": 0.5,
            "centerY": 0.7,
            "width": 50,
            "height": 16,
            "angle": 0,
            "color": "#ffffffff",
            "isVertical": 0,
			"alignment": 0,
			"editable":true,
            "text": "{LOCATION}",
            "zorder": 2
        }
	]
}
