0 0 0 0 
0 0 0 0 
0 0 0 0 
0 0 0 0 
0 0 0 0 
0 0 0 0 
0 0 0 0 
0 0 0 0 
0 0 0 0 
0 0 0 0 
0.010193825699389 0.000224676929065026 8.32223595352843e-05 -5.50496724827099e-06 
0.0148815102875233 0.000311693060211837 0.000121679593576118 -5.54217194803641e-06 
0.0203446578234434 0.000396514340536669 0.000154639201355167 -3.69197755389905e-06 
0.0272719748318195 0.00046502408804372 0.0001696620893199 -1.85938984031964e-06 
0.0376857407391071 0.000498600187711418 0.000146146296174265 -4.11396825938937e-07 
0.0505602322518826 0.000492210790980607 8.84263426996768e-05 -6.50470383334323e-07 
0.0641504600644112 0.000452584732556716 1.34277315737563e-05 -2.03319905267563e-06 
0.0777991637587547 0.000396066781831905 -6.55112526146695e-05 -4.05570790462662e-06 
0.0901931971311569 0.000334306503646076 -0.000132405592012219 -6.30204294793657e-06 
0.0994506850838661 0.000288997398456559 -0.000163717792020179 -7.35012827135506e-06 
0.106267288327217 0.000262333516729996 -0.000164903336553834 -6.05456671110005e-06 
0.112218521535397 0.000242774418438785 -0.000152599837747402 -3.5094801660307e-06 
0.117547117173672 0.000222016664338298 -0.000134453293867409 -4.16108633771728e-07 
0.1222830042243 0.000197969435248524 -0.000113657471956685 2.71585258815321e-06 
0.126448422670364 0.000169159859069623 -9.54980132519267e-05 5.34943592356285e-06 
0.130338311195374 0.000141723765409552 -7.81468115746975e-05 6.87230885887402e-06 
0.134136185050011 0.000117941308417358 -6.3336432504002e-05 7.93253730080323e-06 
0.137924462556839 8.97599966265261e-05 -4.93752813781612e-05 7.83302493800875e-06 
0.141725927591324 6.66721898596734e-05 -3.83987062377855e-05 7.59213799028657e-06 
0.145598605275154 4.95390886499081e-05 -2.6502508262638e-05 7.14571069693193e-06 
0.149233251810074 3.06043075397611e-05 -1.56749174493598e-05 6.51154414299526e-06 
0.152465373277664 1.6079495253507e-05 -5.08290304424008e-06 5.6657208915567e-06 
0.155413538217545 8.70788699103286e-06 3.76654588762904e-06 5.24114147992805e-06 
0.157843828201294 -1.42917838275025e-06 1.12128882392426e-05 5.00771420774981e-06 
0.159880563616753 -1.35735581352492e-05 1.57029262481956e-05 4.51335290563293e-06 
0.161734908819199 -2.69099436991382e-05 1.79982271220069e-05 4.73614954898949e-06 
0.16342881321907 -4.14403148170095e-05 1.92432689800626e-05 5.07309869135497e-06 
0.164981096982956 -5.57726270926651e-05 1.99220739887096e-05 5.71371765545337e-06 
0.166475474834442 -6.86493222019635e-05 1.99273254111176e-05 5.32872218172997e-06 
0.167681589722633 -7.91702404967509e-05 2.07924076676136e-05 5.10644849782693e-06 
0.168563902378082 -8.330858690897e-05 2.35618645092472e-05 4.97811515742796e-06 
0.168963044881821 -9.17350844247267e-05 2.57762512774207e-05 4.95704034619848e-06 
0.168901965022087 -9.34134222916327e-05 2.88491410174174e-05 4.13734687754186e-06 
0.16834819316864 -9.36303840717301e-05 3.11998883262277e-05 3.61356023859116e-06 
0.167331010103226 -9.19201047508977e-05 3.71676069335081e-05 3.04702530229406e-06 
0.165850937366486 -9.28563749766909e-05 4.18415074818768e-05 1.99369674191985e-06 
0.164000809192657 -8.93594260560349e-05 4.74896587547846e-05 1.90483397943808e-08 
0.161636739969254 -8.85259505594149e-05 4.8684909415897e-05 -1.28202771065844e-06 
0.159025579690933 -8.74602919793688e-05 4.95147396577522e-05 -2.11793576454511e-06 
0.156101956963539 -9.69396132859401e-05 4.67770914838184e-05 -3.09273332277371e-06 
0.152809366583824 -0.000100360761280172 4.22907032771036e-05 -3.9552551243105e-06 
0.149163231253624 -0.000105025312223006 3.73465918528382e-05 -4.29104056820506e-06 
0.145300686359406 -0.000111075198219623 3.20161125273444e-05 -4.56719226349378e-06 
0.140702486038208 -0.000115098475362174 2.84771522274241e-05 -4.80672042613151e-06 
0.135811477899551 -0.000107820291304961 2.32515412790235e-05 -4.89456988361781e-06 
0.13067415356636 -0.000105917752080131 1.96493601833936e-05 -4.72580813948298e-06 
0.125406593084335 -9.90599000942893e-05 1.60487616085447e-05 -4.81129382023937e-06 
0.119947604835033 -9.31381873670034e-05 1.40374340844573e-05 -4.78899346489925e-06 
0.11460492759943 -8.86645575519651e-05 1.2866449651483e-05 -5.62654486202518e-06 
0.109194949269295 -8.7014093878679e-05 1.17832414616714e-05 -6.45177806291031e-06 
0.103634290397167 -8.57429622556083e-05 1.03902348200791e-05 -7.54324264562456e-06 
0.0980357378721237 -8.52705561555922e-05 7.90027297625784e-06 -7.60623152018525e-06 
0.0922927111387253 -8.26109680929221e-05 8.40999200590886e-06 -7.69299185776617e-06 
0.0864094346761703 -8.0512669228483e-05 6.93117135597277e-06 -7.5954590101901e-06 
0.0803790241479874 -7.66572484280914e-05 5.5613513723074e-06 -7.31021964384126e-06 
0.0743627175688744 -7.11056927684695e-05 4.51861751571414e-06 -6.82699737808434e-06 
0.0683863759040833 -6.59069482935593e-05 4.63405922346283e-06 -6.96684537615511e-06 
0.0626815930008888 -6.022031448083e-05 3.66176232091675e-06 -6.98275380273117e-06 
0.057521365582943 -5.26328331034165e-05 3.47250056620396e-06 -6.58569797451491e-06 
0.0529163926839828 -4.59592847619206e-05 3.52509709955484e-06 -6.11468703937135e-06 
0.048919890075922 -4.141533645452e-05 3.75616741621343e-06 -5.75121293877601e-06 
0.0454542152583599 -3.74840165022761e-05 3.58192960447923e-06 -5.42400903214002e-06 
0.0424671284854412 -3.49419569829479e-05 3.28361625179241e-06 -5.11793632540503e-06 
0.0398635156452656 -3.2133288186742e-05 2.85814621747704e-06 -4.79949039799976e-06 
0.0375741086900234 -3.00485899060732e-05 3.2068796826934e-06 -4.51132882517413e-06 
0.035597275942564 -2.52778991125524e-05 3.17798730975483e-06 -4.47966431238456e-06 
0.0338739827275276 -2.12851737160236e-05 4.10795701100142e-06 -4.36728032582323e-06 
0.0323064513504505 -1.75870191014837e-05 3.85650901080226e-06 -4.18891022491152e-06 
0.030864292755723 -1.37162069222541e-05 5.16214868184761e-06 -4.00373846787261e-06 
0.0295301731675863 -8.77731872606091e-06 6.50926176604116e-06 -3.92418814953999e-06 
0.0281852744519711 -4.91175251227105e-06 7.8082739491947e-06 -3.51836251866189e-06 
0.0268788002431393 -1.1627365665845e-06 8.91307900019456e-06 -3.12612928610179e-06 
0.0256086084991693 3.19344985655334e-06 1.06593643067754e-05 -2.73407249551383e-06 
0.024358443915844 5.83071505388943e-06 1.12317929961137e-05 -2.38599977819831e-06 
0.0231003575026989 7.34846435079817e-06 1.17121571747703e-05 -2.10000530387333e-06 
0.0218782424926758 7.78239063947694e-06 1.16395185614238e-05 -1.88991248251114e-06 
0.0206986051052809 8.69860559760127e-06 1.14343893073965e-05 -1.78335915279604e-06 
0.0195888616144657 9.62963531492278e-06 1.11896861199057e-05 -1.73614262166666e-06 
0.0185777060687542 1.07497153294389e-05 1.11263116195914e-05 -1.69524503235152e-06 
0.0176905132830143 1.19435435408377e-05 1.09194734250195e-05 -1.46714489801525e-06 
0.0169380884617567 1.32206259877421e-05 1.11471481432091e-05 -1.37366282615403e-06 
0.0162907298654318 1.41842274388182e-05 1.18032066893647e-05 -1.02176102245721e-06 
0.0157630518078804 1.4982208085712e-05 1.23118279589107e-05 -8.20749733065895e-07 
0.0153253059834242 1.51622170960763e-05 1.27721168610151e-05 -4.67773048740128e-07 
0.014974994584918 1.5685907783336e-05 1.33261673909146e-05 -2.6272550712747e-07 
0.0147284511476755 1.65695419127587e-05 1.40306956382119e-05 -2.33357120293931e-08 
0.0145720355212688 1.710225478746e-05 1.44926680150093e-05 6.37278390058782e-08 
0.0144874667748809 1.68168971867999e-05 1.48463595905923e-05 1.39094836981712e-07 
0.0144794378429651 1.68593960552244e-05 1.51592512338539e-05 3.22967991905898e-07 
0.0145488539710641 1.64991288329475e-05 1.51998538058251e-05 2.91331588186949e-07 
0.0146525213494897 1.63063596119173e-05 1.53906876221299e-05 2.95082656975865e-07 
0.0147765930742025 1.62549131346168e-05 1.49435545608867e-05 3.84846771339653e-07 
0.0148942563682795 1.68853421200765e-05 1.51204085341305e-05 4.32819462048428e-07 
0.0149930734187365 1.75452969415346e-05 1.55041252583032e-05 2.03600791337522e-07 
0.0150340339168906 1.8812077541952e-05 1.59165774675785e-05 3.27454301896069e-07 
0.0150312874466181 1.96959845197853e-05 1.54437675519148e-05 4.56591749298241e-07 
0.0149849280714989 2.09186564461561e-05 1.54668541654246e-05 4.60424587345187e-07 
0.0148984687402844 2.22746966755949e-05 1.55246998474468e-05 6.01409340106329e-07 
0.0147873107343912 2.28080734814284e-05 1.5183883078862e-05 7.51903996842884e-07 
0.0146858207881451 2.3157823306974e-05 1.4959658983571e-05 7.43073883313627e-07 
0.0145743414759636 2.38740158238215e-05 1.53577075252542e-05 7.57488407998608e-07 
0.0144659439101815 2.43916347244522e-05 1.54492827277863e-05 7.5226296303299e-07 
0.014405325986445 2.44866532739252e-05 1.53101191244787e-05 6.93580545885197e-07 
0.0143599873408675 2.56781113421312e-05 1.52218080984312e-05 6.07875904279354e-07 
0.0143531383946538 2.65228627540637e-05 1.53190831042593e-05 5.71297221085842e-07 
0.0143681364133954 2.76314203802031e-05 1.509787307441e-05 4.42958395296955e-07 
0.014409527182579 2.78445622825529e-05 1.48857880049036e-05 3.6689164062409e-07 
0.0144735621288419 2.8236499929335e-05 1.46068769026897e-05 3.43203424790772e-07 
0.0145399514585733 2.8079115509172e-05 1.40518595799222e-05 3.0159210950842e-07 
0.0145892379805446 2.80178737739334e-05 1.28201063489541e-05 2.31862529176396e-07 
0.014630226418376 2.77167728199856e-05 1.18063308036653e-05 3.16225140295501e-07 
0.014666797593236 2.74226349574747e-05 1.07439245766727e-05 3.39091485557219e-07 
0.0146669000387192 2.67138784693088e-05 9.68690619629342e-06 2.80578319689084e-07 
0.0146646294742823 2.65851649601245e-05 9.05635351955425e-06 4.18464537688124e-07 
0.0146290780976415 2.62200028373627e-05 8.93471133167623e-06 3.43242874123462e-07 
0.0146030252799392 2.48080868914258e-05 8.42000190459657e-06 2.95458676191629e-07 
0.0145469661802053 2.4870269044186e-05 8.30358840175904e-06 2.287295046699e-07 
0.0144454697147012 2.54144724749494e-05 7.68635982240085e-06 3.60705371349468e-07 
0.014348354190588 2.471289371897e-05 6.55950452710385e-06 2.06042017225627e-07 
0.0142126176506281 2.39821747527458e-05 5.22300661032205e-06 4.289173602956e-07 
0.0140741756185889 2.25907624553656e-05 3.88990565625136e-06 4.91911976041592e-07 
0.0139054534956813 2.05315664061345e-05 1.51848917084862e-06 6.17455441442871e-07 
0.0137502364814281 1.70036637427984e-05 -7.71939312471659e-07 5.55129986423708e-07 
0.0135306995362043 1.41464106491185e-05 -3.51122889696853e-06 6.57730311104388e-07 
0.0133636379614472 9.76741921476787e-06 -6.44703959551407e-06 5.37261541921907e-07 
0.0131652662530541 6.22366587776924e-06 -1.00744036899414e-05 4.46211089411008e-07 
0.0129547910764813 1.97448275685019e-06 -1.36684075187077e-05 3.73740050463311e-07 
0.0126921469345689 -3.02293574350188e-06 -1.80391398316715e-05 3.41671466230764e-07 
0.0124235479161143 -8.13719452708028e-06 -2.16725256905193e-05 3.00512994044766e-07 
0.0120685547590256 -1.27826151583577e-05 -2.60818360402482e-05 3.39205030286394e-07 
0.0116243390366435 -1.73887674463913e-05 -3.03392043861095e-05 2.68825999683031e-07 
0.0110993189737201 -2.19996072701178e-05 -3.49056244886015e-05 1.42754331022843e-07 
0.0105406101793051 -2.62385092355544e-05 -3.95785791624803e-05 -1.33139963054418e-07 
0.00988488085567951 -3.11361509375274e-05 -4.46962912974413e-05 -5.17603552907531e-07 
0.00919627863913774 -3.55642623617314e-05 -5.01543836435303e-05 -8.42043505144829e-07 
0.00846727471798658 -3.98562151531223e-05 -5.49129545106553e-05 -1.29337945509178e-06 
0.00777339190244675 -4.44382385467179e-05 -6.00314415351022e-05 -1.81346524641413e-06 
0.0070165516808629 -4.75004817417357e-05 -6.38586425338872e-05 -2.18177387978358e-06 
0.00628059031441808 -4.97988366987556e-05 -6.68354769004509e-05 -2.53857274401526e-06 
0.00551199726760387 -5.08390148752369e-05 -6.7252476583235e-05 -2.94268670586462e-06 
0.00475960830226541 -5.01124377478845e-05 -6.66589985485189e-05 -3.24791631101107e-06 
0.00397055828943849 -4.71749226562679e-05 -6.2605133280158e-05 -3.42617113346932e-06 
0.0032424065284431 -4.26262049586512e-05 -5.6977278291015e-05 -3.5992907214677e-06 
0.00255877641029656 -3.5550088796299e-05 -4.9452661187388e-05 -3.68237601833243e-06 
0.00191406719386578 -2.7222520657233e-05 -4.13521120208316e-05 -3.54902340404806e-06 
0.00136866618413478 -1.88574158528354e-05 -3.31227311107796e-05 -3.15502393277711e-06 
0.00090203044237569 -1.01882897070027e-05 -2.5828927391558e-05 -2.6342188448325e-06 
0.000522437156178057 -3.04943841911154e-06 -1.94974109035684e-05 -1.99885994334181e-06 
0.0002211954415543 2.87815601041075e-06 -1.41920454552746e-05 -1.29997283693228e-06 
3.56837117578834e-05 6.85565828462131e-06 -1.03456677607028e-05 -8.17533020835981e-07 
-0.000120462478662375 9.70334440353326e-06 -7.42286601962405e-06 -4.86068188365607e-07 
-0.000208617930184118 1.10125856735976e-05 -4.82263340018108e-06 -3.48350084777849e-07 
-0.000250031938776374 1.22096689665341e-05 -3.12677479996637e-06 -3.53540116293516e-07 
-0.000274678284768015 1.2167074601166e-05 -2.34685785471811e-06 -3.06495451241062e-07 
-0.000295098259812221 1.27557977975812e-05 -1.6908194311327e-06 -3.28266139604239e-07 
-0.000280503445537761 1.20535460155224e-05 -1.38343830258236e-06 -3.24553809605277e-07 
-0.000272939796559513 1.12516318040434e-05 -1.41624957450404e-06 -2.58615642678706e-07 
-0.000280303502222523 1.07274818219594e-05 -1.16671446903638e-06 -1.6259667745544e-07 
-0.000276568782282993 1.03062993730418e-05 -1.01527677998092e-06 -1.53020451421071e-07 
-0.000281448155874386 9.7098791229655e-06 -7.35522519335063e-07 -6.14733508541576e-08 
-0.000281980872387066 9.78652315097861e-06 -4.65673423377666e-07 1.72068592707575e-09 
0 0 0 0 
0 0 0 0 
0 0 0 0 
0 0 0 0 
0 0 0 0 
0 0 0 0 
0 0 0 0 
0 0 0 0 
0 0 0 0 
0 0 0 0 
0 0 0 0 
0 0 0 0 
0 0 0 0 
0 0 0 0 
99.7831573486328 0.147348135709763 0.0582184605300426 0.00458161253482103 
