0 0 0 0 
0 0 0 0 
0 0 0 0 
0 0 0 0 
0 0 0 0 
0 0 0 0 
0 0 0 0 
0 0 0 0 
0 0 0 0 
0 0 0 0 
0.00126748299226165 -2.29083216254367e-05 2.65989751824236e-06 -6.22857305643265e-06 
0.00145238602999598 -2.83280678559095e-05 3.14054977934575e-06 -7.42405518394662e-06 
0.00165452982764691 -3.13495984300971e-05 2.98927352559986e-06 -8.42510689835763e-06 
0.00189442990813404 -3.33722273353487e-05 2.74628951046907e-06 -9.1287602117518e-06 
0.00224998733028769 -3.25845430779736e-05 1.77259789779782e-06 -9.00217310118023e-06 
0.00268882396630943 -2.79739197139861e-05 5.80155870011367e-07 -8.39199492475018e-06 
0.00316252093762159 -2.01747825485654e-05 -4.44460056314711e-07 -7.35963249098859e-06 
0.00366742629557848 -1.11844856292009e-05 -1.71251338088041e-06 -5.65035679755965e-06 
0.00413104938343167 -1.55490818087856e-06 -2.77425147032773e-06 -3.61714342034247e-06 
0.00445680832490325 7.93068738857983e-06 -3.22031769428577e-06 -1.9470933239063e-06 
0.00464943237602711 1.49184470501496e-05 -3.58570196112851e-06 -2.48093641630476e-07 
0.00476032681763172 1.99125606741291e-05 -4.07681409342331e-06 1.27609553146613e-06 
0.00479882815852761 2.44152379309526e-05 -4.25446751251002e-06 2.42574060393963e-06 
0.00482107233256102 2.85703299596207e-05 -4.43339013145305e-06 3.19737137033371e-06 
0.00488320412114263 3.24103129969444e-05 -4.54296878160676e-06 3.79377001991088e-06 
0.00504042813554406 3.66209387721028e-05 -4.64067670691293e-06 4.29810143032228e-06 
0.00529898656532168 4.13982743339147e-05 -4.68454027213738e-06 4.79290974908508e-06 
0.00566609622910619 4.63263859273866e-05 -4.86516819364624e-06 5.2433761084103e-06 
0.00611862866207957 5.1221162721049e-05 -5.15824876856641e-06 5.82415350436349e-06 
0.0066072684712708 5.53673817194067e-05 -5.66219205211382e-06 6.51873779133894e-06 
0.00707545271143317 5.82614629820455e-05 -6.44994497633888e-06 7.2255188570125e-06 
0.00747763318940997 5.94574630667921e-05 -7.48697084418382e-06 8.02328941063024e-06 
0.00777865154668689 5.93720869801473e-05 -8.6220816228888e-06 8.81921550899278e-06 
0.00798366218805313 5.76082384213805e-05 -1.00793031378998e-05 9.76355568127474e-06 
0.00809510704129934 5.48826283193193e-05 -1.18078587547643e-05 1.08400872704806e-05 
0.00817816238850355 5.30141551280394e-05 -1.34783349494683e-05 1.2092394172214e-05 
0.00831784680485725 5.49303440493532e-05 -1.45166532092844e-05 1.32319273689063e-05 
0.00862532388418913 6.09633316344116e-05 -1.51410667967866e-05 1.43880097311921e-05 
0.00919352844357491 7.24467026884668e-05 -1.53028158820234e-05 1.53996079461649e-05 
0.0101782362908125 9.14647607714869e-05 -1.47654718603007e-05 1.63889526447747e-05 
0.0117329927161336 0.000119004223961383 -1.37461720441934e-05 1.73212883964879e-05 
0.0140423094853759 0.000153408167534508 -1.29220079543302e-05 1.88905942195561e-05 
0.0172665119171143 0.000196217573829927 -1.17910485641914e-05 2.04392399609787e-05 
0.0216334164142609 0.000247694872086868 -9.99102394416695e-06 2.20634574361611e-05 
0.0273055639117956 0.000304726912872866 -7.25384416000452e-06 2.31490903388476e-05 
0.0343684032559395 0.000363878905773163 -2.9288519272086e-06 2.3260499801836e-05 
0.042756550014019 0.000421790697146207 3.24943903251551e-06 2.14966130442917e-05 
0.0522365905344486 0.000472408981295303 1.07971845864085e-05 1.78422960743774e-05 
0.0623577535152435 0.000507134885992855 1.90114424185595e-05 1.2135245015088e-05 
0.0727820247411728 0.000525258656125516 2.70668006123742e-05 5.37189998794929e-06 
0.0830014646053314 0.000522140995599329 3.3444204746047e-05 -1.61508353357931e-06 
0.0926733762025833 0.000498329172842205 3.71237256331369e-05 -7.67602887208341e-06 
0.101555928587914 0.00045931080239825 3.66944332199637e-05 -1.34544270622428e-05 
0.10968604683876 0.000412010849686339 3.23563399433624e-05 -1.67662346939323e-05 
0.116783671081066 0.000357048702426255 2.51346446020762e-05 -1.86859542736784e-05 
0.122897192835808 0.000303321256069466 1.54215849761385e-05 -1.90985829249257e-05 
0.128099530935287 0.000252508092671633 6.0890656641277e-06 -1.9116465409752e-05 
0.132495909929276 0.000205105330678634 -1.88608964890591e-06 -1.74422293639509e-05 
0.136194601655006 0.000163148666615598 -8.05037325335434e-06 -1.54396675497992e-05 
0.139334946870804 0.00012760997924488 -1.3512879377231e-05 -1.35050249809865e-05 
0.142076432704926 9.71698900684714e-05 -1.73257521964842e-05 -1.17807658170932e-05 
0.144376456737518 7.52379128243774e-05 -2.07026787393261e-05 -1.03032434708439e-05 
0.14632910490036 5.95257406530436e-05 -2.2604295736528e-05 -8.44875103211962e-06 
0.147788509726524 4.43858698417898e-05 -2.42009064095328e-05 -7.95565938460641e-06 
0.148888692259789 3.55450501956511e-05 -2.53674097621115e-05 -7.274098607013e-06 
0.149611964821815 2.47074694925686e-05 -2.67545001406688e-05 -6.22758670942858e-06 
0.150151491165161 1.83275387826143e-05 -2.75793372566113e-05 -5.54400958208134e-06 
0.150339007377625 8.62750493979547e-06 -2.82563669316005e-05 -6.21173057879787e-06 
0.150499880313873 7.0350693022192e-06 -2.80746226053452e-05 -5.78742674406385e-06 
0.150580063462257 -2.75945808425604e-06 -2.79002942988882e-05 -5.61842580282246e-06 
0.150585144758224 -5.64038964512292e-06 -2.67223858827492e-05 -6.66884125166689e-06 
0.150473326444626 -1.96205564861884e-05 -2.60015876847319e-05 -6.8877125158906e-06 
0.150447830557823 -3.30782131641172e-05 -2.53141679422697e-05 -5.01580097989063e-06 
0.150203287601471 -5.37800588062964e-05 -2.36655396292917e-05 -3.9308879422606e-06 
0.149978637695313 -6.50651272735558e-05 -2.12954291782808e-05 -2.33073819799756e-06 
0.149686112999916 -8.07709875516593e-05 -2.02138326130807e-05 -7.64028015964868e-07 
0.149456456303596 -8.63728273543529e-05 -1.76015473698499e-05 1.8233861283079e-06 
0.14898855984211 -8.73020107974298e-05 -1.46590500662569e-05 3.2918449051067e-06 
0.148369535803795 -9.13307812879793e-05 -1.41375167004298e-05 4.93871584694716e-06 
0.14749975502491 -0.000100472592748702 -1.16026267278357e-05 6.22124207438901e-06 
0.146488532423973 -0.000100271870905999 -6.37428001937224e-06 7.6342175816535e-06 
0.145015671849251 -0.000112791560241021 -4.01159286411712e-06 8.12620601209346e-06 
0.143554538488388 -0.000126795057440177 -2.93932134809438e-06 6.85950999468332e-06 
0.141974896192551 -0.000130908360006288 -6.9268526203814e-07 5.65785512662842e-06 
0.140351578593254 -0.000130252592498437 8.38781602396921e-07 4.64435788671835e-06 
0.138455361127853 -0.000134652145789005 3.9927292050379e-07 4.51965433967416e-06 
0.136571794748306 -0.000127159204566851 1.82773169399297e-06 4.56030875284341e-06 
0.134418845176697 -0.000123535210150294 3.9796750570531e-06 6.36924869468203e-06 
0.131976529955864 -0.000120595243060961 7.57600582801388e-06 6.5088188421214e-06 
0.129265487194061 -0.000121931763715111 8.77386355568888e-06 7.24978735888726e-06 
0.126503124833107 -0.000126822706079111 1.16209876068751e-05 7.61673345550662e-06 
0.123482972383499 -0.000135774200316519 1.2918297215947e-05 7.83430823503295e-06 
0.120327778160572 -0.000141674245242029 1.39236035465728e-05 8.77881666383473e-06 
0.117175973951817 -0.000151124142576009 1.45800013342523e-05 1.00890501926187e-05 
0.113858066499233 -0.000155755609739572 1.57611448230455e-05 1.03963966466836e-05 
0.110560342669487 -0.000155708607053384 1.6358320863219e-05 1.0566451237537e-05 
0.107152841985226 -0.000153648958075792 1.77013826032635e-05 9.18652767722961e-06 
0.103859893977642 -0.000148152132169344 1.89159745787038e-05 7.1756549004931e-06 
0.100738741457462 -0.000145718673593365 1.88546036952175e-05 7.8533666965086e-06 
0.0977063626050949 -0.000144726756843738 1.95085885934532e-05 8.90271257958375e-06 
0.094510480761528 -0.000142829172546044 2.04135412786854e-05 9.18981822906062e-06 
0.0913876220583916 -0.000138141578645445 2.161912379961e-05 1.03212678368436e-05 
0.0879906564950943 -0.000138416085974313 2.27888194785919e-05 1.01123050626484e-05 
0.0843504816293716 -0.000132239438244142 2.39098771999124e-05 8.33458307170076e-06 
0.0804686471819878 -0.000125171049148776 2.55584054684732e-05 6.02965610596584e-06 
0.0762492492794991 -0.000124780170153826 2.62068315350916e-05 4.31242915510666e-06 
0.0716768875718117 -0.000128311512526125 2.64475711446721e-05 2.91729247692274e-06 
0.0669342279434204 -0.000127649967907928 2.67149280261947e-05 2.23864230974868e-06 
0.0619996897876263 -0.000127635910757817 2.72597226285143e-05 1.70455086845323e-06 
0.0569886825978756 -0.000129090898553841 2.78434890788049e-05 1.0855072787308e-06 
0.0521086603403091 -0.000128203799249604 2.77877607004484e-05 6.94638856657548e-07 
0.0474481135606766 -0.000122563520562835 2.7670383133227e-05 -1.532877149657e-07 
0.0430156402289867 -0.000118796313472558 2.77270664810203e-05 -5.34924140538351e-07 
0.038907166570425 -0.00011542861466296 2.74025442195125e-05 -9.82053848019859e-07 
0.0351436324417591 -0.000109486478322651 2.61164404946612e-05 -1.56693477038061e-06 
0.0318003445863724 -0.000100722652859986 2.52764784818282e-05 -2.05271703634935e-06 
0.0288500729948282 -9.34308845899068e-05 2.45999744947767e-05 -2.36363939620787e-06 
0.0262515619397163 -8.42297376948409e-05 2.37411568377865e-05 -2.75703428087581e-06 
0.0239560045301914 -7.40276009310037e-05 2.26868196477881e-05 -3.18113438879664e-06 
0.0219481252133846 -6.5161133534275e-05 2.16543721762719e-05 -3.0256289846875e-06 
0.0201817620545626 -5.52400742890313e-05 2.10820944630541e-05 -3.13730720336025e-06 
0.0186254289001226 -4.6503686462529e-05 2.00096110347658e-05 -3.0019950827409e-06 
0.0172754693776369 -3.83955557481386e-05 1.88099329534452e-05 -2.83021995528543e-06 
0.0160569902509451 -3.03591441479512e-05 1.766388231772e-05 -2.67213363258634e-06 
0.0149991549551487 -2.28329499805113e-05 1.67521575349383e-05 -2.43344925365818e-06 
0.0140574146062136 -1.73422886291519e-05 1.54604513227241e-05 -2.03301351575647e-06 
0.0132267028093338 -1.1793989870057e-05 1.45206604429404e-05 -1.47918706261407e-06 
0.0124500533565879 -6.3236561800295e-06 1.3394838788372e-05 -9.60890133683279e-07 
0.0117202438414097 -1.93577920981625e-06 1.26383238239214e-05 -4.45487444267201e-07 
0.0110148331150413 2.17650949707604e-06 1.15521870611701e-05 1.28526650655658e-07 
0.0103261983022094 6.2245717344922e-06 1.07124769783695e-05 7.19122738246369e-07 
0.00963561423122883 9.8162690846948e-06 9.69552274909802e-06 1.10691689769737e-06 
0.00897707138210535 1.28050314742723e-05 8.5363117250381e-06 1.59778301167535e-06 
0.00833980273455381 1.5858076949371e-05 7.36980064175441e-06 2.04690854843648e-06 
0.00774210458621383 1.92757670447463e-05 6.2575572883361e-06 2.35451739172277e-06 
0.00717300735414028 2.24058403546223e-05 4.9892673814611e-06 2.69012275566638e-06 
0.00666180392727256 2.5930121410056e-05 3.83451560992398e-06 3.13959890263504e-06 
0.00618558609858155 2.97848528134637e-05 2.79356299870415e-06 3.5843140722136e-06 
0.00577659159898758 3.37930650857743e-05 1.63108234119136e-06 4.1986686483142e-06 
0.00541093852370977 3.77255455532577e-05 5.18029366958217e-07 4.8812535169418e-06 
0.00509826419875026 4.21661898144521e-05 -5.12107476424717e-07 5.64021047466667e-06 
0.00480394437909126 4.64413242298178e-05 -1.44610510233179e-06 6.41257111055893e-06 
0.00451336847618222 5.09587698616087e-05 -2.21154823520919e-06 7.23152743375977e-06 
0.00423007644712925 5.55095830350183e-05 -3.01110526379489e-06 7.91770253272261e-06 
0.00393940694630146 5.9149184380658e-05 -3.64117659046315e-06 8.49242223921465e-06 
0.00363689684309065 6.11132636549883e-05 -4.14014084526571e-06 8.83177199284546e-06 
0.00335782254114747 6.17345212958753e-05 -4.4660419007414e-06 9.08528818399645e-06 
0.0030846034642309 6.09060807619244e-05 -4.4388793867256e-06 8.98583675734699e-06 
0.00280252890661359 5.83031105634291e-05 -4.12972576668835e-06 8.67025846673641e-06 
0.00251475861296058 5.37791020178702e-05 -3.7762895317428e-06 8.13201040728018e-06 
0.00222026067785919 4.86191856907681e-05 -3.19645732815843e-06 7.45647230360191e-06 
0.0019145430997014 4.28965868195519e-05 -2.45017486122379e-06 6.58344561088597e-06 
0.00162666151300073 3.67360735253897e-05 -1.96485257220047e-06 5.76402771912399e-06 
0.00134702573996037 3.0112645617919e-05 -1.51747838117444e-06 4.88471459902939e-06 
0.0010977741330862 2.45215414906852e-05 -1.03632089576422e-06 4.00279168388806e-06 
0.000884270295500755 1.92701736523304e-05 -5.84995802910271e-07 3.25223822983389e-06 
0.000691002001985908 1.45453323057154e-05 -4.0228826492239e-07 2.50657399192278e-06 
0.00053416978335008 1.06351808426552e-05 -1.96941911667636e-07 1.88335127404571e-06 
0.000417098111938685 8.02575959824026e-06 -6.13596000675898e-08 1.39409735311347e-06 
0.000328682188410312 5.90341187489685e-06 4.41444711896111e-08 1.05777974113153e-06 
0.000265350681729615 5.46345381735591e-06 4.46146906085687e-08 7.17994851129333e-07 
0.000227056996664032 4.97896826345823e-06 -3.75446020939307e-08 5.08746438754315e-07 
0.000205527991056442 5.09323399455752e-06 -2.67409291154763e-07 2.0524474564354e-07 
0.000196943525224924 5.35963818037999e-06 -6.16858926605346e-07 -1.03858972977378e-07 
0.000199972462723963 6.66668984194985e-06 -1.18949617444741e-06 -5.24283905178891e-07 
0.000226949850912206 8.12821599538438e-06 -2.18149148167868e-06 -9.29161728890904e-07 
0.000267766619799659 1.0859183021239e-05 -3.2330301564798e-06 -1.52445113599242e-06 
0.000332423747749999 1.43934666994028e-05 -4.54289011031506e-06 -2.20959873331594e-06 
0.000422108423663303 1.92927018360933e-05 -6.23090454610065e-06 -3.05298635794315e-06 
0.000513115141075104 2.40961053350475e-05 -7.91069214756135e-06 -3.94190647057258e-06 
0.000646867614705116 3.10539435304236e-05 -1.02227504612529e-05 -5.07095228385879e-06 
0 0 0 0 
0 0 0 0 
0 0 0 0 
0 0 0 0 
0 0 0 0 
0 0 0 0 
0 0 0 0 
0 0 0 0 
0 0 0 0 
0 0 0 0 
0 0 0 0 
0 0 0 0 
0 0 0 0 
0 0 0 0 
99.7776184082031 0.184285312891006 0.0198570098727942 0.0107519458979368 
