#,version,,,,,,,,,,,,,,,,,,,,,,,,,,,,,,,,,,,,,,,,,,,,,,,,,,,,,,,,
2020,3,10,6,,,,,,,,,,,,,,,,,,,,,,,,,,,,,,,,,,,,,,,,,,,,,,,,,,,,,,
#,row_col_num,,,,,,,,,,,,,,,,,,,,,,,,,,,,,,,,,,,,,,,,,,,,,,,,,,,,,,,,
40,18,,,,,,,,,,,,,,,,,,,,,,,,,,,,,,,,,,,,,,,,,,,,,,,,,,,,,,,,
#,noise,,,,,,,,,,,,,,,,,,,,,,,,,,,,,,,,,,,,,,,,,,,,,,,,,,,,,,,,
-500,500,,,,,,,,,,,,,,,,,,,,,,,,,,,,,,,,,,,,,,,,,,,,,,,,,,,,,,,,
#,raw_max,,,,,,,,,,,,,,,,,,,,,,,,,,,,,,,,,,,,,,,,,,,,,,,,,,,,,,,,
10000,10000,10000,10000,10000,10000,10000,10000,10000,10000,10000,10000,10000,10000,10000,10000,10000,10000,,,,,,,,,,,,,,,,,,,,,,,,,,,,,,,,,,,,,,,,
10000,10000,20000,20000,20000,20000,10000,10000,10000,10000,10000,10000,10000,10000,10000,10000,10000,10000,,,,,,,,,,,,,,,,,,,,,,,,,,,,,,,,,,,,,,,,
10000,10000,10000,10000,10000,10000,10000,10000,10000,10000,10000,10000,10000,10000,10000,10000,10000,10000,,,,,,,,,,,,,,,,,,,,,,,,,,,,,,,,,,,,,,,,
10000,10000,10000,10000,10000,10000,10000,10000,10000,10000,10000,10000,10000,10000,10000,10000,10000,10000,,,,,,,,,,,,,,,,,,,,,,,,,,,,,,,,,,,,,,,,
10000,10000,10000,10000,10000,10000,10000,10000,10000,10000,10000,10000,10000,10000,10000,10000,10000,10000,,,,,,,,,,,,,,,,,,,,,,,,,,,,,,,,,,,,,,,,
10000,10000,10000,10000,10000,10000,10000,10000,10000,10000,10000,10000,10000,10000,10000,10000,10000,10000,,,,,,,,,,,,,,,,,,,,,,,,,,,,,,,,,,,,,,,,
10000,10000,10000,10000,10000,10000,10000,10000,10000,10000,10000,10000,10000,10000,10000,10000,10000,10000,,,,,,,,,,,,,,,,,,,,,,,,,,,,,,,,,,,,,,,,
10000,10000,10000,10000,10000,10000,10000,10000,10000,10000,10000,10000,10000,10000,10000,10000,10000,10000,,,,,,,,,,,,,,,,,,,,,,,,,,,,,,,,,,,,,,,,
10000,10000,10000,10000,10000,10000,10000,10000,10000,10000,10000,10000,10000,10000,10000,10000,10000,10000,,,,,,,,,,,,,,,,,,,,,,,,,,,,,,,,,,,,,,,,
10000,10000,10000,10000,10000,10000,10000,10000,10000,10000,10000,10000,10000,10000,10000,10000,10000,10000,,,,,,,,,,,,,,,,,,,,,,,,,,,,,,,,,,,,,,,,
10000,10000,10000,10000,10000,10000,10000,10000,10000,10000,10000,10000,10000,10000,10000,10000,10000,10000,,,,,,,,,,,,,,,,,,,,,,,,,,,,,,,,,,,,,,,,
10000,10000,10000,10000,10000,10000,10000,10000,10000,10000,10000,10000,10000,10000,10000,10000,10000,10000,,,,,,,,,,,,,,,,,,,,,,,,,,,,,,,,,,,,,,,,
10000,10000,10000,10000,10000,10000,10000,10000,10000,10000,10000,10000,10000,10000,10000,10000,10000,10000,,,,,,,,,,,,,,,,,,,,,,,,,,,,,,,,,,,,,,,,
10000,10000,10000,10000,10000,10000,10000,10000,10000,10000,10000,10000,10000,10000,10000,10000,10000,10000,,,,,,,,,,,,,,,,,,,,,,,,,,,,,,,,,,,,,,,,
10000,10000,10000,10000,10000,10000,10000,10000,10000,10000,10000,10000,10000,10000,10000,10000,10000,10000,,,,,,,,,,,,,,,,,,,,,,,,,,,,,,,,,,,,,,,,
10000,10000,10000,10000,10000,10000,10000,10000,10000,10000,10000,10000,10000,10000,10000,10000,10000,10000,,,,,,,,,,,,,,,,,,,,,,,,,,,,,,,,,,,,,,,,
10000,10000,10000,10000,10000,10000,10000,10000,10000,10000,10000,10000,10000,10000,10000,10000,10000,10000,,,,,,,,,,,,,,,,,,,,,,,,,,,,,,,,,,,,,,,,
10000,10000,10000,10000,10000,10000,10000,10000,10000,10000,10000,10000,10000,10000,10000,10000,10000,10000,,,,,,,,,,,,,,,,,,,,,,,,,,,,,,,,,,,,,,,,
10000,10000,10000,10000,10000,10000,10000,10000,10000,10000,10000,10000,10000,10000,10000,10000,10000,10000,,,,,,,,,,,,,,,,,,,,,,,,,,,,,,,,,,,,,,,,
10000,10000,10000,10000,10000,10000,10000,10000,10000,10000,10000,10000,10000,10000,10000,10000,10000,10000,,,,,,,,,,,,,,,,,,,,,,,,,,,,,,,,,,,,,,,,
10000,10000,10000,10000,10000,10000,10000,10000,10000,10000,10000,10000,10000,10000,10000,10000,10000,10000,,,,,,,,,,,,,,,,,,,,,,,,,,,,,,,,,,,,,,,,
10000,10000,10000,10000,10000,10000,10000,10000,10000,10000,10000,10000,10000,10000,10000,10000,10000,10000,,,,,,,,,,,,,,,,,,,,,,,,,,,,,,,,,,,,,,,,
10000,10000,10000,10000,10000,10000,10000,10000,10000,10000,10000,10000,10000,10000,10000,10000,10000,10000,,,,,,,,,,,,,,,,,,,,,,,,,,,,,,,,,,,,,,,,
10000,10000,10000,10000,10000,10000,10000,10000,10000,10000,10000,10000,10000,10000,10000,10000,10000,10000,,,,,,,,,,,,,,,,,,,,,,,,,,,,,,,,,,,,,,,,
10000,10000,10000,10000,10000,10000,10000,10000,10000,10000,10000,10000,10000,10000,10000,10000,10000,10000,,,,,,,,,,,,,,,,,,,,,,,,,,,,,,,,,,,,,,,,
10000,10000,10000,10000,10000,10000,10000,10000,10000,10000,10000,10000,10000,10000,10000,10000,10000,10000,,,,,,,,,,,,,,,,,,,,,,,,,,,,,,,,,,,,,,,,
10000,10000,10000,10000,10000,10000,10000,10000,10000,10000,10000,10000,10000,10000,10000,10000,10000,10000,,,,,,,,,,,,,,,,,,,,,,,,,,,,,,,,,,,,,,,,
10000,10000,10000,10000,10000,10000,10000,10000,10000,10000,10000,10000,10000,10000,10000,10000,10000,10000,,,,,,,,,,,,,,,,,,,,,,,,,,,,,,,,,,,,,,,,
10000,10000,10000,10000,10000,10000,10000,10000,10000,10000,10000,10000,10000,10000,10000,10000,10000,10000,,,,,,,,,,,,,,,,,,,,,,,,,,,,,,,,,,,,,,,,
10000,10000,10000,10000,10000,10000,10000,10000,10000,10000,10000,10000,10000,10000,10000,10000,10000,10000,,,,,,,,,,,,,,,,,,,,,,,,,,,,,,,,,,,,,,,,
10000,10000,10000,10000,10000,10000,10000,10000,10000,10000,10000,10000,10000,10000,10000,10000,10000,10000,,,,,,,,,,,,,,,,,,,,,,,,,,,,,,,,,,,,,,,,
10000,10000,10000,10000,10000,10000,10000,10000,10000,10000,10000,10000,10000,10000,10000,10000,10000,10000,,,,,,,,,,,,,,,,,,,,,,,,,,,,,,,,,,,,,,,,
10000,10000,10000,10000,10000,10000,10000,10000,10000,10000,10000,10000,10000,10000,10000,10000,10000,10000,,,,,,,,,,,,,,,,,,,,,,,,,,,,,,,,,,,,,,,,
10000,10000,10000,10000,10000,10000,10000,10000,10000,10000,10000,10000,10000,10000,10000,10000,10000,10000,,,,,,,,,,,,,,,,,,,,,,,,,,,,,,,,,,,,,,,,
10000,10000,10000,10000,10000,10000,10000,10000,10000,10000,10000,10000,10000,10000,10000,10000,10000,10000,,,,,,,,,,,,,,,,,,,,,,,,,,,,,,,,,,,,,,,,
10000,10000,10000,10000,10000,10000,10000,10000,10000,10000,10000,10000,10000,10000,10000,10000,10000,10000,,,,,,,,,,,,,,,,,,,,,,,,,,,,,,,,,,,,,,,,
10000,10000,10000,10000,10000,10000,10000,10000,10000,10000,10000,10000,10000,10000,10000,10000,10000,10000,,,,,,,,,,,,,,,,,,,,,,,,,,,,,,,,,,,,,,,,
10000,10000,10000,10000,10000,10000,10000,10000,10000,10000,10000,10000,10000,10000,10000,10000,10000,10000,,,,,,,,,,,,,,,,,,,,,,,,,,,,,,,,,,,,,,,,
10000,10000,10000,10000,10000,10000,10000,10000,10000,10000,10000,10000,10000,10000,10000,10000,10000,10000,,,,,,,,,,,,,,,,,,,,,,,,,,,,,,,,,,,,,,,,
10000,10000,10000,10000,10000,10000,10000,10000,10000,10000,10000,10000,10000,10000,10000,10000,10000,10000,,,,,,,,,,,,,,,,,,,,,,,,,,,,,,,,,,,,,,,,
#,raw_min,,,,,,,,,,,,,,,,,,,,,,,,,,,,,,,,,,,,,,,,,,,,,,,,,,,,,,,,
6186,5930,5903,5953,6093,5960,6309,6301,6301,6301,6303,6303,6307,6306,6314,6314,6260,5261,,,,,,,,,,,,,,,,,,,,,,,,,,,,,,,,,,,,,,,,
6270,6156,5000,5000,5000,5000,6306,6328,6327,6328,6330,6331,6336,6336,6337,6337,6341,6347,,,,,,,,,,,,,,,,,,,,,,,,,,,,,,,,,,,,,,,,
6295,6303,6294,6310,6280,6261,6311,6309,6311,6311,6314,6316,6319,6319,6322,6322,6326,6391,,,,,,,,,,,,,,,,,,,,,,,,,,,,,,,,,,,,,,,,
6296,6315,6342,6344,6298,6275,6310,6313,6313,6317,6316,6318,6322,6322,6324,6324,6327,6391,,,,,,,,,,,,,,,,,,,,,,,,,,,,,,,,,,,,,,,,
6303,6321,6350,6349,6304,6280,6316,6316,6320,6320,6323,6324,6328,6327,6331,6331,6334,6394,,,,,,,,,,,,,,,,,,,,,,,,,,,,,,,,,,,,,,,,
6307,6323,6352,6352,6307,6283,6318,6322,6322,6323,6327,6327,6332,6330,6333,6333,6337,6397,,,,,,,,,,,,,,,,,,,,,,,,,,,,,,,,,,,,,,,,
6305,6323,6352,6353,6306,6283,6318,6321,6322,6323,6325,6326,6330,6331,6333,6333,6336,6394,,,,,,,,,,,,,,,,,,,,,,,,,,,,,,,,,,,,,,,,
6304,6323,6351,6353,6306,6283,6318,6320,6322,6322,6324,6326,6330,6330,6331,6333,6336,6390,,,,,,,,,,,,,,,,,,,,,,,,,,,,,,,,,,,,,,,,
6304,6324,6352,6353,6306,6284,6319,6321,6322,6323,6326,6327,6330,6330,6332,6333,6336,6392,,,,,,,,,,,,,,,,,,,,,,,,,,,,,,,,,,,,,,,,
6305,6325,6352,6353,6308,6285,6318,6323,6322,6324,6326,6325,6331,6331,6332,6333,6336,6388,,,,,,,,,,,,,,,,,,,,,,,,,,,,,,,,,,,,,,,,
6306,6325,6353,6354,6308,6286,6320,6321,6323,6328,6326,6327,6330,6332,6352,6333,6360,6390,,,,,,,,,,,,,,,,,,,,,,,,,,,,,,,,,,,,,,,,
6313,6333,6361,6361,6316,6293,6328,6330,6332,6332,6334,6335,6338,6341,6340,6341,6345,6393,,,,,,,,,,,,,,,,,,,,,,,,,,,,,,,,,,,,,,,,
6314,6335,6362,6363,6318,6295,6330,6332,6333,6334,6336,6336,6340,6343,6342,6343,6347,6394,,,,,,,,,,,,,,,,,,,,,,,,,,,,,,,,,,,,,,,,
6318,6340,6366,6367,6322,6298,6333,6335,6337,6337,6339,6341,6343,6346,6345,6348,6352,6397,,,,,,,,,,,,,,,,,,,,,,,,,,,,,,,,,,,,,,,,
6319,6341,6367,6369,6324,6300,6335,6337,6337,6349,6340,6345,6344,6348,6358,6349,6369,6401,,,,,,,,,,,,,,,,,,,,,,,,,,,,,,,,,,,,,,,,
6323,6344,6370,6371,6327,6303,6339,6340,6341,6342,6344,6344,6347,6352,6350,6353,6363,6406,,,,,,,,,,,,,,,,,,,,,,,,,,,,,,,,,,,,,,,,
6328,6349,6375,6376,6332,6308,6343,6345,6346,6346,6348,6348,6352,6358,6356,6359,6365,6411,,,,,,,,,,,,,,,,,,,,,,,,,,,,,,,,,,,,,,,,
6328,6350,6375,6376,6333,6310,6344,6345,6346,6346,6348,6348,6352,6358,6361,6361,6370,6417,,,,,,,,,,,,,,,,,,,,,,,,,,,,,,,,,,,,,,,,
6334,6356,6381,6382,6338,6316,6350,6352,6352,6353,6354,6354,6358,6366,6364,6369,6380,6431,,,,,,,,,,,,,,,,,,,,,,,,,,,,,,,,,,,,,,,,
6339,6361,6385,6385,6342,6320,6354,6354,6356,6356,6357,6357,6361,6370,6369,6376,6391,6458,,,,,,,,,,,,,,,,,,,,,,,,,,,,,,,,,,,,,,,,
6336,6357,6382,6383,6340,6317,6351,6353,6354,6354,6355,6355,6359,6370,6372,6382,6398,6538,,,,,,,,,,,,,,,,,,,,,,,,,,,,,,,,,,,,,,,,
6400,6380,6401,6398,6352,6329,6360,6358,6356,6354,6355,6350,6349,6346,6344,6342,6342,6348,,,,,,,,,,,,,,,,,,,,,,,,,,,,,,,,,,,,,,,,
6413,6398,6419,6416,6372,6347,6379,6378,6375,6374,6374,6370,6369,6366,6363,6363,6362,6367,,,,,,,,,,,,,,,,,,,,,,,,,,,,,,,,,,,,,,,,
6414,6403,6425,6421,6377,6353,6384,6383,6380,6378,6379,6375,6374,6372,6369,6368,6367,6371,,,,,,,,,,,,,,,,,,,,,,,,,,,,,,,,,,,,,,,,
6421,6409,6428,6425,6383,6359,6391,6388,6386,6384,6384,6382,6379,6377,6374,6373,6373,6377,,,,,,,,,,,,,,,,,,,,,,,,,,,,,,,,,,,,,,,,
6420,6412,6432,6429,6386,6362,6393,6391,6389,6387,6387,6384,6383,6380,6377,6376,6376,6380,,,,,,,,,,,,,,,,,,,,,,,,,,,,,,,,,,,,,,,,
6419,6414,6433,6430,6387,6364,6394,6392,6391,6389,6388,6387,6384,6381,6378,6379,6378,6381,,,,,,,,,,,,,,,,,,,,,,,,,,,,,,,,,,,,,,,,
6424,6419,6438,6435,6392,6370,6401,6399,6395,6393,6394,6391,6390,6386,6384,6383,6384,6386,,,,,,,,,,,,,,,,,,,,,,,,,,,,,,,,,,,,,,,,
6423,6421,6440,6436,6394,6371,6401,6399,6399,6396,6395,6393,6391,6387,6385,6385,6385,6387,,,,,,,,,,,,,,,,,,,,,,,,,,,,,,,,,,,,,,,,
6425,6425,6443,6441,6398,6376,6406,6404,6402,6401,6399,6398,6395,6392,6389,6388,6389,6391,,,,,,,,,,,,,,,,,,,,,,,,,,,,,,,,,,,,,,,,
6424,6424,6442,6439,6397,6372,6401,6403,6399,6398,6397,6394,6394,6388,6387,6387,6385,6389,,,,,,,,,,,,,,,,,,,,,,,,,,,,,,,,,,,,,,,,
6428,6430,6448,6443,6401,6378,6409,6407,6405,6403,6402,6401,6397,6393,6391,6390,6391,6394,,,,,,,,,,,,,,,,,,,,,,,,,,,,,,,,,,,,,,,,
6433,6435,6451,6446,6405,6382,6412,6410,6409,6407,6405,6405,6400,6396,6395,6394,6394,6397,,,,,,,,,,,,,,,,,,,,,,,,,,,,,,,,,,,,,,,,
6438,6438,6455,6451,6409,6385,6415,6413,6412,6409,6408,6407,6403,6399,6397,6396,6396,6401,,,,,,,,,,,,,,,,,,,,,,,,,,,,,,,,,,,,,,,,
6446,6448,6462,6456,6415,6390,6420,6421,6418,6415,6414,6412,6409,6405,6403,6402,6402,6406,,,,,,,,,,,,,,,,,,,,,,,,,,,,,,,,,,,,,,,,
6466,6450,6492,6456,6415,6408,6421,6418,6418,6415,6413,6411,6407,6403,6400,6402,6401,6404,,,,,,,,,,,,,,,,,,,,,,,,,,,,,,,,,,,,,,,,
6464,6463,6475,6467,6425,6401,6430,6428,6425,6422,6421,6420,6414,6411,6409,6408,6408,6411,,,,,,,,,,,,,,,,,,,,,,,,,,,,,,,,,,,,,,,,
6471,6474,6483,6471,6425,6408,6433,6430,6428,6424,6422,6422,6413,6414,6410,6411,6411,6403,,,,,,,,,,,,,,,,,,,,,,,,,,,,,,,,,,,,,,,,
6410,6460,6507,6481,6437,6452,6440,6446,6434,6431,6430,6428,6424,6420,6417,6418,6382,6316,,,,,,,,,,,,,,,,,,,,,,,,,,,,,,,,,,,,,,,,
6417,6455,6516,6491,6441,6414,6440,6434,6430,6425,6422,6418,6408,6409,6411,6406,6342,6256,,,,,,,,,,,,,,,,,,,,,,,,,,,,,,,,,,,,,,,,
#,raw_row_delta_max,,,,,,,,,,,,,,,,,,,,,,,,,,,,,,,,,,,,,,,,,,,,,,,,,,,,,,,,
2000,806,3000,3000,3000,3000,483,525,526,526,527,529,530,529,522,523,599,2000,,,,,,,,,,,,,,,,,,,,,,,,,,,,,,,,,,,,,,,,
526,689,3000,3000,3000,3000,496,486,469,466,469,468,482,471,469,469,470,552,,,,,,,,,,,,,,,,,,,,,,,,,,,,,,,,,,,,,,,,
498,512,560,543,531,525,495,529,500,503,496,497,514,500,498,498,495,502,,,,,,,,,,,,,,,,,,,,,,,,,,,,,,,,,,,,,,,,
507,504,501,510,513,507,514,526,507,500,507,514,516,514,502,503,503,516,,,,,,,,,,,,,,,,,,,,,,,,,,,,,,,,,,,,,,,,
500,500,499,515,511,505,515,525,500,503,507,516,511,517,508,497,501,520,,,,,,,,,,,,,,,,,,,,,,,,,,,,,,,,,,,,,,,,
487,488,488,496,491,489,497,487,488,487,489,498,488,496,495,487,488,495,,,,,,,,,,,,,,,,,,,,,,,,,,,,,,,,,,,,,,,,
490,494,490,492,492,488,492,489,491,489,489,492,491,501,494,495,494,489,,,,,,,,,,,,,,,,,,,,,,,,,,,,,,,,,,,,,,,,
491,495,493,495,495,493,499,495,493,491,494,494,493,502,499,494,493,505,,,,,,,,,,,,,,,,,,,,,,,,,,,,,,,,,,,,,,,,
492,490,488,492,493,488,499,491,489,492,489,492,490,495,491,493,490,495,,,,,,,,,,,,,,,,,,,,,,,,,,,,,,,,,,,,,,,,
497,491,490,491,489,491,501,496,486,491,486,493,493,496,516,489,520,496,,,,,,,,,,,,,,,,,,,,,,,,,,,,,,,,,,,,,,,,
495,494,495,493,497,494,497,493,493,489,494,493,495,500,465,496,462,491,,,,,,,,,,,,,,,,,,,,,,,,,,,,,,,,,,,,,,,,
493,488,490,495,497,492,496,497,488,490,491,498,498,503,491,486,488,498,,,,,,,,,,,,,,,,,,,,,,,,,,,,,,,,,,,,,,,,
500,498,496,499,504,505,514,506,497,497,500,504,503,506,502,497,497,500,,,,,,,,,,,,,,,,,,,,,,,,,,,,,,,,,,,,,,,,
492,490,490,498,500,500,507,506,493,507,498,505,500,501,514,490,512,505,,,,,,,,,,,,,,,,,,,,,,,,,,,,,,,,,,,,,,,,
496,492,493,493,498,501,497,493,500,483,493,488,496,495,484,493,480,497,,,,,,,,,,,,,,,,,,,,,,,,,,,,,,,,,,,,,,,,
495,495,497,495,498,503,500,496,495,495,493,496,498,498,502,495,490,495,,,,,,,,,,,,,,,,,,,,,,,,,,,,,,,,,,,,,,,,
499,497,493,496,493,500,500,493,490,491,490,498,493,495,499,495,499,503,,,,,,,,,,,,,,,,,,,,,,,,,,,,,,,,,,,,,,,,
502,505,501,501,500,503,501,507,503,502,500,499,501,510,495,503,507,509,,,,,,,,,,,,,,,,,,,,,,,,,,,,,,,,,,,,,,,,
507,502,496,494,497,496,498,504,502,500,496,497,499,502,502,500,504,528,,,,,,,,,,,,,,,,,,,,,,,,,,,,,,,,,,,,,,,,
484,484,484,486,486,482,484,491,491,490,485,485,485,489,492,495,497,596,,,,,,,,,,,,,,,,,,,,,,,,,,,,,,,,,,,,,,,,
578,515,512,512,504,511,502,495,491,485,487,480,479,460,453,430,409,238,,,,,,,,,,,,,,,,,,,,,,,,,,,,,,,,,,,,,,,,
504,507,511,507,511,519,512,510,510,511,509,512,511,515,518,513,508,510,,,,,,,,,,,,,,,,,,,,,,,,,,,,,,,,,,,,,,,,
488,493,498,492,489,495,514,493,490,490,492,493,491,493,501,492,495,491,,,,,,,,,,,,,,,,,,,,,,,,,,,,,,,,,,,,,,,,
496,495,498,497,495,500,517,497,497,497,494,501,500,495,498,496,498,496,,,,,,,,,,,,,,,,,,,,,,,,,,,,,,,,,,,,,,,,
490,489,492,496,490,495,491,494,494,495,490,490,509,491,493,491,494,492,,,,,,,,,,,,,,,,,,,,,,,,,,,,,,,,,,,,,,,,
490,493,488,497,493,497,508,506,498,497,495,497,507,500,496,491,496,495,,,,,,,,,,,,,,,,,,,,,,,,,,,,,,,,,,,,,,,,
500,497,497,505,507,512,520,521,500,503,505,508,520,507,509,498,503,505,,,,,,,,,,,,,,,,,,,,,,,,,,,,,,,,,,,,,,,,
496,499,495,498,500,504,503,509,515,505,497,498,501,498,503,496,499,499,,,,,,,,,,,,,,,,,,,,,,,,,,,,,,,,,,,,,,,,
492,493,494,500,496,496,497,499,496,496,494,492,494,494,493,490,492,495,,,,,,,,,,,,,,,,,,,,,,,,,,,,,,,,,,,,,,,,
489,485,488,501,492,493,503,492,494,491,487,494,491,500,487,488,491,487,,,,,,,,,,,,,,,,,,,,,,,,,,,,,,,,,,,,,,,,
493,496,498,495,494,502,518,490,505,500,494,504,491,506,493,493,497,494,,,,,,,,,,,,,,,,,,,,,,,,,,,,,,,,,,,,,,,,
488,491,491,496,493,489,489,486,487,487,487,489,486,486,488,489,484,486,,,,,,,,,,,,,,,,,,,,,,,,,,,,,,,,,,,,,,,,
494,492,494,509,497,493,494,493,494,492,492,493,490,490,491,489,490,493,,,,,,,,,,,,,,,,,,,,,,,,,,,,,,,,,,,,,,,,
510,507,505,507,505,505,513,504,506,501,500,508,502,507,507,498,494,507,,,,,,,,,,,,,,,,,,,,,,,,,,,,,,,,,,,,,,,,
524,493,534,499,495,523,512,522,490,489,493,503,501,511,508,490,486,504,,,,,,,,,,,,,,,,,,,,,,,,,,,,,,,,,,,,,,,,
499,510,474,512,510,490,515,535,500,502,506,514,512,528,516,502,501,509,,,,,,,,,,,,,,,,,,,,,,,,,,,,,,,,,,,,,,,,
511,510,506,502,509,508,503,503,498,504,501,500,525,508,501,500,499,499,,,,,,,,,,,,,,,,,,,,,,,,,,,,,,,,,,,,,,,,
422,477,530,509,533,558,505,516,509,514,509,507,552,505,507,507,457,398,,,,,,,,,,,,,,,,,,,,,,,,,,,,,,,,,,,,,,,,
2000,491,505,506,500,448,495,478,501,488,485,488,473,479,486,479,441,2000,,,,,,,,,,,,,,,,,,,,,,,,,,,,,,,,,,,,,,,,
#,raw_row_delta_min,,,,,,,,,,,,,,,,,,,,,,,,,,,,,,,,,,,,,,,,,,,,,,,,,,,,,,,,
-2000,-203,-3000,-3000,-3000,-3000,-493,-453,-456,-454,-454,-456,-454,-451,-462,-462,-384,-2000,,,,,,,,,,,,,,,,,,,,,,,,,,,,,,,,,,,,,,,,
-458,-298,-3000,-3000,-3000,-3000,-482,-538,-511,-511,-510,-508,-528,-515,-508,-508,-508,-435,,,,,,,,,,,,,,,,,,,,,,,,,,,,,,,,,,,,,,,,
-497,-480,-431,-453,-482,-486,-497,-518,-496,-487,-492,-491,-505,-494,-492,-494,-492,-500,,,,,,,,,,,,,,,,,,,,,,,,,,,,,,,,,,,,,,,,
-486,-486,-481,-496,-498,-494,-498,-517,-487,-494,-490,-499,-500,-500,-486,-483,-485,-509,,,,,,,,,,,,,,,,,,,,,,,,,,,,,,,,,,,,,,,,
-491,-494,-493,-506,-502,-496,-509,-510,-495,-493,-496,-508,-501,-508,-501,-493,-494,-512,,,,,,,,,,,,,,,,,,,,,,,,,,,,,,,,,,,,,,,,
-491,-489,-488,-494,-493,-490,-497,-490,-489,-489,-493,-500,-491,-494,-494,-487,-489,-505,,,,,,,,,,,,,,,,,,,,,,,,,,,,,,,,,,,,,,,,
-494,-494,-492,-492,-494,-489,-492,-491,-493,-491,-492,-493,-493,-503,-501,-495,-495,-500,,,,,,,,,,,,,,,,,,,,,,,,,,,,,,,,,,,,,,,,
-491,-492,-490,-496,-492,-491,-496,-492,-492,-490,-490,-492,-491,-503,-496,-494,-494,-499,,,,,,,,,,,,,,,,,,,,,,,,,,,,,,,,,,,,,,,,
-489,-488,-488,-490,-489,-485,-501,-487,-488,-489,-488,-496,-488,-491,-490,-492,-489,-504,,,,,,,,,,,,,,,,,,,,,,,,,,,,,,,,,,,,,,,,
-496,-490,-487,-489,-489,-489,-496,-499,-484,-481,-485,-489,-495,-494,-462,-488,-456,-490,,,,,,,,,,,,,,,,,,,,,,,,,,,,,,,,,,,,,,,,
-476,-472,-474,-473,-476,-474,-475,-471,-470,-480,-475,-473,-473,-475,-497,-474,-502,-483,,,,,,,,,,,,,,,,,,,,,,,,,,,,,,,,,,,,,,,,
-491,-485,-487,-490,-490,-486,-491,-489,-484,-485,-486,-493,-493,-498,-486,-483,-484,-497,,,,,,,,,,,,,,,,,,,,,,,,,,,,,,,,,,,,,,,,
-490,-485,-484,-490,-494,-496,-505,-500,-487,-487,-491,-493,-495,-498,-494,-484,-483,-492,,,,,,,,,,,,,,,,,,,,,,,,,,,,,,,,,,,,,,,,
-490,-488,-488,-492,-495,-495,-501,-500,-494,-476,-494,-493,-496,-495,-479,-488,-467,-492,,,,,,,,,,,,,,,,,,,,,,,,,,,,,,,,,,,,,,,,
-484,-483,-485,-486,-491,-493,-486,-486,-488,-501,-484,-489,-488,-484,-507,-481,-495,-485,,,,,,,,,,,,,,,,,,,,,,,,,,,,,,,,,,,,,,,,
-482,-482,-485,-481,-484,-490,-491,-483,-484,-486,-481,-487,-485,-481,-485,-480,-486,-482,,,,,,,,,,,,,,,,,,,,,,,,,,,,,,,,,,,,,,,,
-497,-495,-492,-497,-490,-497,-498,-492,-490,-489,-491,-497,-492,-497,-486,-490,-486,-486,,,,,,,,,,,,,,,,,,,,,,,,,,,,,,,,,,,,,,,,
-488,-489,-484,-485,-485,-487,-484,-488,-487,-485,-484,-482,-487,-488,-487,-483,-480,-473,,,,,,,,,,,,,,,,,,,,,,,,,,,,,,,,,,,,,,,,
-493,-489,-486,-486,-487,-486,-489,-499,-491,-491,-488,-490,-490,-490,-488,-481,-476,-455,,,,,,,,,,,,,,,,,,,,,,,,,,,,,,,,,,,,,,,,
-491,-492,-491,-492,-492,-488,-490,-495,-496,-495,-492,-491,-491,-489,-484,-477,-476,-382,,,,,,,,,,,,,,,,,,,,,,,,,,,,,,,,,,,,,,,,
-408,-455,-463,-470,-471,-481,-480,-481,-487,-486,-487,-494,-504,-525,-529,-537,-559,-746,,,,,,,,,,,,,,,,,,,,,,,,,,,,,,,,,,,,,,,,
-470,-459,-461,-461,-459,-469,-462,-458,-458,-458,-458,-458,-458,-461,-467,-457,-456,-458,,,,,,,,,,,,,,,,,,,,,,,,,,,,,,,,,,,,,,,,
-486,-478,-484,-479,-477,-481,-499,-477,-478,-479,-478,-480,-478,-479,-484,-480,-479,-480,,,,,,,,,,,,,,,,,,,,,,,,,,,,,,,,,,,,,,,,
-478,-480,-488,-485,-479,-485,-500,-484,-481,-481,-481,-481,-486,-481,-483,-480,-483,-480,,,,,,,,,,,,,,,,,,,,,,,,,,,,,,,,,,,,,,,,
-492,-482,-482,-487,-483,-485,-485,-486,-486,-486,-482,-484,-498,-483,-485,-483,-487,-485,,,,,,,,,,,,,,,,,,,,,,,,,,,,,,,,,,,,,,,,
-492,-485,-485,-493,-490,-492,-505,-504,-492,-493,-492,-491,-506,-498,-494,-485,-489,-492,,,,,,,,,,,,,,,,,,,,,,,,,,,,,,,,,,,,,,,,
-487,-486,-485,-492,-492,-495,-503,-502,-492,-491,-490,-495,-502,-492,-492,-486,-489,-491,,,,,,,,,,,,,,,,,,,,,,,,,,,,,,,,,,,,,,,,
-498,-493,-491,-496,-496,-502,-503,-508,-502,-497,-493,-494,-500,-496,-501,-491,-494,-496,,,,,,,,,,,,,,,,,,,,,,,,,,,,,,,,,,,,,,,,
-487,-481,-484,-486,-484,-482,-482,-488,-489,-485,-482,-479,-482,-482,-482,-480,-483,-483,,,,,,,,,,,,,,,,,,,,,,,,,,,,,,,,,,,,,,,,
-492,-490,-492,-506,-495,-503,-516,-494,-502,-498,-492,-504,-495,-511,-493,-492,-501,-493,,,,,,,,,,,,,,,,,,,,,,,,,,,,,,,,,,,,,,,,
-481,-480,-482,-483,-483,-486,-496,-481,-488,-486,-482,-486,-482,-492,-482,-484,-482,-482,,,,,,,,,,,,,,,,,,,,,,,,,,,,,,,,,,,,,,,,
-476,-477,-483,-489,-483,-478,-479,-477,-477,-478,-477,-477,-479,-477,-478,-479,-475,-477,,,,,,,,,,,,,,,,,,,,,,,,,,,,,,,,,,,,,,,,
-480,-484,-483,-497,-487,-485,-489,-484,-485,-485,-485,-489,-483,-482,-485,-483,-484,-483,,,,,,,,,,,,,,,,,,,,,,,,,,,,,,,,,,,,,,,,
-489,-482,-485,-491,-487,-491,-498,-485,-492,-486,-486,-494,-486,-492,-492,-483,-479,-492,,,,,,,,,,,,,,,,,,,,,,,,,,,,,,,,,,,,,,,,
-471,-486,-454,-499,-494,-475,-511,-529,-488,-490,-496,-504,-506,-517,-514,-490,-489,-510,,,,,,,,,,,,,,,,,,,,,,,,,,,,,,,,,,,,,,,,
-503,-475,-521,-485,-485,-509,-490,-509,-481,-483,-484,-491,-492,-504,-493,-486,-481,-490,,,,,,,,,,,,,,,,,,,,,,,,,,,,,,,,,,,,,,,,
-493,-482,-485,-491,-508,-490,-496,-497,-490,-499,-496,-494,-529,-502,-499,-493,-492,-519,,,,,,,,,,,,,,,,,,,,,,,,,,,,,,,,,,,,,,,,
-585,-514,-466,-481,-501,-441,-487,-474,-495,-494,-489,-492,-522,-490,-487,-490,-535,-632,,,,,,,,,,,,,,,,,,,,,,,,,,,,,,,,,,,,,,,,
-2000,-504,-479,-479,-489,-547,-494,-510,-511,-505,-506,-515,-516,-509,-503,-510,-547,-2000,,,,,,,,,,,,,,,,,,,,,,,,,,,,,,,,,,,,,,,,
#,raw_col_delta_max,,,,,,,,,,,,,,,,,,,,,,,,,,,,,,,,,,,,,,,,,,,,,,,,,,,,,,,,
2000,390,491,617,253,931,427,436,436,437,436,442,432,445,436,369,2000,,,,,,,,,,,,,,,,,,,,,,,,,,,,,,,,,,,,,,,,,
307,3000,3000,3000,3000,3000,471,434,437,437,435,448,433,439,433,440,447,,,,,,,,,,,,,,,,,,,,,,,,,,,,,,,,,,,,,,,,,
454,422,456,407,418,522,467,487,442,442,436,454,455,441,432,437,525,,,,,,,,,,,,,,,,,,,,,,,,,,,,,,,,,,,,,,,,,
468,471,439,378,404,484,453,444,442,433,439,447,436,442,435,438,533,,,,,,,,,,,,,,,,,,,,,,,,,,,,,,,,,,,,,,,,,
459,474,448,403,413,492,493,495,437,440,459,478,473,451,439,441,536,,,,,,,,,,,,,,,,,,,,,,,,,,,,,,,,,,,,,,,,,
459,472,439,382,403,488,453,436,440,444,453,452,435,441,440,438,528,,,,,,,,,,,,,,,,,,,,,,,,,,,,,,,,,,,,,,,,,
457,471,432,372,403,479,439,435,434,436,434,437,439,440,438,436,515,,,,,,,,,,,,,,,,,,,,,,,,,,,,,,,,,,,,,,,,,
459,466,437,376,400,481,434,433,433,436,436,440,444,449,448,441,510,,,,,,,,,,,,,,,,,,,,,,,,,,,,,,,,,,,,,,,,,
458,470,434,370,403,486,444,437,432,437,435,440,435,437,443,441,526,,,,,,,,,,,,,,,,,,,,,,,,,,,,,,,,,,,,,,,,,
462,471,437,378,407,507,469,437,435,438,436,454,436,439,443,440,507,,,,,,,,,,,,,,,,,,,,,,,,,,,,,,,,,,,,,,,,,
459,469,446,390,411,486,457,451,441,433,445,459,459,470,411,471,488,,,,,,,,,,,,,,,,,,,,,,,,,,,,,,,,,,,,,,,,,
461,468,446,398,413,486,457,453,438,436,457,477,483,445,434,438,514,,,,,,,,,,,,,,,,,,,,,,,,,,,,,,,,,,,,,,,,,
461,466,433,375,401,481,443,435,436,436,434,443,441,434,439,439,509,,,,,,,,,,,,,,,,,,,,,,,,,,,,,,,,,,,,,,,,,
464,468,439,388,403,501,478,468,434,433,450,467,464,434,444,436,513,,,,,,,,,,,,,,,,,,,,,,,,,,,,,,,,,,,,,,,,,
463,468,435,372,399,479,440,439,456,422,442,438,440,447,420,461,484,,,,,,,,,,,,,,,,,,,,,,,,,,,,,,,,,,,,,,,,,
464,464,432,381,403,488,435,439,441,441,433,442,449,436,450,446,491,,,,,,,,,,,,,,,,,,,,,,,,,,,,,,,,,,,,,,,,,
468,470,435,373,404,480,446,432,429,433,445,462,447,429,440,443,509,,,,,,,,,,,,,,,,,,,,,,,,,,,,,,,,,,,,,,,,,
479,477,433,383,402,476,433,432,431,431,433,443,451,450,434,452,499,,,,,,,,,,,,,,,,,,,,,,,,,,,,,,,,,,,,,,,,,
465,465,435,374,403,477,436,434,441,434,434,437,453,436,440,446,499,,,,,,,,,,,,,,,,,,,,,,,,,,,,,,,,,,,,,,,,,
470,468,439,383,408,488,471,475,446,438,441,452,459,433,442,451,528,,,,,,,,,,,,,,,,,,,,,,,,,,,,,,,,,,,,,,,,,
470,466,438,382,404,483,447,441,439,439,442,452,465,436,450,453,625,,,,,,,,,,,,,,,,,,,,,,,,,,,,,,,,,,,,,,,,,
410,461,429,370,418,491,430,432,433,433,423,432,430,430,434,432,441,,,,,,,,,,,,,,,,,,,,,,,,,,,,,,,,,,,,,,,,,
416,463,434,378,399,472,431,428,428,429,426,431,428,435,444,431,440,,,,,,,,,,,,,,,,,,,,,,,,,,,,,,,,,,,,,,,,,
422,473,441,375,403,506,463,429,426,433,434,447,442,435,431,430,442,,,,,,,,,,,,,,,,,,,,,,,,,,,,,,,,,,,,,,,,,
422,463,437,389,401,477,431,433,427,432,431,450,452,430,429,432,440,,,,,,,,,,,,,,,,,,,,,,,,,,,,,,,,,,,,,,,,,
430,462,433,378,402,476,439,435,428,432,434,437,431,431,432,430,440,,,,,,,,,,,,,,,,,,,,,,,,,,,,,,,,,,,,,,,,,
431,456,435,391,408,489,481,472,433,429,447,468,468,433,442,430,445,,,,,,,,,,,,,,,,,,,,,,,,,,,,,,,,,,,,,,,,,
431,457,427,378,415,492,445,430,432,434,433,437,431,430,435,436,443,,,,,,,,,,,,,,,,,,,,,,,,,,,,,,,,,,,,,,,,,
431,456,432,387,409,493,471,473,437,432,438,451,449,431,439,435,443,,,,,,,,,,,,,,,,,,,,,,,,,,,,,,,,,,,,,,,,,
439,458,440,391,413,483,446,435,433,431,438,440,446,431,435,433,439,,,,,,,,,,,,,,,,,,,,,,,,,,,,,,,,,,,,,,,,,
440,459,438,389,408,487,471,438,433,434,449,464,449,455,439,442,451,,,,,,,,,,,,,,,,,,,,,,,,,,,,,,,,,,,,,,,,,
436,459,432,380,406,478,433,435,429,432,435,432,430,430,434,433,439,,,,,,,,,,,,,,,,,,,,,,,,,,,,,,,,,,,,,,,,,
437,455,451,402,404,473,430,432,429,430,437,432,430,430,435,432,441,,,,,,,,,,,,,,,,,,,,,,,,,,,,,,,,,,,,,,,,,
444,462,427,378,405,478,436,436,432,432,430,429,431,431,436,433,443,,,,,,,,,,,,,,,,,,,,,,,,,,,,,,,,,,,,,,,,,
445,460,435,387,405,487,455,436,440,433,441,445,440,440,439,433,453,,,,,,,,,,,,,,,,,,,,,,,,,,,,,,,,,,,,,,,,,
421,493,397,396,428,469,488,488,438,439,452,453,458,444,451,438,452,,,,,,,,,,,,,,,,,,,,,,,,,,,,,,,,,,,,,,,,,
444,449,433,387,410,477,436,434,432,434,439,434,443,457,448,439,443,,,,,,,,,,,,,,,,,,,,,,,,,,,,,,,,,,,,,,,,,
457,445,421,404,447,474,438,441,441,434,444,478,510,449,435,439,453,,,,,,,,,,,,,,,,,,,,,,,,,,,,,,,,,,,,,,,,,
516,498,403,377,463,431,445,437,445,436,438,446,431,433,435,390,361,,,,,,,,,,,,,,,,,,,,,,,,,,,,,,,,,,,,,,,,,
2000,527,401,369,401,469,430,435,431,434,434,429,435,440,429,356,2000,,,,,,,,,,,,,,,,,,,,,,,,,,,,,,,,,,,,,,,,,
#,raw_col_delta_min,,,,,,,,,,,,,,,,,,,,,,,,,,,,,,,,,,,,,,,,,,,,,,,,,,,,,,,,
-2000,-462,-358,-243,-608,-1,-449,-436,-436,-432,-434,-431,-435,-424,-436,-513,-2000,,,,,,,,,,,,,,,,,,,,,,,,,,,,,,,,,,,,,,,,,
-610,-3000,-3000,-3000,-3000,-3000,-412,-436,-434,-432,-432,-435,-434,-436,-433,-430,-430,,,,,,,,,,,,,,,,,,,,,,,,,,,,,,,,,,,,,,,,,
-435,-445,-413,-486,-469,-389,-474,-480,-442,-433,-432,-446,-454,-434,-431,-426,-353,,,,,,,,,,,,,,,,,,,,,,,,,,,,,,,,,,,,,,,,,
-417,-398,-434,-500,-465,-392,-445,-444,-430,-436,-433,-437,-437,-435,-436,-428,-362,,,,,,,,,,,,,,,,,,,,,,,,,,,,,,,,,,,,,,,,,
-411,-398,-450,-523,-476,-397,-493,-484,-439,-432,-455,-468,-477,-441,-437,-433,-376,,,,,,,,,,,,,,,,,,,,,,,,,,,,,,,,,,,,,,,,,
-414,-395,-439,-502,-467,-395,-444,-434,-437,-435,-452,-440,-439,-433,-441,-428,-366,,,,,,,,,,,,,,,,,,,,,,,,,,,,,,,,,,,,,,,,,
-410,-394,-430,-496,-465,-385,-432,-431,-432,-430,-431,-427,-438,-432,-439,-427,-362,,,,,,,,,,,,,,,,,,,,,,,,,,,,,,,,,,,,,,,,,
-409,-391,-432,-502,-462,-387,-429,-429,-431,-431,-431,-430,-443,-447,-443,-432,-367,,,,,,,,,,,,,,,,,,,,,,,,,,,,,,,,,,,,,,,,,
-404,-396,-432,-493,-464,-391,-438,-435,-430,-429,-432,-430,-437,-432,-440,-433,-377,,,,,,,,,,,,,,,,,,,,,,,,,,,,,,,,,,,,,,,,,
-410,-399,-434,-499,-468,-418,-458,-438,-431,-433,-438,-439,-436,-436,-440,-431,-369,,,,,,,,,,,,,,,,,,,,,,,,,,,,,,,,,,,,,,,,,
-408,-395,-444,-512,-470,-394,-453,-447,-428,-437,-444,-451,-454,-415,-461,-400,-407,,,,,,,,,,,,,,,,,,,,,,,,,,,,,,,,,,,,,,,,,
-407,-395,-445,-519,-474,-391,-454,-447,-439,-430,-454,-467,-476,-448,-431,-429,-386,,,,,,,,,,,,,,,,,,,,,,,,,,,,,,,,,,,,,,,,,
-406,-394,-429,-495,-463,-388,-437,-433,-435,-430,-432,-433,-433,-436,-437,-429,-384,,,,,,,,,,,,,,,,,,,,,,,,,,,,,,,,,,,,,,,,,
-406,-396,-439,-507,-466,-407,-474,-462,-433,-429,-445,-461,-456,-437,-437,-426,-394,,,,,,,,,,,,,,,,,,,,,,,,,,,,,,,,,,,,,,,,,
-405,-397,-431,-491,-462,-385,-435,-439,-424,-445,-430,-440,-430,-420,-446,-408,-397,,,,,,,,,,,,,,,,,,,,,,,,,,,,,,,,,,,,,,,,,
-407,-394,-430,-499,-465,-392,-434,-436,-438,-437,-431,-434,-436,-443,-440,-420,-377,,,,,,,,,,,,,,,,,,,,,,,,,,,,,,,,,,,,,,,,,
-411,-401,-432,-491,-467,-388,-441,-430,-429,-426,-446,-451,-431,-435,-432,-429,-385,,,,,,,,,,,,,,,,,,,,,,,,,,,,,,,,,,,,,,,,,
-422,-410,-431,-498,-463,-385,-430,-430,-429,-427,-433,-432,-437,-440,-434,-429,-372,,,,,,,,,,,,,,,,,,,,,,,,,,,,,,,,,,,,,,,,,
-406,-398,-433,-490,-463,-385,-431,-436,-438,-431,-432,-429,-431,-441,-428,-416,-364,,,,,,,,,,,,,,,,,,,,,,,,,,,,,,,,,,,,,,,,,
-412,-403,-438,-498,-468,-398,-469,-470,-444,-435,-441,-442,-434,-436,-425,-412,-348,,,,,,,,,,,,,,,,,,,,,,,,,,,,,,,,,,,,,,,,,
-413,-399,-437,-497,-464,-392,-443,-438,-439,-438,-441,-443,-434,-432,-423,-411,-253,,,,,,,,,,,,,,,,,,,,,,,,,,,,,,,,,,,,,,,,,
-464,-405,-435,-492,-481,-408,-434,-438,-438,-431,-436,-432,-438,-437,-437,-433,-426,,,,,,,,,,,,,,,,,,,,,,,,,,,,,,,,,,,,,,,,,
-457,-405,-443,-494,-465,-389,-434,-434,-431,-430,-436,-432,-436,-445,-443,-435,-426,,,,,,,,,,,,,,,,,,,,,,,,,,,,,,,,,,,,,,,,,
-450,-417,-451,-492,-467,-422,-465,-438,-431,-430,-446,-448,-450,-442,-434,-431,-432,,,,,,,,,,,,,,,,,,,,,,,,,,,,,,,,,,,,,,,,,
-453,-411,-445,-502,-465,-391,-438,-438,-433,-432,-437,-458,-459,-437,-432,-433,-430,,,,,,,,,,,,,,,,,,,,,,,,,,,,,,,,,,,,,,,,,
-451,-407,-441,-493,-464,-395,-443,-441,-433,-433,-441,-440,-440,-437,-434,-432,-430,,,,,,,,,,,,,,,,,,,,,,,,,,,,,,,,,,,,,,,,,
-443,-406,-443,-507,-469,-409,-487,-473,-440,-431,-451,-476,-475,-439,-440,-431,-439,,,,,,,,,,,,,,,,,,,,,,,,,,,,,,,,,,,,,,,,,
-444,-406,-435,-492,-474,-412,-450,-441,-435,-433,-439,-440,-441,-436,-439,-435,-437,,,,,,,,,,,,,,,,,,,,,,,,,,,,,,,,,,,,,,,,,
-437,-406,-442,-499,-469,-415,-475,-472,-445,-437,-443,-457,-457,-437,-440,-433,-439,,,,,,,,,,,,,,,,,,,,,,,,,,,,,,,,,,,,,,,,,
-438,-410,-447,-505,-472,-402,-453,-439,-437,-435,-442,-448,-454,-439,-436,-432,-432,,,,,,,,,,,,,,,,,,,,,,,,,,,,,,,,,,,,,,,,,
-440,-410,-446,-501,-474,-410,-465,-448,-436,-437,-458,-464,-464,-457,-439,-447,-439,,,,,,,,,,,,,,,,,,,,,,,,,,,,,,,,,,,,,,,,,
-432,-410,-443,-493,-467,-395,-439,-439,-433,-436,-438,-441,-441,-435,-436,-432,-431,,,,,,,,,,,,,,,,,,,,,,,,,,,,,,,,,,,,,,,,,
-431,-413,-463,-512,-464,-391,-436,-434,-435,-433,-438,-446,-439,-434,-438,-432,-432,,,,,,,,,,,,,,,,,,,,,,,,,,,,,,,,,,,,,,,,,
-443,-417,-440,-489,-468,-399,-439,-440,-440,-435,-434,-439,-439,-437,-438,-433,-431,,,,,,,,,,,,,,,,,,,,,,,,,,,,,,,,,,,,,,,,,
-440,-420,-452,-497,-471,-408,-454,-444,-447,-438,-447,-453,-450,-446,-440,-433,-442,,,,,,,,,,,,,,,,,,,,,,,,,,,,,,,,,,,,,,,,,
-462,-381,-493,-506,-448,-435,-495,-487,-447,-445,-455,-465,-469,-450,-446,-442,-443,,,,,,,,,,,,,,,,,,,,,,,,,,,,,,,,,,,,,,,,,
-447,-418,-454,-499,-473,-398,-443,-441,-440,-438,-441,-449,-451,-463,-450,-439,-436,,,,,,,,,,,,,,,,,,,,,,,,,,,,,,,,,,,,,,,,,
-450,-421,-452,-526,-494,-407,-446,-445,-453,-438,-444,-503,-508,-460,-432,-439,-472,,,,,,,,,,,,,,,,,,,,,,,,,,,,,,,,,,,,,,,,,
-382,-373,-471,-495,-424,-463,-429,-469,-451,-441,-442,-456,-443,-438,-434,-485,-536,,,,,,,,,,,,,,,,,,,,,,,,,,,,,,,,,,,,,,,,,
-2000,-363,-469,-502,-472,-401,-446,-445,-444,-442,-445,-456,-434,-433,-442,-527,-2000,,,,,,,,,,,,,,,,,,,,,,,,,,,,,,,,,,,,,,,,,
#,line_max,,,,,,,,,,,,,,,,,,,,,,,,,,,,,,,,,,,,,,,,,,,,,,,,,,,,,,,,
44271,47351,43804,47342,45767,45635,45333,45253,45492,45562,45737,45641,45744,45756,45700,45947,43792,44816,44541,47924,41869,49807,41222,48879,45120,44179,44176,44103,44130,44234,44262,44648,44581,45118,45073,44733,45281,45701,45093,47454,47773,47584,47242,46850,46829,46764,46585,46475,47817,44051,47458,47419,44211,47442,47467,47524,46799,45240
#,line_min,,,,,,,,,,,,,,,,,,,,,,,,,,,,,,,,,,,,,,,,,,,,,,,,,,,,,,,,
15000,15000,15000,15000,15000,15000,15000,15000,15000,15000,15000,15000,15000,15000,15000,15000,15000,15000,15000,15000,15000,15000,15000,15000,15000,15000,15000,15000,15000,15000,15000,15000,15000,15000,15000,15000,15000,15000,15000,15000,15000,15000,15000,15000,15000,15000,15000,15000,15000,15000,15000,15000,15000,15000,15000,15000,15000,15000
