0 0 0 0 
0 0 0 0 
0 0 0 0 
0 0 0 0 
0 0 0 0 
0 0 0 0 
0 0 0 0 
0 0 0 0 
0 0 0 0 
0 0 0 0 
0.0189766194671392 0.000769027101341635 0.000460004288470373 2.36075466091279e-05 
0.023642847314477 0.000928169407416135 0.000541847432032228 1.89427082659677e-05 
0.0286113861948252 0.00104213273152709 0.000568914751056582 1.12054613055079e-05 
0.0350907631218433 0.00111722096335143 0.000534026883542538 5.72399903830956e-06 
0.0444866046309471 0.00111615273635834 0.000377282383851707 8.1494334835952e-07 
0.0557208396494389 0.0010545066324994 0.000145990998134948 -3.64707580047252e-06 
0.0673436000943184 0.000958954449743032 -0.00010747583291959 -6.0183251662238e-06 
0.0788877382874489 0.000846930837724358 -0.000344042317010462 -8.37252264318522e-06 
0.0891085788607597 0.000753833970520645 -0.000512019789312035 -1.13898513518507e-05 
0.0966876298189163 0.000694216636475176 -0.000564317917451262 -1.41717155202059e-05 
0.10250648856163 0.000656404416076839 -0.000544357637409121 -1.4329334590002e-05 
0.108080253005028 0.000612384232226759 -0.000495346263051033 -1.33584489958594e-05 
0.1133988276124 0.000560174055863172 -0.000433582696132362 -9.35230764298467e-06 
0.118494234979153 0.000498480105306953 -0.000364668463589624 -4.10488019042532e-06 
0.12329638749361 0.000430309999501333 -0.000298708910122514 2.53696134677739e-06 
0.128021508455276 0.000364374136552215 -0.000229627403314225 8.0212139437208e-06 
0.132645949721336 0.000309865165036172 -0.000167041842360049 1.23378968055476e-05 
0.13727942109108 0.000249730597715825 -0.000111497691250406 1.56615478772437e-05 
0.141723155975342 0.000197716944967397 -6.6844339016825e-05 1.76356043084525e-05 
0.146040841937065 0.000156282098032534 -2.64474874711595e-05 1.78342779690865e-05 
0.149956345558167 0.00011155827814946 2.30373711929133e-06 1.71904011949664e-05 
0.153307169675827 7.40849573048763e-05 3.08654161926825e-05 1.64749944815412e-05 
0.15619333088398 4.70341547043063e-05 5.53823228983674e-05 1.49176230479497e-05 
0.158637344837189 2.24934628931805e-05 7.30911488062702e-05 1.52016336869565e-05 
0.160703077912331 -6.87636384100188e-06 8.96392230060883e-05 1.57486356329173e-05 
0.162675455212593 -3.45145963365212e-05 0.000108064697997179 1.69698414538288e-05 
0.164725914597511 -6.83047619531862e-05 0.000123212026664987 1.75964451045729e-05 
0.166769027709961 -9.82830606517382e-05 0.00013797654537484 1.72832551470492e-05 
0.168738350272179 -0.000136829883558676 0.000146868638694286 1.69486847880762e-05 
0.170407816767693 -0.000166048863320611 0.00015297785284929 1.59317442012252e-05 
0.171421706676483 -0.000185726850759238 0.000159820221597329 1.44277591971331e-05 
0.171766385436058 -0.000202461233129725 0.00016413297271356 1.29799373098649e-05 
0.171439930796623 -0.000214171290281229 0.0001662641443545 1.11020208350965e-05 
0.170562013983727 -0.000217364489799365 0.000167633144883439 8.47543196869083e-06 
0.169194802641869 -0.000224646442802623 0.000173912747413851 4.3801164792967e-06 
0.167503327131271 -0.000231826605158858 0.000175399429281242 1.32509825334637e-07 
0.165433660149574 -0.000242780733969994 0.000172945205122232 -2.55548980021558e-06 
0.163006365299225 -0.000253164966125041 0.000163386968779378 -3.76309867533564e-06 
0.160297483205795 -0.000260884262388572 0.000157459042384289 -5.25009681950905e-06 
0.157332614064217 -0.000276296836091205 0.000144346384331584 -5.34406399310683e-06 
0.153931066393852 -0.000282288732705638 0.000130622662254609 -5.31953719473677e-06 
0.150191709399223 -0.000285025802440941 0.000117238545499276 -5.37514233656111e-06 
0.146115362644196 -0.000283094384940341 0.000100976976682432 -5.53052541363286e-06 
0.14112588763237 -0.000284318550257012 8.80209845490754e-05 -6.75393675919622e-06 
0.13572433590889 -0.000269540585577488 6.81488163536415e-05 -7.40083942218916e-06 
0.130088940262794 -0.000261103850789368 4.68583020847291e-05 -7.96091808297206e-06 
0.124160557985306 -0.000245543225901201 2.34106646530563e-05 -9.33330011321232e-06 
0.118125215172768 -0.00024041227879934 -4.75795928878142e-07 -1.11321105578099e-05 
0.112368501722813 -0.000234478022321127 -2.51223355007824e-05 -1.11497865873389e-05 
0.106590233743191 -0.000234434046433307 -4.72890351375099e-05 -1.13822761704796e-05 
0.100746966898441 -0.000237216328969225 -6.82480458635837e-05 -1.15214761535753e-05 
0.0949265286326408 -0.000238648601225577 -8.38512205518782e-05 -1.19272963274852e-05 
0.0889012888073921 -0.000233164071687497 -9.20100064831786e-05 -1.21356233648839e-05 
0.0828670039772987 -0.000227326265303418 -0.000103472506452817 -1.28760593725019e-05 
0.076669305562973 -0.000215331383515149 -0.000106801257061306 -1.32990689962753e-05 
0.0705240368843079 -0.00020063943520654 -0.000106107676401734 -1.36958960865741e-05 
0.0645206719636917 -0.000187577548786066 -0.000103305508673657 -1.39802396006417e-05 
0.0589200332760811 -0.000172189465956762 -9.77196978055872e-05 -1.42096159834182e-05 
0.0538296401500702 -0.000155603542225435 -8.90382725629024e-05 -1.43779689096846e-05 
0.0493752993643284 -0.000140560543513857 -8.34345919429325e-05 -1.41547552630072e-05 
0.0455497652292252 -0.000129038802697323 -7.91017228038982e-05 -1.41948185046203e-05 
0.0422502309083939 -0.000118421281513292 -7.86131495260634e-05 -1.36784756250563e-05 
0.0393901839852333 -0.000110146116639953 -7.72174171288498e-05 -1.3601636965177e-05 
0.0369014218449593 -0.000101575518783648 -7.4936579039786e-05 -1.34757174237166e-05 
0.0347082912921906 -9.51407564571127e-05 -7.24757555872202e-05 -1.35444224724779e-05 
0.0327970534563065 -8.55003600008786e-05 -7.18938608770259e-05 -1.34898264150252e-05 
0.0310984253883362 -7.65652002883144e-05 -6.80297816870734e-05 -1.4245087186282e-05 
0.0295848771929741 -6.91698078298941e-05 -6.58178250887431e-05 -1.40525044116657e-05 
0.028160635381937 -6.1063801695127e-05 -6.16659090155736e-05 -1.4473974260909e-05 
0.026818560436368 -5.22040609212127e-05 -5.66974522371311e-05 -1.52019701999961e-05 
0.0254718232899904 -4.43796561739873e-05 -4.9580597988097e-05 -1.61249918164685e-05 
0.0241939704865217 -3.72776703443378e-05 -4.37411799794063e-05 -1.69173363246955e-05 
0.0229387748986483 -2.86842132481979e-05 -3.88376065529883e-05 -1.79325670615071e-05 
0.021740110591054 -2.35076295211911e-05 -3.63302387995645e-05 -1.85515491466504e-05 
0.0205595307052135 -1.77507627086015e-05 -3.21825973514933e-05 -1.92875268112402e-05 
0.019439036026597 -1.37839915623772e-05 -2.98557297355728e-05 -1.94477379409363e-05 
0.0183546394109726 -8.70393432705896e-06 -2.83443641819758e-05 -1.92638999578776e-05 
0.0173408109694719 -4.91177070216509e-06 -2.58361469605006e-05 -1.94501535588643e-05 
0.0164300333708525 2.61204462503883e-07 -2.22682410822017e-05 -1.96652199520031e-05 
0.0156126646324992 4.8959282139549e-06 -1.9267210518592e-05 -1.95702577912016e-05 
0.0149542400613427 9.32896273297956e-06 -1.62466276378836e-05 -1.97016997844912e-05 
0.0143993757665157 1.22086612464045e-05 -1.21820266940631e-05 -1.98845755221555e-05 
0.0139448214322329 1.57279100676533e-05 -8.34721231512958e-06 -1.96585478988709e-05 
0.0135943898931146 1.81430950760841e-05 -5.09576602780726e-06 -1.9541348592611e-05 
0.0133616449311376 1.94062577065779e-05 -3.16315504278464e-06 -1.96052969840821e-05 
0.0131934825330973 2.14767915167613e-05 -1.07193159237795e-06 -1.95637658180203e-05 
0.0130891427397728 2.38495322264498e-05 1.21823120480258e-06 -1.96303935808828e-05 
0.0130917187780142 2.53125253948383e-05 2.30266073231178e-06 -2.00257018150296e-05 
0.0131612373515964 2.6682164389058e-05 3.21612810694205e-06 -2.04515945370076e-05 
0.0132983047515154 2.79741780104814e-05 3.8367033994291e-06 -2.08987676160177e-05 
0.0134634403511882 2.98778904834762e-05 4.37661628893693e-06 -2.14675510505913e-05 
0.0136947855353355 3.1380019208882e-05 4.03035255658324e-06 -2.21949085243978e-05 
0.0139094917103648 3.27470952470321e-05 5.14536122864229e-06 -2.29434990615118e-05 
0.0141076222062111 3.3862168493215e-05 6.37920402368763e-06 -2.36803971347399e-05 
0.0142509220167994 3.53793475369457e-05 8.3067970990669e-06 -2.41736979660345e-05 
0.0143331196159124 3.68682485714089e-05 1.03347620097338e-05 -2.45863448071759e-05 
0.0143533125519753 3.93769441870973e-05 1.09037646325305e-05 -2.47109874180751e-05 
0.0143385585397482 3.9947666664375e-05 1.16510354928323e-05 -2.47991301876027e-05 
0.0143136568367481 4.06024482799694e-05 1.0548171303526e-05 -2.48096184805036e-05 
0.0142566375434399 4.17402188759297e-05 1.07645510070142e-05 -2.48875476245303e-05 
0.0141868526116014 4.19072675867938e-05 1.05589670056361e-05 -2.46426188823534e-05 
0.0141292493790388 4.17073970311321e-05 1.12009138319991e-05 -2.4383876734646e-05 
0.0140946991741657 4.33049935963936e-05 1.00455836218316e-05 -2.41418911173241e-05 
0.0140428906306624 4.53912798548117e-05 9.87430030363612e-06 -2.36737596424064e-05 
0.0140474671497941 4.57570131402463e-05 7.4691620284284e-06 -2.31870944844559e-05 
0.0140889696776867 4.62339776277076e-05 4.78576566820266e-06 -2.30427667702315e-05 
0.0141164427623153 4.45340556325391e-05 1.14813167328975e-06 -2.25128478632541e-05 
0.0141208227723837 4.27554623456672e-05 -1.18861873943388e-06 -2.18785480683437e-05 
0.0141482800245285 4.02229234168772e-05 -5.16048839926952e-06 -2.13477051147493e-05 
0.0140921678394079 3.91686880902853e-05 -9.34921354200924e-06 -2.04148000193527e-05 
0.0140216629952192 3.80239798687398e-05 -1.34893753056531e-05 -1.91901090147439e-05 
0.0139211378991604 3.79900739062577e-05 -1.70496459759306e-05 -1.80202441697475e-05 
0.0137872351333499 3.74970732082147e-05 -2.18315744859865e-05 -1.64651501108892e-05 
0.0136311268433928 3.3706830436131e-05 -2.77903309324756e-05 -1.4546937563864e-05 
0.0134604098275304 2.92722361336928e-05 -3.27544512401801e-05 -1.27182838696172e-05 
0.0132369166240096 2.44177936110646e-05 -3.84257655241527e-05 -1.07723017208627e-05 
0.0130227264016867 1.96724795387127e-05 -4.47948295914102e-05 -8.72035161592066e-06 
0.0127784814685583 1.429852363799e-05 -5.34305108885746e-05 -6.54410541756079e-06 
0.012480559758842 1.16209894258645e-05 -6.05514433118515e-05 -3.99525197281037e-06 
0.0121711529791355 6.17017803961062e-06 -6.85311242705211e-05 -1.29857153297053e-06 
0.011832463555038 5.54898406335269e-07 -7.78734247433022e-05 1.46406637213659e-06 
0.0114505346864462 -7.28077930034488e-06 -8.92412499524653e-05 4.46926060249098e-06 
0.011090500280261 -1.46389356814325e-05 -0.00010043603106169 7.61681394578773e-06 
0.0106210000813007 -2.18900568142999e-05 -0.000111367407953367 1.06495062937029e-05 
0.0101771913468838 -2.86875347228488e-05 -0.000124199519632384 1.37676779559115e-05 
0.00975257530808449 -3.71009336959105e-05 -0.000138595249154605 1.70150051417295e-05 
0.00932885520160198 -4.56990674138069e-05 -0.000152761524077505 2.02603714569705e-05 
0.00885279662907124 -5.61804372409824e-05 -0.000167187507031485 2.33106329687871e-05 
0.00846085324883461 -6.66981504764408e-05 -0.000181966694071889 2.60536689893343e-05 
0.00803642068058252 -7.56933441152796e-05 -0.000195227097719908 2.84002071566647e-05 
0.00758844707161188 -8.40968496049754e-05 -0.000206902215722948 3.06610709230881e-05 
0.00712460651993752 -9.02253232197836e-05 -0.000216190703213215 3.20320723403711e-05 
0.00665886560454965 -9.4007991719991e-05 -0.000221197216887958 3.29409704136197e-05 
0.00616481713950634 -9.89865147857927e-05 -0.000223666298552416 3.33887728629634e-05 
0.00570707209408283 -0.000100892139016651 -0.000225772266276181 3.36333432642277e-05 
0.00520865386351943 -0.000100037475931458 -0.000222566202864982 3.29744580085389e-05 
0.00472970400005579 -9.84068683465011e-05 -0.00021662654762622 3.21033621730749e-05 
0.00424213521182537 -9.25909916986711e-05 -0.000208218596526422 3.0807397706667e-05 
0.00374298472888768 -8.28804695629515e-05 -0.000197461151401512 2.94378787657479e-05 
0.00312641751952469 -7.327528874157e-05 -0.000181355135282502 2.77530161838513e-05 
0.00255061499774456 -6.33122326689772e-05 -0.000162916490808129 2.60303531831596e-05 
0.00196996540762484 -4.97406654176302e-05 -0.00014205789193511 2.39259825320914e-05 
0.00139104085974395 -3.81153258786071e-05 -0.000119363983685616 2.19048979488434e-05 
0.000888866721652448 -2.66396818915382e-05 -9.80732584139332e-05 1.98606721824035e-05 
0.000472244748380035 -1.47939499584027e-05 -7.61226983740926e-05 1.78016543941339e-05 
0.000117362353194039 -3.7863403576921e-06 -5.7841774832923e-05 1.60085091920337e-05 
-0.00020636485714931 4.15853583035641e-06 -4.19030075136106e-05 1.46747070175479e-05 
-0.000402835488785058 1.01710866147187e-05 -3.14262179017533e-05 1.35764521473902e-05 
-0.000577795901335776 1.48078361235093e-05 -2.06753720704e-05 1.23523841466522e-05 
-0.000649995228741318 1.74747547134757e-05 -1.46553820741246e-05 1.11788031063043e-05 
-0.000706901424564421 2.03274375962792e-05 -9.36778906179825e-06 1.02164740383159e-05 
-0.000715781410690397 2.26855954679195e-05 -5.23353855896858e-06 9.22359595278976e-06 
-0.000710656400769949 2.32512429647613e-05 -1.89326874533435e-06 8.28396423457889e-06 
-0.000685938459355384 2.41816069319611e-05 -7.85904944677895e-07 7.5329767241783e-06 
-0.000690298969857395 2.38695392908994e-05 3.3569136803635e-07 7.0860101004655e-06 
-0.000661202589981258 2.26650226977654e-05 -4.72595928613373e-07 6.61064132145839e-06 
-0.00061065232148394 2.0781149942195e-05 -7.35790536054992e-07 6.2381918723986e-06 
-0.000590747746173292 2.02527717192424e-05 -3.64059019375418e-07 5.87618160352577e-06 
-0.000580972468014807 1.89485708688153e-05 6.91716365963657e-07 5.66839480597991e-06 
-0.000527659896761179 1.81095165316947e-05 1.97179019778559e-06 5.25008226759383e-06 
-0.000577141006942838 1.79059788933955e-05 3.54915414391144e-06 5.17911894348799e-06 
0 0 0 0 
0 0 0 0 
0 0 0 0 
0 0 0 0 
0 0 0 0 
0 0 0 0 
0 0 0 0 
0 0 0 0 
0 0 0 0 
0 0 0 0 
0 0 0 0 
0 0 0 0 
0 0 0 0 
0 0 0 0 
99.3969268798828 0.355789214372635 0.208651721477509 0.021847739815712 
