0 0 0 0 
0 0 0 0 
0 0 0 0 
0 0 0 0 
0 0 0 0 
0 0 0 0 
0 0 0 0 
0 0 0 0 
0 0 0 0 
0 0 0 0 
0.00160443934146315 -5.35312683496159e-05 -1.90429800568381e-05 -5.17530497745611e-06 
0.00168517476413399 -5.61951492272783e-05 -1.87885580089642e-05 -5.43732039659517e-06 
0.00172865646891296 -5.38855529157445e-05 -1.88581634574803e-05 -5.90658873989014e-06 
0.00179882312659174 -4.55592889920808e-05 -1.88446210813709e-05 -6.11754421697697e-06 
0.00192891771439463 -2.89859435724793e-05 -1.82900857907953e-05 -6.14204873272683e-06 
0.00211001699790359 -1.02479916677112e-05 -1.67927701113513e-05 -5.97440021010698e-06 
0.00231634359806776 9.30608075577766e-06 -1.45408848766237e-05 -5.39262191523449e-06 
0.00249239895492792 2.51219535130076e-05 -1.19140468086698e-05 -4.64029471913818e-06 
0.00261181290261447 3.38631070917472e-05 -9.17674242373323e-06 -3.95997494706535e-06 
0.00260388012975454 3.35098120558541e-05 -7.06651235304889e-06 -3.39414918926195e-06 
0.00249715498648584 3.07163390971255e-05 -5.89043247600785e-06 -2.88805313175544e-06 
0.00232994998805225 2.64146437984891e-05 -5.47672652828624e-06 -2.63714991888264e-06 
0.00217130547389388 2.31764352065511e-05 -5.2530695029418e-06 -2.34849244407087e-06 
0.00204910826869309 2.01607890630839e-05 -5.1899232857977e-06 -2.12737336369173e-06 
0.00200219196267426 1.86049946933053e-05 -4.99795942232595e-06 -1.90838954949868e-06 
0.00202166405506432 1.70195635291748e-05 -4.81812503494439e-06 -1.78551920271275e-06 
0.00211968994699419 1.5631754649803e-05 -4.4885091483593e-06 -1.69883355738421e-06 
0.00227781827561557 1.4528258361679e-05 -4.20429569203407e-06 -1.71722263075935e-06 
0.0024643384385854 1.33797711896477e-05 -3.87228647014126e-06 -1.71997021425341e-06 
0.00265560578554869 1.19041915240814e-05 -3.564652388377e-06 -1.78669961314881e-06 
0.00281950691714883 1.1161750080646e-05 -3.25095993503055e-06 -1.83713098067528e-06 
0.00292847724631429 1.03481570477015e-05 -3.15358033731172e-06 -1.88068543138797e-06 
0.00297022052109241 9.99459371087141e-06 -3.11601797875483e-06 -1.86123315870645e-06 
0.00293155107647181 1.06481311377138e-05 -3.4447266443749e-06 -1.84097189048771e-06 
0.00282552232965827 1.20410213639843e-05 -4.17057435697643e-06 -1.80691392870358e-06 
0.00272483238950372 1.32438408400049e-05 -4.70372015115572e-06 -1.77269100731792e-06 
0.00270167528651655 1.36477456180728e-05 -4.76967716167565e-06 -1.72719853708259e-06 
0.00280334637500346 1.31305005197646e-05 -4.43272574557341e-06 -1.79677306277881e-06 
0.00310106598772109 1.19716432891437e-05 -3.49098377228074e-06 -1.85544274700078e-06 
0.00368255120702088 1.08392114270828e-05 -1.97967005988176e-06 -1.94462404579099e-06 
0.0046254051849246 9.06620789464796e-06 -4.32794450944129e-07 -2.23995152737189e-06 
0.00607571192085743 8.58308521856088e-06 1.19773130791145e-06 -2.70112832367886e-06 
0.00824889447540045 8.5128131104284e-06 2.90691764348594e-06 -3.2701063901186e-06 
0.0114063136279583 8.47865885589272e-06 4.94886398882954e-06 -4.06293838750571e-06 
0.0157959517091513 5.47511353943264e-06 7.69070811657002e-06 -5.27542488271138e-06 
0.0215949025005102 1.42119529300544e-06 1.08641152110067e-05 -6.45836735202465e-06 
0.028801342472434 -2.90630805466208e-06 1.4478981938737e-05 -7.70158840168733e-06 
0.0371920429170132 -9.25396579987137e-06 1.79510898306035e-05 -8.83648954186356e-06 
0.0464330911636353 -1.74489996425109e-05 2.09929112315876e-05 -1.01025607364136e-05 
0.0560622252523899 -2.57215560850454e-05 2.433195913909e-05 -1.05191338661825e-05 
0.065489836037159 -3.84963495889679e-05 2.61570621660212e-05 -1.0629387361405e-05 
0.0743076354265213 -5.51439989067148e-05 2.6617093681125e-05 -1.05370336314081e-05 
0.0823061093688011 -6.88243890181184e-05 2.61825844063424e-05 -1.06634379335446e-05 
0.0894504562020302 -8.98731450433843e-05 2.53444195550401e-05 -1.06899851743947e-05 
0.095518060028553 -0.000111606364953332 2.28229928325163e-05 -1.11117878986988e-05 
0.100656345486641 -0.000127812760183588 2.15255440707551e-05 -1.18852822197368e-05 
0.104982323944569 -0.000138705232529901 2.05704654945293e-05 -1.21273360491614e-05 
0.108642943203449 -0.000144916572025977 2.05883206945146e-05 -1.23178315334371e-05 
0.111583478748798 -0.000138779723783955 2.08047567866743e-05 -1.16006922326051e-05 
0.11416370421648 -0.000128134342958219 2.26675238081953e-05 -1.04534201454953e-05 
0.116401664912701 -0.000113675079774112 2.49819677264895e-05 -8.72158670972567e-06 
0.118380784988403 -9.47301959968172e-05 2.65009875874966e-05 -7.41738267606706e-06 
0.120038203895092 -8.55381367728114e-05 2.75788406725042e-05 -5.83783048568876e-06 
0.121485769748688 -6.84182668919675e-05 2.90675197902601e-05 -4.14328360420768e-06 
0.122679367661476 -5.05137577420101e-05 2.94172696158057e-05 -2.74006993095099e-06 
0.123649634420872 -3.92248439311516e-05 2.88086757791461e-05 -1.36790970373113e-06 
0.124388724565506 -3.65594460163265e-05 2.88766768790083e-05 7.31231693862355e-07 
0.124942749738693 -3.18026432069018e-05 2.81079828710062e-05 2.69486531578877e-06 
0.125355318188667 -3.54555668309331e-05 2.66368551820051e-05 3.8217258406803e-06 
0.12573516368866 -3.51169801433571e-05 2.47983716690214e-05 5.22216305398615e-06 
0.126153290271759 -4.01574034185614e-05 2.41190573433414e-05 6.30964268566458e-06 
0.126639723777771 -3.43832289217971e-05 2.20702022488695e-05 6.73310978527297e-06 
0.127214297652245 -3.59517289325595e-05 2.16389071283629e-05 7.48179854781483e-06 
0.127824038267136 -3.84486374969129e-05 2.06355471163988e-05 7.94463721831562e-06 
0.128348514437675 -4.35425208706874e-05 1.8948614524561e-05 8.31786928756628e-06 
0.128812670707703 -4.27305130870081e-05 1.5421208445332e-05 8.12347843748285e-06 
0.129144415259361 -5.56204031454399e-05 1.35933951241896e-05 8.6166955952649e-06 
0.129354909062386 -5.68941832170822e-05 9.56917119765421e-06 8.91862418939127e-06 
0.129367992281914 -7.41795156500302e-05 5.45968941878527e-06 8.75253863341641e-06 
0.129344180226326 -9.79654578259215e-05 1.80211645783857e-06 7.79234414949315e-06 
0.129103019833565 -0.000120657059596851 -1.03228558145929e-06 7.17836519470438e-06 
0.128888115286827 -0.00013730491627939 -3.46129240824666e-06 6.30367730991566e-06 
0.12856724858284 -0.000159254064783454 -5.42129373570788e-06 4.88792966280016e-06 
0.128346383571625 -0.000157322632730938 -5.50933691556565e-06 4.14683927374426e-06 
0.127986297011375 -0.000157767237396911 -5.88170996707049e-06 3.82147891286877e-06 
0.127694562077522 -0.000149844476254657 -6.14045347901992e-06 4.33703144153696e-06 
0.127219274640083 -0.000137857947265729 -7.72704879636876e-06 4.22410175815457e-06 
0.126679584383965 -0.000127893406897783 -7.77330751589034e-06 4.81912002214813e-06 
0.125931188464165 -0.000131983673782088 -9.85865972324973e-06 5.27990323462291e-06 
0.125108003616333 -0.000135582042275928 -1.09827687992947e-05 5.98804763285443e-06 
0.124183997511864 -0.000142485543619841 -1.21320863399887e-05 5.93172535445774e-06 
0.123196341097355 -0.000158909009769559 -1.24866901387577e-05 5.60846183361718e-06 
0.122101567685604 -0.000166651181643829 -1.45909743878292e-05 5.13515988131985e-06 
0.120909370481968 -0.000173019754583947 -1.54082463268423e-05 4.53272696177009e-06 
0.119670175015926 -0.000169478546013124 -1.70907223946415e-05 4.10296888730954e-06 
0.118480898439884 -0.000167472491739318 -1.89635429705959e-05 3.87805948776077e-06 
0.117349743843079 -0.000162972515681759 -1.98682264453964e-05 4.04109368901118e-06 
0.116429917514324 -0.000154603636474349 -1.99674759642221e-05 4.46791364083765e-06 
0.115703292191029 -0.000144768448080868 -2.04215284611564e-05 5.08232506035711e-06 
0.115159101784229 -0.000130284199258313 -1.86885245057056e-05 4.98828285344644e-06 
0.114651821553707 -0.000122589059174061 -1.74810902535683e-05 4.86457702209009e-06 
0.1141067892313 -0.00010824590572156 -1.76233443198726e-05 4.77946787214023e-06 
0.113565690815449 -0.000101474826806225 -1.71572028193623e-05 4.48091441285214e-06 
0.112850517034531 -9.42687620408833e-05 -1.74266479007201e-05 4.42190503235906e-06 
0.111854307353497 -9.3524249678012e-05 -1.92954867088702e-05 4.62293292002869e-06 
0.11050908267498 -8.49888529046439e-05 -2.03772160602966e-05 3.76221237274876e-06 
0.108934015035629 -8.07674150564708e-05 -2.18042696360499e-05 3.18403226629016e-06 
0.106937594711781 -8.06909883976914e-05 -2.42526166402968e-05 2.33441869568196e-06 
0.104821301996708 -7.66558368923143e-05 -2.33915725402767e-05 1.1534265240698e-06 
0.102638855576515 -7.52150881453417e-05 -2.16742446355056e-05 -4.47953176774263e-08 
0.100391685962677 -7.76171073084697e-05 -2.21297159441747e-05 -3.54920189238328e-07 
0.0981911271810532 -6.84025071677752e-05 -2.14887113543227e-05 -9.37033576065005e-07 
0.0961227789521217 -5.69794428884052e-05 -1.95356697076932e-05 -1.5999070228645e-06 
0.0940810367465019 -3.53761424776167e-05 -2.00801532628248e-05 -1.93349865185155e-06 
0.0921019241213799 -1.45237991091562e-05 -2.04643201868748e-05 -2.4686512460903e-06 
0.0902661308646202 1.52952961798292e-05 -1.91315029951511e-05 -2.70701980298327e-06 
0.0883807688951492 4.1430026612943e-05 -1.76308585650986e-05 -3.02483999803371e-06 
0.0865516066551208 7.75353546487167e-05 -1.60647377924761e-05 -3.67476400242595e-06 
0.0845596641302109 0.000107416562968865 -1.47701139212586e-05 -3.94963308281149e-06 
0.0823871046304703 0.00014806272520218 -1.49184306792449e-05 -4.23431674789754e-06 
0.0801439806818962 0.000195675762370229 -1.39476160256891e-05 -4.72970032205922e-06 
0.0777014493942261 0.00023174578382168 -1.42784392664908e-05 -5.8296441238781e-06 
0.0749917477369308 0.000263180263573304 -1.54318404383957e-05 -6.81036271998892e-06 
0.0723526850342751 0.000300588988466188 -1.56168989633443e-05 -8.47668434289517e-06 
0.0695803984999657 0.000333361327648163 -1.55803900270257e-05 -9.43427949096076e-06 
0.066677913069725 0.000357024313416332 -1.57094727910589e-05 -1.09226093627512e-05 
0.0638421922922134 0.000391356530599296 -1.56319692905527e-05 -1.18161724458332e-05 
0.0609922036528587 0.000432498811278492 -1.45641197377699e-05 -1.27622870422783e-05 
0.0580695644021034 0.000473717140266672 -1.39496878546197e-05 -1.35221380332951e-05 
0.055165134370327 0.000516643514856696 -1.26220738820848e-05 -1.4225111954147e-05 
0.0522484146058559 0.000564439978916198 -1.16573091872851e-05 -1.44597770486143e-05 
0.0492606796324253 0.000616358942352235 -1.03920910987654e-05 -1.47749078678316e-05 
0.0463334619998932 0.000670140667352825 -8.98598682397278e-06 -1.45349358717795e-05 
0.0433456562459469 0.000720206997357309 -7.83052564656828e-06 -1.35798018163769e-05 
0.0404921062290668 0.000773149367887527 -6.56262545817299e-06 -1.27448338389513e-05 
0.0376987047493458 0.000824876769911498 -5.40289875061717e-06 -1.15148241093266e-05 
0.0350158996880054 0.000871116004418582 -3.5770299291471e-06 -9.63385627983371e-06 
0.0324118472635746 0.000914752366952598 -1.98589259525761e-06 -7.1318982008961e-06 
0.0299829728901386 0.000951882102526724 -1.49732414911341e-07 -4.85602913613548e-06 
0.0276509486138821 0.000979216769337654 1.6955605133262e-06 -2.36776418205409e-06 
0.0254551619291306 0.000999478274025023 3.43682268066914e-06 3.18669208354549e-07 
0.023367753252387 0.00101226789411157 5.51252196601126e-06 2.76999185189197e-06 
0.0213674865663052 0.00101150595583022 7.46048681321554e-06 5.03193541590008e-06 
0.019439036026597 0.00100045825820416 9.54449660639511e-06 7.64392734708963e-06 
0.0176450815051794 0.000981691409833729 1.14382310130168e-05 9.90597072814126e-06 
0.0159169118851423 0.000949056819081306 1.30399166664574e-05 1.20675158541417e-05 
0.0143000241369009 0.000906093278899789 1.37710476337816e-05 1.40761085276608e-05 
0.0127173447981477 0.00085010111797601 1.33425392050412e-05 1.56624737428501e-05 
0.011202004738152 0.00078476028284058 1.21641014629859e-05 1.648073157412e-05 
0.00963123887777328 0.000705095531884581 9.77283707470633e-06 1.67495800269535e-05 
0.00811836123466492 0.000620986917056143 6.92905132382293e-06 1.65976416610647e-05 
0.00663168588653207 0.000528790231328458 3.42443286172056e-06 1.56037694978295e-05 
0.00526538956910372 0.000439536495832726 -4.72627377234858e-08 1.40918618853902e-05 
0.00401068991050124 0.000355631695128977 -3.59893874701811e-06 1.22195851872675e-05 
0.00294566387310624 0.000283266446786001 -6.58723683955031e-06 1.03081474662758e-05 
0.00202410202473402 0.000218819244764745 -9.31540853343904e-06 8.01301666797372e-06 
0.00130946387071162 0.000169850885868073 -1.12339575935039e-05 6.17125670032692e-06 
0.000747482641600072 0.000131139808217995 -1.25979968288448e-05 4.55054350823048e-06 
0.000342862476827577 0.00010197187657468 -1.32437053252943e-05 3.18984234581876e-06 
5.0860529881902e-05 8.012537000468e-05 -1.34381652969751e-05 2.12288500733848e-06 
-0.000129411724628881 6.46668631816283e-05 -1.31601627799682e-05 1.42223098009708e-06 
-0.000240964654949494 5.32891317561734e-05 -1.27001148939598e-05 8.22313438675337e-07 
-0.000307301670545712 4.54553701274563e-05 -1.19484011520399e-05 5.32661772467691e-07 
-0.000355471798684448 3.83958758902736e-05 -1.1277405974397e-05 2.7355488896319e-07 
-0.000366682681487873 3.35867407557089e-05 -1.06099250842817e-05 1.18587664132974e-07 
-0.000377126067178324 3.01384989143116e-05 -9.97483402898069e-06 -2.5092550259842e-08 
-0.000387005595257506 2.69224565272452e-05 -9.42294263950316e-06 -1.20428936156713e-07 
-0.000387125881388783 2.38803204410942e-05 -8.98705002327915e-06 -2.42418281004575e-07 
-0.000381869584089145 2.2145146431285e-05 -8.54285372042796e-06 -2.70626287601772e-07 
-0.000385444844141603 2.00658632820705e-05 -8.09325229056412e-06 -2.72841788273581e-07 
-0.000387476582545787 1.91725903277984e-05 -7.70569658925524e-06 -1.79424461066446e-07 
0 0 0 0 
0 0 0 0 
0 0 0 0 
0 0 0 0 
0 0 0 0 
0 0 0 0 
0 0 0 0 
0 0 0 0 
0 0 0 0 
0 0 0 0 
0 0 0 0 
0 0 0 0 
0 0 0 0 
0 0 0 0 
99.5341186523438 0.427594304084778 0.0193500090390444 0.00920145958662033 
