{
	"centerX" : 0.5,
	"centerY" : 0.5,
	"angle" : 0,
	"scale" : 1,
	"width" : 300,
	"height" : 94,
	"contents" : [
        {
			"type" : "image",
			"resource" : {
				"type" : "static",
				"path" : "res/Angel.png"
			},
			"centerX" : 0.5,
			"centerY" : 0.5,
			"width" : 240,
			"height" : 62,
			"angle" : 0,
			"zorder" : 1
		}
	]
}
