0 0 0 0 
0 0 0 0 
0 0 0 0 
0 0 0 0 
0 0 0 0 
0 0 0 0 
0 0 0 0 
0 0 0 0 
0 0 0 0 
0 0 0 0 
0.00126187538262457 -2.33976606978104e-05 3.48425055562984e-06 -5.82914299229742e-06 
0.00145604310091585 -2.841516470653e-05 3.845863375318e-06 -6.92578169037006e-06 
0.00165524613112211 -3.13141063088551e-05 3.75836748389702e-06 -7.91771890362725e-06 
0.00189014477655292 -3.3417294616811e-05 3.32428226101911e-06 -8.62765318743186e-06 
0.00224473583512008 -3.27022389683407e-05 2.31435888053966e-06 -8.47144110593945e-06 
0.0026849324349314 -2.81585580523824e-05 1.12241809802072e-06 -7.88433590059867e-06 
0.00315459840930998 -2.09225836442783e-05 1.80482846445784e-08 -6.88336558596347e-06 
0.00365687836892903 -1.21808452604455e-05 -1.22458959594951e-06 -5.20778212376172e-06 
0.0041263741441071 -2.48257015300624e-06 -2.22885932998906e-06 -3.22359642268566e-06 
0.00445131631568074 6.8350782385096e-06 -2.76975470114849e-06 -1.63240054007474e-06 
0.0046400842256844 1.3485444469552e-05 -3.2271552754537e-06 -1.34401991758182e-08 
0.00475053302943707 1.86872784979641e-05 -3.82688267563935e-06 1.46539332490647e-06 
0.00479524210095406 2.33086120715598e-05 -4.18208446717472e-06 2.55148779615411e-06 
0.00481225270777941 2.71617809630698e-05 -4.43091767010628e-06 3.31464252667502e-06 
0.00486727524548769 3.07993359456304e-05 -4.51783989774412e-06 3.90075501854881e-06 
0.00502325966954231 3.51359485648572e-05 -4.6235550144047e-06 4.38482857134659e-06 
0.00528897577896714 3.99672680941876e-05 -4.76199375043507e-06 4.84898782815435e-06 
0.00565527239814401 4.48841783509124e-05 -4.98711688123876e-06 5.26006670042989e-06 
0.00611480651423335 4.99670350109227e-05 -5.33795764567913e-06 5.76481170355692e-06 
0.00661114323884249 5.42972156836186e-05 -5.9719232012867e-06 6.34133721177932e-06 
0.00708148861303926 5.70771917409729e-05 -6.91865852786577e-06 6.94347818352981e-06 
0.00748521042987704 5.81639906158671e-05 -8.01315309217898e-06 7.66719858802389e-06 
0.00778985721990466 5.81264102947898e-05 -9.23727657209383e-06 8.4001621871721e-06 
0.00799440965056419 5.64860347367357e-05 -1.07568203020492e-05 9.2719883468817e-06 
0.00810876116156578 5.37949199497234e-05 -1.24586031233775e-05 1.03353249869542e-05 
0.0081903487443924 5.1728893595282e-05 -1.40999927680241e-05 1.15981183625991e-05 
0.00832044426351786 5.32442136318423e-05 -1.50779051182326e-05 1.27616267491248e-05 
0.00862480141222477 5.89662085985765e-05 -1.57334234245354e-05 1.38678697112482e-05 
0.00919173564761877 7.01686876709573e-05 -1.5946798157529e-05 1.48503004311351e-05 
0.0101785799488425 8.90726587385871e-05 -1.56057158164913e-05 1.57791400852147e-05 
0.0117346681654453 0.000116570401587524 -1.47348191603669e-05 1.66211539180949e-05 
0.0140515426173806 0.000151196989463642 -1.41043301482568e-05 1.80168553924887e-05 
0.0172790270298719 0.000193997300812043 -1.30894295580219e-05 1.94644380826503e-05 
0.0216637402772903 0.000245484145125374 -1.13519590740907e-05 2.10320522455731e-05 
0.0273430440574884 0.000302391941659153 -8.63427521835547e-06 2.20330748561537e-05 
0.0344140902161598 0.000361300713848323 -4.22997345594922e-06 2.21753653022461e-05 
0.0428054220974445 0.000419066636823118 2.1733746962127e-06 2.05428332265001e-05 
0.0522841326892376 0.000469152291771024 1.01066480056033e-05 1.71001356648048e-05 
0.0624063648283482 0.000503997958730906 1.87365803867579e-05 1.1685760000546e-05 
0.0728279426693916 0.000521911133546382 2.74696249107365e-05 5.29609087607241e-06 
0.083047516644001 0.000518572924192995 3.4511620469857e-05 -1.26440068015654e-06 
0.0927158370614052 0.000494359061121941 3.86484098271467e-05 -6.88631507728132e-06 
0.101594440639019 0.0004547948774416 3.8736907299608e-05 -1.24430907817441e-05 
0.109702810645103 0.000406438542995602 3.48189641954377e-05 -1.57295926328516e-05 
0.116795763373375 0.000351049122400582 2.7562031391426e-05 -1.76405101228738e-05 
0.122904300689697 0.000297235208563507 1.76555986399762e-05 -1.8215268937638e-05 
0.12811666727066 0.000246808893280104 8.07392370916205e-06 -1.8424354493618e-05 
0.132519990205765 0.00020040140952915 -4.14223734424013e-07 -1.6798696378828e-05 
0.136207804083824 0.000158591894432902 -7.15720943844644e-06 -1.49693123603356e-05 
0.139353021979332 0.000123600941151381 -1.30574981085374e-05 -1.32009608933004e-05 
0.142102360725403 9.42293481784873e-05 -1.70694002008531e-05 -1.14877148007508e-05 
0.144392341375351 7.26630969438702e-05 -2.07467892323621e-05 -1.01354480648297e-05 
0.146349042654037 5.74782206967939e-05 -2.29689012485323e-05 -8.38505366118625e-06 
0.147834360599518 4.31337175541557e-05 -2.47993157245219e-05 -7.77984132582787e-06 
0.148920863866806 3.44909931300208e-05 -2.59611369983759e-05 -7.1881204348756e-06 
0.149635761976242 2.37712774833199e-05 -2.76807531918166e-05 -6.3720294747327e-06 
0.150174111127853 1.75214699993376e-05 -2.84729630948277e-05 -5.75919011680526e-06 
0.150346010923386 7.67968231230043e-06 -2.89138733933214e-05 -6.42252462057513e-06 
0.150497734546661 6.37687298876699e-06 -2.8554050004459e-05 -6.03659555054037e-06 
0.15059021115303 -2.9443312996591e-06 -2.83637746179011e-05 -5.79826200919342e-06 
0.150611191987991 -5.46443152416032e-06 -2.69578958977945e-05 -6.68747861709562e-06 
0.150492250919342 -1.97270437638508e-05 -2.60792730841786e-05 -7.01946146364207e-06 
0.150471642613411 -3.34823344019242e-05 -2.56701005127979e-05 -5.24075403518509e-06 
0.150237485766411 -5.35923318238929e-05 -2.40913323068526e-05 -4.26400902142632e-06 
0.150006234645844 -6.51340451440774e-05 -2.16941371036228e-05 -2.61237050835916e-06 
0.149703875184059 -8.06799653219059e-05 -2.057656274701e-05 -1.12424777398701e-06 
0.14950293302536 -8.5557418060489e-05 -1.81420055014314e-05 1.66359939157701e-06 
0.149045437574387 -8.55489706736989e-05 -1.50811620187596e-05 3.13515465677483e-06 
0.148413389921188 -8.98964644875377e-05 -1.42696389957564e-05 4.75469005323248e-06 
0.147546038031578 -9.86773738986813e-05 -1.17280424092314e-05 5.93941967963474e-06 
0.146535322070122 -9.81661141850054e-05 -6.58018598187482e-06 7.4447939368838e-06 
0.145055845379829 -0.000110109889646992 -4.20183141613961e-06 7.90268768469105e-06 
0.143580183386803 -0.000123709047329612 -3.01228101307061e-06 6.59783700029948e-06 
0.141997009515762 -0.000127373161376454 -9.53836661210516e-07 5.57023486180697e-06 
0.140353724360466 -0.000127206454635598 7.88038732935092e-07 4.59880584458006e-06 
0.138470768928528 -0.000131751483422704 2.88750499066737e-07 4.35155698141898e-06 
0.136590734124184 -0.00012420404527802 1.4091407365413e-06 4.28089424531208e-06 
0.134438842535019 -0.000120926037197933 3.24311554322776e-06 5.9650215007423e-06 
0.132010981440544 -0.000117995026812423 6.59754505250021e-06 5.99965778746991e-06 
0.12930890917778 -0.000118537973321509 7.43072678233148e-06 6.71517227601726e-06 
0.126533910632133 -0.000123064484796487 1.02995390989236e-05 7.10139738657745e-06 
0.123500272631645 -0.000132066852529533 1.17115105240373e-05 7.30133251636289e-06 
0.120329834520817 -0.000137399736559018 1.29828740682569e-05 8.3505556176533e-06 
0.117152079939842 -0.00014677552098874 1.39179228426656e-05 9.63149977906141e-06 
0.113836534321308 -0.000151042375364341 1.51880803969107e-05 1.00111492429278e-05 
0.110517881810665 -0.000151391635881737 1.59245701070176e-05 1.03468109955429e-05 
0.107097469270229 -0.000150040912558325 1.7529364413349e-05 9.10248672880698e-06 
0.10381343215704 -0.000145359226735309 1.88268477359088e-05 7.22881122783292e-06 
0.10069876909256 -0.000142753924592398 1.88536741916323e-05 8.02210888650734e-06 
0.0976581946015358 -0.000142409728141502 1.95474476640811e-05 8.98559574125102e-06 
0.0944568440318108 -0.000140016520163044 2.04097850655671e-05 9.16998487809906e-06 
0.0913374274969101 -0.000134451387566514 2.16419521166245e-05 1.03231113826041e-05 
0.087940588593483 -0.000134791960590519 2.28089902520878e-05 1.0046146599052e-05 
0.0842907503247261 -0.000129366060718894 2.38982847804436e-05 8.29568762128474e-06 
0.0803959667682648 -0.000122849698527716 2.56286548392382e-05 6.09508788329549e-06 
0.0761869996786118 -0.000122995625133626 2.64247719314881e-05 4.42113378085196e-06 
0.0716022849082947 -0.000127532315673307 2.68428339040838e-05 3.11250823870068e-06 
0.0668566673994064 -0.000127488005091436 2.73348596238066e-05 2.55385884884163e-06 
0.0619171746075153 -0.00012819106632378 2.80312488030177e-05 2.0695708826679e-06 
0.0569147393107414 -0.000129695967189036 2.87907605525106e-05 1.61101525009144e-06 
0.0520170107483864 -0.000129868174553849 2.89050185529049e-05 1.30664966491167e-06 
0.0473512560129166 -0.00012508628424257 2.88475257548271e-05 4.94951734708593e-07 
0.0429021120071411 -0.000121303324704058 2.90235329885036e-05 1.23939045693078e-07 
0.0387908257544041 -0.000118204123282339 2.8896936782985e-05 -2.72578120075195e-07 
0.0350089706480503 -0.000112804023956414 2.7883768780157e-05 -8.42665656364261e-07 
0.0316614136099815 -0.000104364487924613 2.72300658252789e-05 -1.23914071537001e-06 
0.0287041235715151 -9.73618516582064e-05 2.6712639737525e-05 -1.46933746236755e-06 
0.0261118616908789 -8.8695676822681e-05 2.58156687777955e-05 -1.80180063580337e-06 
0.023810276761651 -7.85870070103556e-05 2.46509262069594e-05 -2.24883046939794e-06 
0.0218107886612415 -6.96365823387168e-05 2.3416167096002e-05 -2.07640960070421e-06 
0.0200391840189695 -6.03764310653787e-05 2.2479631297756e-05 -2.30895193453762e-06 
0.0184887163341045 -5.16166219313163e-05 2.12646518775728e-05 -2.27097666538612e-06 
0.0171415489166975 -4.36819427704904e-05 2.00526010303292e-05 -2.03521085495595e-06 
0.0159322619438171 -3.56295640813187e-05 1.8864815501729e-05 -1.88477986284852e-06 
0.0148800583556294 -2.80435833701631e-05 1.78306418092689e-05 -1.73500927758141e-06 
0.0139505285769701 -2.17642282223096e-05 1.65202691277955e-05 -1.35521042921027e-06 
0.0131266582757235 -1.59478804562241e-05 1.53317905642325e-05 -9.34973286348395e-07 
0.0123460227623582 -1.01379382613231e-05 1.398660333507e-05 -5.78386050165136e-07 
0.0116196032613516 -5.7200199989893e-06 1.29854033730226e-05 -1.15237959619208e-07 
0.0109178796410561 -1.57275906076393e-06 1.17492345452774e-05 3.83630549549707e-07 
0.0102269966155291 2.32673187383625e-06 1.07607575046131e-05 9.01722728485765e-07 
0.00954856164753437 6.48719924356556e-06 9.70327528193593e-06 1.35645916543581e-06 
0.00890008825808764 9.998590030591e-06 8.55555845191702e-06 1.75541060798423e-06 
0.00827106926590204 1.35520231197006e-05 7.25972267900943e-06 2.15497743738524e-06 
0.00767765287309885 1.71293577295728e-05 6.04104252488469e-06 2.43484328166232e-06 
0.00712071219459176 2.06788281502668e-05 4.80565358884633e-06 2.71633120974002e-06 
0.00660006562247872 2.3923623302835e-05 3.57224439540005e-06 3.10888253807207e-06 
0.0061357170343399 2.77532271866221e-05 2.45209980676009e-06 3.5744512842939e-06 
0.00572892092168331 3.19671235047281e-05 1.35298967052222e-06 4.16026341554243e-06 
0.00536786345764995 3.6048426409252e-05 3.04216285940129e-07 4.84199244965566e-06 
0.00505060749128461 4.06198523705825e-05 -7.83269854309765e-07 5.62912146051531e-06 
0.00475957011803985 4.50004663434811e-05 -1.7366695601595e-06 6.38619485471281e-06 
0.00446174573153257 4.94903870276175e-05 -2.61868058260006e-06 7.15635405867943e-06 
0.00417380221188068 5.3903571824776e-05 -3.62767013939447e-06 7.78979301685467e-06 
0.0038866528775543 5.77577629883308e-05 -4.39465020463103e-06 8.29925375001039e-06 
0.00360042508691549 5.97639664192684e-05 -4.99026873512776e-06 8.6434210970765e-06 
0.0033248548861593 6.07612964813598e-05 -5.13882287123124e-06 8.8429733295925e-06 
0.00306429178453982 5.99147169850767e-05 -5.07112281411537e-06 8.76089234225219e-06 
0.00279997289180756 5.75905760342721e-05 -4.57554187960341e-06 8.48062154545914e-06 
0.00250863353721797 5.33833881490864e-05 -4.07894276577281e-06 7.90177818998927e-06 
0.00221742340363562 4.8800833610585e-05 -3.42682847076503e-06 7.18733372195857e-06 
0.00191466731484979 4.30821091867983e-05 -2.82756741398771e-06 6.29950591246597e-06 
0.00162342935800552 3.72831054846756e-05 -2.25610892812256e-06 5.40512519364711e-06 
0.00134117272682488 3.08578564727213e-05 -1.66879112839524e-06 4.53584425486042e-06 
0.00109962862916291 2.52357876888709e-05 -1.20102140499512e-06 3.73049965673999e-06 
0.000884778972249478 2.00795166165335e-05 -8.1480266089784e-07 2.95807467409759e-06 
0.000699753989465535 1.54831177496817e-05 -5.79583172566345e-07 2.31449030252406e-06 
0.000548200216144323 1.15347256723908e-05 -3.20689338195734e-07 1.80773815827706e-06 
0.000424948637373745 8.47135106596397e-06 -2.46975133677552e-07 1.29139164073422e-06 
0.000337951234541833 6.58881390336319e-06 -6.56460628079003e-08 9.78665866568917e-07 
0.000277380575425923 5.3809098972124e-06 -5.91720556997188e-08 7.48516754356388e-07 
0.000235918560065329 4.75350725537282e-06 -1.39020130518475e-07 4.80099402011547e-07 
0.000212947226827964 4.79051004731446e-06 -4.75639041042086e-07 1.53830782778641e-07 
0.000213714927667752 5.51516313862521e-06 -8.85883252976782e-07 -9.27090653135565e-08 
0.000225581927224994 6.53529787086882e-06 -1.57637180109305e-06 -5.5408554544556e-07 
0.000257224019151181 8.50953802000731e-06 -2.49689355769078e-06 -1.09748964405298e-06 
0.000310739240376279 1.15547836685437e-05 -3.73025568478624e-06 -1.73333216935134e-06 
0.000387375126592815 1.54142999235773e-05 -5.3296071200748e-06 -2.55369036494812e-06 
0.000498100707773119 2.05431515496457e-05 -7.34000423108228e-06 -3.59056298293581e-06 
0.000607359281275421 2.56703606282827e-05 -9.47281205299078e-06 -4.59661850982229e-06 
0.000776799686718732 3.29372451233212e-05 -1.21869097711169e-05 -5.95096753386315e-06 
0 0 0 0 
0 0 0 0 
0 0 0 0 
0 0 0 0 
0 0 0 0 
0 0 0 0 
0 0 0 0 
0 0 0 0 
0 0 0 0 
0 0 0 0 
0 0 0 0 
0 0 0 0 
0 0 0 0 
0 0 0 0 
99.7790985107422 0.182377383112907 0.0205328967422247 0.0103532560169697 
