{
  "api_version": 0,
  "manufacturer_id": 0,
  "product": "ohcore",
  "syscap": {
    "os": [
      "SystemCapability.Ability.AbilityBase",
      "SystemCapability.Ability.AbilityBase",
      "SystemCapability.Ability.AbilityRuntime.AbilityCore",
      "SystemCapability.Ability.AbilityRuntime.AbilityCore",
      "SystemCapability.Ability.AbilityRuntime.Core",
      "SystemCapability.Ability.AbilityRuntime.Core",
      "SystemCapability.Ability.AbilityRuntime.FAModel",
      "SystemCapability.Ability.AbilityRuntime.FAModel",
      "SystemCapability.Ability.AbilityRuntime.Mission",
      "SystemCapability.Ability.AbilityRuntime.Mission",
      "SystemCapability.Ability.AbilityRuntime.QuickFix",
      "SystemCapability.Ability.AbilityRuntime.QuickFix",
      "SystemCapability.Ability.AbilityTools.AbilityAssistant",
      "SystemCapability.Ability.AbilityTools.AbilityAssistant",
      "SystemCapability.Ability.DistributedAbilityManager",
      "SystemCapability.Ability.Form",
      "SystemCapability.Ability.Form",
      "SystemCapability.Account.AppAccount",
      "SystemCapability.Account.OsAccount",
      "SystemCapability.ArkUI.ArkUI.Full",
      "SystemCapability.ArkUI.ArkUI.Libuv",
      "SystemCapability.ArkUI.ArkUI.Napi",
      "SystemCapability.BarrierFree.Accessibility.Core",
      "SystemCapability.BarrierFree.Accessibility.Hearing",
      "SystemCapability.BarrierFree.Accessibility.Vision",
      "SystemCapability.BundleManager.BundleFramework",
      "SystemCapability.BundleManager.BundleFramework.AppControl",
      "SystemCapability.BundleManager.BundleFramework.Core",
      "SystemCapability.BundleManager.BundleFramework.DefaultApp",
      "SystemCapability.BundleManager.BundleFramework.FreeInstall",
      "SystemCapability.BundleManager.BundleFramework.Launcher",
      "SystemCapability.BundleManager.BundleFramework.Resource",
      "SystemCapability.BundleManager.BundleTool",
      "SystemCapability.BundleManager.Zlib",
      "SystemCapability.Communication.Bluetooth.Core",
      "SystemCapability.Communication.Bluetooth.Lite",
      "SystemCapability.Communication.IPC.Core",
      "SystemCapability.Communication.NFC.Core",
      "SystemCapability.Communication.NetManager.Core",
      "SystemCapability.Communication.NetStack",
      "SystemCapability.Communication.SoftBus.Core",
      "SystemCapability.Communication.WiFi.AP.Core",
      "SystemCapability.Communication.WiFi.Core",
      "SystemCapability.Communication.WiFi.P2P",
      "SystemCapability.Communication.WiFi.STA",
      "SystemCapability.Developtools.Syscap",
      "SystemCapability.DistributedDataManager.DataObject.DistributedObject",
      "SystemCapability.DistributedDataManager.DataShare.Consumer",
      "SystemCapability.DistributedDataManager.DataShare.Core",
      "SystemCapability.DistributedDataManager.DataShare.Provider",
      "SystemCapability.DistributedDataManager.KVStore.Core",
      "SystemCapability.DistributedDataManager.KVStore.DistributedKVStore",
      "SystemCapability.DistributedDataManager.Preferences.Core",
      "SystemCapability.DistributedDataManager.RelationalStore.Core",
      "SystemCapability.DistributedHardware.DeviceManager",
      "SystemCapability.FileManagement.File.DistributedFile",
      "SystemCapability.FileManagement.File.DistributedFile",
      "SystemCapability.FileManagement.File.Environment",
      "SystemCapability.FileManagement.File.Environment",
      "SystemCapability.FileManagement.File.FileIO",
      "SystemCapability.FileManagement.File.FileIO",
      "SystemCapability.FileManagement.AppFileService",
      "SystemCapability.FileManagement.StorageService.Encryption",
      "SystemCapability.FileManagement.StorageService.SpatialStatistics",
      "SystemCapability.FileManagement.StorageService.Volume",
      "SystemCapability.FileManagement.UserFileManager.Core",
      "SystemCapability.FileManagement.UserFileManager.DistributedCore",
      "SystemCapability.FileManagement.UserFileService",
      "SystemCapability.Global.I18n",
      "SystemCapability.Global.ResourceManager",
      "SystemCapability.Graphic.Graphic2D.ColorManager.Core",
      "SystemCapability.Graphic.Graphic2D.EGL",
      "SystemCapability.Graphic.Graphic2D.GLES3",
      "SystemCapability.Graphic.Graphic2D.NativeDrawing",
      "SystemCapability.Graphic.Graphic2D.NativeWindow",
      "SystemCapability.Graphic.Graphic2D.WebGL",
      "SystemCapability.Graphic.Graphic2D.WebGL2",
      "SystemCapability.HiviewDFX.HiAppEvent",
      "SystemCapability.HiviewDFX.HiAppEvent",
      "SystemCapability.HiviewDFX.HiChecker",
      "SystemCapability.HiviewDFX.HiChecker",
      "SystemCapability.HiviewDFX.HiDumper",
      "SystemCapability.HiviewDFX.HiLog",
      "SystemCapability.HiviewDFX.HiLog",
      "SystemCapability.HiviewDFX.HiProfiler.HiDebug",
      "SystemCapability.HiviewDFX.HiSysEvent",
      "SystemCapability.HiviewDFX.HiTrace",
      "SystemCapability.HiviewDFX.Hiview",
      "SystemCapability.HiviewDFX.Hiview.FaultLogger",
      "SystemCapability.Location.Location.Core",
      "SystemCapability.Location.Location.Geocoder",
      "SystemCapability.Location.Location.Geofence",
      "SystemCapability.Location.Location.Gnss",
      "SystemCapability.Location.Location.Lite",
      "SystemCapability.MiscServices.Download",
      "SystemCapability.MiscServices.InputMethodFramework",
      "SystemCapability.MiscServices.Pasteboard",
      "SystemCapability.MiscServices.ScreenLock",
      "SystemCapability.MiscServices.Time",
      "SystemCapability.MiscServices.Upload",
      "SystemCapability.MiscServices.Wallpaper",
      "SystemCapability.Msdp.DeviceStatus.Stationary",
      "SystemCapability.Multimedia.Audio.Capturer",
      "SystemCapability.Multimedia.Audio.Communication",
      "SystemCapability.Multimedia.Audio.Core",
      "SystemCapability.Multimedia.Audio.Device",
      "SystemCapability.Multimedia.Audio.Interrupt",
      "SystemCapability.Multimedia.Audio.Renderer",
      "SystemCapability.Multimedia.Audio.Tone",
      "SystemCapability.Multimedia.Audio.Volume",
      "SystemCapability.Multimedia.Camera.Core",
      "SystemCapability.Multimedia.Image.Core",
      "SystemCapability.Multimedia.Image.ImageCreator",
      "SystemCapability.Multimedia.Image.ImagePacker",
      "SystemCapability.Multimedia.Image.ImageReceiver",
      "SystemCapability.Multimedia.Image.ImageSource",
      "SystemCapability.Multimedia.Media.AudioDecoder",
      "SystemCapability.Multimedia.Media.AudioEncoder",
      "SystemCapability.Multimedia.Media.AudioPlayer",
      "SystemCapability.Multimedia.Media.AudioRecorder",
      "SystemCapability.Multimedia.Media.CodecBase",
      "SystemCapability.Multimedia.Media.Core",
      "SystemCapability.Multimedia.Media.VideoDecoder",
      "SystemCapability.Multimedia.Media.VideoEncoder",
      "SystemCapability.Multimedia.Media.VideoPlayer",
      "SystemCapability.Multimedia.Media.VideoRecorder",
      "SystemCapability.Multimedia.MediaLibrary.Core",
      "SystemCapability.Multimedia.MediaLibrary.DistributedCore",
      "SystemCapability.MultimodalInput.Input.Cooperator",
      "SystemCapability.MultimodalInput.Input.Core",
      "SystemCapability.MultimodalInput.Input.InputConsumer",
      "SystemCapability.MultimodalInput.Input.InputDevice",
      "SystemCapability.MultimodalInput.Input.InputMonitor",
      "SystemCapability.MultimodalInput.Input.InputSimulator",
      "SystemCapability.MultimodalInput.Input.Pointer",
      "SystemCapability.Notification.CommonEvent",
      "SystemCapability.Notification.Emitter",
      "SystemCapability.Notification.Notification",
      "SystemCapability.Notification.ReminderAgent",
      "SystemCapability.PowerManager.BatteryManager.Core",
      "SystemCapability.PowerManager.BatteryManager.Extension",
      "SystemCapability.PowerManager.BatteryStatistics",
      "SystemCapability.PowerManager.DisplayPowerManager",
      "SystemCapability.PowerManager.PowerManager.Core",
      "SystemCapability.PowerManager.PowerManager.Extension",
      "SystemCapability.PowerManager.ThermalManager",
      "SystemCapability.ResourceSchedule.BackgroundTaskManager.ContinuousTask",
      "SystemCapability.ResourceSchedule.BackgroundTaskManager.EfficiencyResourcesApply",
      "SystemCapability.ResourceSchedule.BackgroundTaskManager.TransientTask",
      "SystemCapability.ResourceSchedule.UsageStatistics.App",
      "SystemCapability.ResourceSchedule.UsageStatistics.AppGroup",
      "SystemCapability.ResourceSchedule.WorkScheduler",
      "SystemCapability.Security.AccessToken",
      "SystemCapability.Security.AppVerify",
      "SystemCapability.Security.Cipher",
      "SystemCapability.Security.CryptoFramework",
      "SystemCapability.Security.DataTransitManager",
      "SystemCapability.Security.DeviceSecurityLevel",
      "SystemCapability.Security.Huks",
      "SystemCapability.Sensors.MiscDevice",
      "SystemCapability.Sensors.Sensor",
      "SystemCapability.Startup.SystemInfo",
      "SystemCapability.Telephony.CallManager",
      "SystemCapability.Telephony.CellularData",
      "SystemCapability.Telephony.CoreService",
      "SystemCapability.Telephony.SmsMms",
      "SystemCapability.Telephony.StateRegistry",
      "SystemCapability.USB.USBManager",
      "SystemCapability.UserIAM.UserAuth.Core",
      "SystemCapability.Utils.Lang",
      "SystemCapability.Web.Webview.Core",
      "SystemCapability.WindowManager.WindowManager.Core",
      "SystemCapability.Test.UiTest"
    ]
  },
  "system_type": "standard"
}
