0 0 0 0 
0 0 0 0 
0 0 0 0 
0 0 0 0 
0 0 0 0 
0 0 0 0 
0 0 0 0 
0 0 0 0 
0 0 0 0 
0 0 0 0 
0.0123629393056035 0.00113011279609054 -4.13451998610981e-05 -7.50744948163629e-06 
0.0164874289184809 0.00146692630369216 -4.10140492022038e-05 -9.07657977222698e-06 
0.0210139360278845 0.00177847349550575 -2.37183558056131e-05 -1.12145362436422e-05 
0.0262563675642014 0.00204432173632085 -2.90863613372494e-06 -1.38237901410321e-05 
0.0337044335901737 0.00222148140892386 2.49441091000335e-05 -2.07095436053351e-05 
0.043305903673172 0.00227445736527443 6.12347721471451e-05 -2.30212062888313e-05 
0.0542099252343178 0.00219518598169088 9.57530937739648e-05 -1.9742032236536e-05 
0.066166490316391 0.00200177659280598 0.000116855168016627 -1.6150244846358e-05 
0.0784193202853203 0.0017183170421049 0.000123823760077357 -1.05190010799561e-05 
0.0893156155943871 0.00139980763196945 0.000118732838018332 2.29590386879863e-06 
0.0985264778137207 0.00110295647755265 9.90926855592988e-05 1.20709164548316e-05 
0.106552623212337 0.000855757738463581 7.38285452825949e-05 1.74346550920745e-05 
0.113282017409801 0.000665724684949964 5.25056129845325e-05 2.28921271627769e-05 
0.118694849312305 0.000534639286343008 3.54266885551624e-05 2.7111753297504e-05 
0.123222604393959 0.000454204622656107 2.1777639631182e-05 2.83089302683948e-05 
0.127157405018806 0.000405235798098147 1.13982923721778e-05 2.72459055850049e-05 
0.130824059247971 0.000362559279892594 2.82715745925088e-06 2.55042887147283e-05 
0.134478360414505 0.000334800744894892 -5.09184019392706e-06 2.34507715504151e-05 
0.138126492500305 0.000314693606924266 -1.13961614260916e-05 2.15243271668442e-05 
0.141670644283295 0.0002942519786302 -1.5863517546677e-05 2.0400178982527e-05 
0.144953772425652 0.000278115854598582 -2.03304352908162e-05 1.99252281163353e-05 
0.147873133420944 0.000276017090072855 -2.24619161599549e-05 1.97286299226107e-05 
0.150354772806168 0.000269532261881977 -2.3209920982481e-05 2.06876557058422e-05 
0.152619525790215 0.00026662100572139 -2.46481668000342e-05 1.93295218195999e-05 
0.154639571905136 0.00026546063600108 -2.69481533905491e-05 1.54236568050692e-05 
0.156583309173584 0.000262443820247427 -3.04052300634794e-05 9.04269018064952e-06 
0.158427596092224 0.000245985051151365 -3.37556120939553e-05 5.37768301001051e-06 
0.160273760557175 0.000228846562094986 -3.79300909116864e-05 1.91227468349098e-06 
0.161975130438805 0.000202859228011221 -4.29668871220201e-05 1.47063275335313e-07 
0.163398772478104 0.000174246553797275 -4.55586014140863e-05 9.34085392145789e-07 
0.164505273103714 0.00012678507482633 -4.57042697235011e-05 4.98057079312275e-06 
0.165423631668091 7.79982510721311e-05 -4.82271316286642e-05 2.65668086285586e-06 
0.16586534678936 2.34694507526001e-05 -5.00968963024206e-05 -2.44510601987713e-07 
0.165972918272018 -3.85643397748936e-05 -4.99682864756323e-05 -3.02672810903459e-06 
0.165642082691193 -9.70030814642087e-05 -5.12828155478928e-05 -8.39382209960604e-06 
0.164877831935883 -0.000145595346111804 -5.08013981743716e-05 -1.41409855132224e-05 
0.16363413631916 -0.000193862448213622 -4.77880785183515e-05 -1.54056779138045e-05 
0.162025600671768 -0.000237962158280425 -4.20939031755552e-05 -1.70103012351319e-05 
0.159863412380219 -0.000266454997472465 -3.61553720722441e-05 -1.91575945791556e-05 
0.157449051737785 -0.000297115766443312 -2.94545443466632e-05 -1.81864779733587e-05 
0.154670238494873 -0.000322814361425117 -2.64562695519999e-05 -1.75612403836567e-05 
0.151535406708717 -0.000335968594299629 -2.26298379857326e-05 -1.8308506696485e-05 
0.148053750395775 -0.000351301569025964 -2.06675267691026e-05 -1.76355697476538e-05 
0.144053444266319 -0.000365427316864952 -1.62991018441971e-05 -1.60049730766332e-05 
0.139683693647385 -0.000377953198039904 -1.12328125396743e-05 -1.45658877954702e-05 
0.134998708963394 -0.000399568380089477 -4.22544053435558e-06 -1.3327956366993e-05 
0.130045190453529 -0.000427575403591618 2.24554287342471e-06 -1.11536974145565e-05 
0.124919198453426 -0.000457027927041054 7.90069498179946e-06 -1.02240210253512e-05 
0.119959615170956 -0.000496401684358716 1.04105929494835e-05 -9.31925842451164e-06 
0.114845052361488 -0.000534989812877029 1.26048907986842e-05 -9.2542404672713e-06 
0.109697677195072 -0.000566685514058918 1.53853470692411e-05 -8.9811728685163e-06 
0.104386821389198 -0.000594778277445585 1.78761310962727e-05 -8.76030389918014e-06 
0.0989588424563408 -0.000621965038590133 2.03290346689755e-05 -8.45075192046352e-06 
0.0932374373078346 -0.000635590520687401 2.3374706870527e-05 -8.10034907772206e-06 
0.0873472318053246 -0.000647381239105016 2.65393773588585e-05 -7.04352805769304e-06 
0.0813371986150742 -0.000652648217510432 2.90004354610574e-05 -6.52508288112585e-06 
0.075469933450222 -0.00065650453325361 3.21826082654297e-05 -5.82107213631389e-06 
0.0698107182979584 -0.000649392197374254 3.55514821421821e-05 -5.24311917615705e-06 
0.0646755024790764 -0.000649071473162621 3.87569125450682e-05 -4.27368513555848e-06 
0.0601137690246105 -0.00064289232250303 4.11555156460963e-05 -4.40560597780859e-06 
0.0561159700155258 -0.000635006697848439 4.38152455899399e-05 -3.34801052304101e-06 
0.0525661520659924 -0.000620399776380509 4.46720187028404e-05 -3.19612900057109e-06 
0.0495096817612648 -0.000612595293205231 4.38571005361155e-05 -3.40307315127575e-06 
0.0467462092638016 -0.000597903039306402 4.29556348535698e-05 -3.82605730919749e-06 
0.0443346798419952 -0.000587470829486847 4.25115504185669e-05 -3.46733486367157e-06 
0.0422097370028496 -0.00057659886078909 4.2262803617632e-05 -3.55065640178509e-06 
0.0404164865612984 -0.000573776196688414 4.23801539000124e-05 -3.35198524226143e-06 
0.038777332752943 -0.000568273826502264 4.32669330621138e-05 -2.79903520095104e-06 
0.0372652262449265 -0.000561865628696978 4.32870547228958e-05 -2.41517295762605e-06 
0.0357772260904312 -0.000551587378140539 4.27661652793176e-05 -1.82669577952765e-06 
0.0343257039785385 -0.000544344598893076 4.1453524318058e-05 -9.47972409903741e-07 
0.0327705144882202 -0.000528351229149848 4.00037861254532e-05 -5.15134445322474e-07 
0.0312566868960857 -0.000510868092533201 3.83942242478952e-05 -6.20452595967436e-08 
0.0297652445733547 -0.000494835257995874 3.81486752303317e-05 6.90457454766147e-07 
0.0282902847975492 -0.000480172835523263 3.7818947021151e-05 1.1201724419152e-06 
0.026805117726326 -0.00046269703307189 3.77148571715225e-05 1.04214268503711e-06 
0.0254118032753468 -0.000450947700301185 3.7035541026853e-05 1.25069425394031e-06 
0.0240520779043436 -0.0004378016164992 3.64363040716853e-05 1.38956409045932e-06 
0.0227657221257687 -0.000424023863160983 3.47709537891205e-05 1.65195910994953e-06 
0.0215793661773205 -0.000410391599871218 3.28380592691246e-05 1.83336601367046e-06 
0.0205293614417315 -0.000396764458855614 3.07335103570949e-05 1.88580554549844e-06 
0.0195917561650276 -0.000381844234652817 2.8847565772594e-05 2.0567183582898e-06 
0.0187787320464849 -0.000369891902664676 2.71357785095461e-05 2.14264332498715e-06 
0.0181147679686546 -0.00036035364610143 2.57385963777779e-05 1.85240776318096e-06 
0.0175586380064487 -0.000351977214450017 2.53147209150484e-05 1.63098127359262e-06 
0.0171332135796547 -0.000346267130225897 2.56053554039681e-05 1.76842502241925e-06 
0.0167811196297407 -0.000340929167577997 2.69152005785145e-05 1.73042985807115e-06 
0.0165442451834679 -0.000338466779794544 2.86690610664664e-05 1.76851688138413e-06 
0.0163941197097301 -0.000337948848027736 3.09540446323808e-05 1.84303451078449e-06 
0.0163138750940561 -0.000339376681949943 3.25667460856494e-05 1.76710989308049e-06 
0.0162273310124874 -0.000339635676937178 3.38434620061889e-05 1.59827243351174e-06 
0.0161678995937109 -0.000341135921189561 3.46610977430828e-05 1.55683994762512e-06 
0.0160352233797312 -0.000338367826770991 3.5619788832264e-05 1.47018715779268e-06 
0.0158316250890493 -0.000334167736582458 3.61965721822344e-05 1.48026254009892e-06 
0.015546053647995 -0.000327306916005909 3.67187385563739e-05 1.59602620897203e-06 
0.0151512613520026 -0.000317391328280792 3.6909150367137e-05 1.58862690113892e-06 
0.0146673833951354 -0.000305805471725762 3.67795582860708e-05 1.56551459440379e-06 
0.014123865403235 -0.000294368743197992 3.60816484317183e-05 1.50602795656596e-06 
0.0135287325829268 -0.000282664375845343 3.50969312421512e-05 1.27325563425984e-06 
0.012893577106297 -0.000270568911219016 3.40025217155926e-05 1.07121570636082e-06 
0.0122603578492999 -0.000258538377238438 3.25900582538452e-05 8.7893556610652e-07 
0.0116484649479389 -0.000248771626502275 3.08871276502032e-05 8.09872005902434e-07 
0.0110541423782706 -0.000239172470173799 2.92095901386347e-05 6.28113411949016e-07 
0.0104953078553081 -0.000230206642299891 2.77060225926107e-05 6.40073039903655e-07 
0.00998400803655386 -0.000221807538764551 2.64539266936481e-05 6.72699911774544e-07 
0.00955589767545462 -0.000217633598367684 2.57247684203321e-05 7.69994187521661e-07 
0.0091725280508399 -0.000212798680877313 2.55699524132069e-05 9.17803390620975e-07 
0.00884729158133268 -0.000210086145671085 2.57726042036666e-05 1.13502539988986e-06 
0.00858226884156466 -0.000208491139346734 2.59552853094647e-05 1.21637629035831e-06 
0.00836133118718863 -0.000208573605050333 2.590802978375e-05 1.16664284632861e-06 
0.00816821493208408 -0.000208962403121404 2.58903783105779e-05 1.15588318294613e-06 
0.00800289679318666 -0.000209839316084981 2.57647698163055e-05 1.06253412468504e-06 
0.00788564234972 -0.000211316626518965 2.53800753853284e-05 1.07812650185224e-06 
0.00777694629505277 -0.000212960891076364 2.53420203080168e-05 1.05330161659367e-06 
0.00770000042393804 -0.000215201231185347 2.56152361544082e-05 9.40273992000584e-07 
0.00765888206660748 -0.000217622073250823 2.60781744145788e-05 8.71270344759978e-07 
0.00763590075075626 -0.000220667046960443 2.65951093751937e-05 6.78037565648992e-07 
0.00761810084804893 -0.000225000258069485 2.69492102233926e-05 5.15273484325007e-07 
0.00760741950944066 -0.000228975317440927 2.71075532509713e-05 3.95815220599616e-07 
0.0075810793787241 -0.000232662001508288 2.73526820819825e-05 4.5521358060796e-07 
0.00752434087917209 -0.000235372368479148 2.74332105618669e-05 4.15256181440782e-07 
0.00744144432246685 -0.000236617343034595 2.75991678790888e-05 3.27050855730704e-07 
0.00734114879742265 -0.000237039086641744 2.81412903859746e-05 1.06657978449221e-07 
0.00721530243754387 -0.000238243650528602 2.88688515865942e-05 -1.673881087072e-07 
0.00706165144219995 -0.000237652595387772 2.94778201350709e-05 -4.60631611076678e-07 
0.00689971121028066 -0.000237672866205685 3.02077078231378e-05 -6.47296928946162e-07 
0.00673532765358686 -0.000238792534219101 3.08756134472787e-05 -6.84279655160935e-07 
0.00654225144535303 -0.000238912689383142 3.1687734008301e-05 -5.63044807222468e-07 
0.0063423695974052 -0.000238715496379882 3.26210829371121e-05 -4.64057563931419e-07 
0.00615534652024508 -0.000241039801039733 3.32338058797177e-05 -3.711020042374e-07 
0.00594306970015168 -0.00024264128296636 3.33907883032225e-05 -2.37980643191804e-07 
0.00569475581869483 -0.000243225207668729 3.32654744852334e-05 -1.47213157219994e-07 
0.00540742697194219 -0.000242946916841902 3.2642696169205e-05 -8.40702938376126e-08 
0.00509066693484783 -0.000241829897277057 3.14336648443714e-05 2.27225157800603e-07 
0.00472982646897435 -0.000236246807617135 2.97763017442776e-05 4.11879852890706e-07 
0.00434652017429471 -0.000227784985327162 2.77543786069145e-05 5.20832429629081e-07 
0.00396200176328421 -0.000217011387576349 2.52362970059039e-05 6.99499537404336e-07 
0.00358284683898091 -0.00020310387481004 2.22060079977382e-05 9.03677175756457e-07 
0.00319045502692461 -0.000185305601917207 1.87235618795967e-05 9.21182845559088e-07 
0.00277432589791715 -0.000164095938089304 1.53652235894697e-05 8.88779140950646e-07 
0.00237491726875305 -0.000143034165375866 1.20401700769435e-05 9.67307187238475e-07 
0.00199583149515092 -0.000121663520985749 9.08878428163007e-06 8.95212906470988e-07 
0.00165346288122237 -0.000102406265796162 6.52302833259455e-06 6.89453543145646e-07 
0.0013242153218016 -8.24742528493516e-05 4.621680091077e-06 6.2380649978877e-07 
0.00105698558036238 -6.63977552903816e-05 3.08857897834969e-06 6.25767654582887e-07 
0.000816432468127459 -5.110325946589e-05 2.11578503694909e-06 5.61644412755413e-07 
0.000613839307334274 -3.72307767975144e-05 1.39060614401387e-06 4.5496463485506e-07 
0.000456015492090955 -2.67285176960286e-05 1.03875970580702e-06 4.17418817733051e-07 
0.000335108343278989 -1.95085231098346e-05 6.98740336702031e-07 3.00790929941286e-07 
0.000268084084382281 -1.47071750689065e-05 4.89966339500825e-07 2.77714093499526e-07 
0.000227414464461617 -1.14072799988207e-05 6.30963143066765e-07 1.46492041608326e-07 
0.000205660209758207 -1.02723934105597e-05 1.0797601817103e-06 1.58434758645853e-07 
0.000189894082723185 -7.17838975106133e-06 1.95223628907115e-06 6.23996214699218e-08 
0.000212609418667853 -6.33413037576247e-06 3.57519184035482e-06 -2.26345129306083e-08 
0.000227899610763416 -5.19835430168314e-06 6.33392664894927e-06 -3.69766404162419e-08 
0.000252979545621201 -3.55108022631612e-06 1.00146608019713e-05 -2.08638553544915e-07 
0.000304596760543063 -1.92804327525664e-06 1.49936640809756e-05 -3.31172884671105e-07 
0.000379572767997161 -9.72559519141214e-07 2.12329250643961e-05 -4.89374087919714e-07 
0.000477834400953725 6.7175602680436e-07 2.89836461888626e-05 -7.7885414384582e-07 
0.000593384611420333 1.65837047916284e-06 3.70402885891963e-05 -1.02502872323385e-06 
0.000751254498027265 1.73142063886189e-06 4.72595493192784e-05 -1.62963863203913e-06 
0 0 0 0 
0 0 0 0 
0 0 0 0 
0 0 0 0 
0 0 0 0 
0 0 0 0 
0 0 0 0 
0 0 0 0 
0 0 0 0 
0 0 0 0 
0 0 0 0 
0 0 0 0 
0 0 0 0 
0 0 0 0 
99.1888198852539 0.740060806274414 0.0461383759975433 0.0116870235651731 
