0 0 0 0 
0 0 0 0 
0 0 0 0 
0 0 0 0 
0 0 0 0 
0 0 0 0 
0 0 0 0 
0 0 0 0 
0 0 0 0 
0 0 0 0 
0.0107673555612564 0.000128401501569897 0.000150377003592439 2.30895711865742e-05 
0.0157072339206934 0.000195254542632028 0.000210376616450958 3.08433809550479e-05 
0.0212446879595518 0.000277043465757743 0.000264712813077495 3.83928454539273e-05 
0.0280010029673576 0.000371806585462764 0.000296888698358089 4.10879620176274e-05 
0.0375136621296406 0.000500135589390993 0.000281525892205536 3.61266975232866e-05 
0.0488730035722256 0.000641226477455348 0.000221189184230752 2.61933037108975e-05 
0.0607566311955452 0.000768214697018266 0.000133793670102023 1.29050558825838e-05 
0.072627492249012 0.000874342804308981 3.61090096703265e-05 -3.82822946676242e-08 
0.0834885910153389 0.000940957514103502 -5.14757812197786e-05 -9.15070268092677e-06 
0.0920222550630569 0.000950464396737516 -9.88177343970165e-05 -1.09489546957775e-05 
0.0988636985421181 0.00091378967044875 -0.000110138978925534 -9.94984384306008e-06 
0.105226039886475 0.000853232340887189 -0.000103826620033942 -7.36758238417679e-06 
0.111277014017105 0.00076935178367421 -8.95635748747736e-05 -7.34290006221272e-06 
0.11693774163723 0.000677457661367953 -7.08578299963847e-05 -7.91120055509964e-06 
0.122129872441292 0.000577568600419909 -5.48686803085729e-05 -1.05779981822707e-05 
0.126966640353203 0.000478868867503479 -3.79430894099642e-05 -1.35371656142524e-05 
0.131609708070755 0.00038872699951753 -2.28259432333289e-05 -1.61579173436621e-05 
0.136182591319084 0.000304765591863543 -1.02544199762633e-05 -1.90716236829758e-05 
0.140649929642677 0.000228826858801767 -1.4755090660401e-07 -2.09479876502883e-05 
0.145025447010994 0.000165120523888618 1.02447293102159e-05 -2.16460375668248e-05 
0.149068713188171 0.0001089925863198 1.6515516108484e-05 -2.12135546462378e-05 
0.152705550193787 5.98617953073699e-05 2.49417189479573e-05 -2.04758380277781e-05 
0.15587517619133 2.48354008363094e-05 3.16905679937918e-05 -1.80842744157417e-05 
0.158552139997482 -2.75960906037653e-06 3.51465932908468e-05 -1.7701137039694e-05 
0.160772919654846 -3.00474130199291e-05 3.61577440344263e-05 -1.75415189005435e-05 
0.162878394126892 -5.62067216378637e-05 3.6652203561971e-05 -1.82621715794085e-05 
0.164811700582504 -8.75130499480292e-05 3.65039704774972e-05 -1.99723090190673e-05 
0.166691929101944 -0.000122509329230525 3.48138164554257e-05 -2.17432225326775e-05 
0.16840785741806 -0.00016473162395414 3.45316402672324e-05 -2.27896198339295e-05 
0.169870957732201 -0.000202283830731176 3.48060711985454e-05 -2.36794494412607e-05 
0.170862764120102 -0.000232923441217281 3.67127940990031e-05 -2.31342673941981e-05 
0.1713487803936 -0.000259345571976155 3.52481911249924e-05 -2.23084098252002e-05 
0.17128387093544 -0.000277722458122298 3.69731242244598e-05 -1.88791309483349e-05 
0.170703113079071 -0.000284210400423035 3.68184591934551e-05 -1.66754725796636e-05 
0.169619232416153 -0.000290494557702914 3.91500470868777e-05 -1.15999810077483e-05 
0.168125152587891 -0.000295623525744304 3.95574570575263e-05 -7.34936838853173e-06 
0.166214838624001 -0.000298255414236337 4.10858519899193e-05 -3.26269673678325e-06 
0.163760930299759 -0.000296560494462028 3.94242197216954e-05 -1.61215780281054e-06 
0.161018073558807 -0.000294238037895411 3.65401392627973e-05 1.92566744772193e-06 
0.157964244484901 -0.000298919534543529 2.6764246285893e-05 3.27922202814079e-06 
0.154502913355827 -0.000299879757221788 1.85389126272639e-05 5.77348328079097e-06 
0.150689110159874 -0.00029857232584618 9.60536908678478e-06 7.2133598223445e-06 
0.146689832210541 -0.000292842363705859 -1.27397890992142e-06 7.89041587268002e-06 
0.141912624239922 -0.000291528995148838 -9.5940458777477e-06 9.41272628551815e-06 
0.13683457672596 -0.000276515085715801 -1.33567737066187e-05 1.02382327895612e-05 
0.131539821624756 -0.000262849527643993 -1.93735686480068e-05 1.02569028967991e-05 
0.126029685139656 -0.000241603556787595 -2.42940768657718e-05 1.25910974020371e-05 
0.120338171720505 -0.000226711636059918 -2.82191813312238e-05 1.58798611664679e-05 
0.114859536290169 -0.000211489488719963 -3.10206633002963e-05 1.75558870978421e-05 
0.109279297292233 -0.00019985027029179 -3.54569128830917e-05 2.00343547476223e-05 
0.103558018803596 -0.000187975165317766 -3.92531728721224e-05 2.21447080548387e-05 
0.0978375822305679 -0.000176327201188542 -4.41505326307379e-05 2.2777794583817e-05 
0.0919541493058205 -0.000163782649906352 -4.59497023257427e-05 2.42607129621319e-05 
0.0859432145953178 -0.00014730061229784 -4.96854590892326e-05 2.53473190241493e-05 
0.0797918662428856 -0.00013054022565484 -5.13507620780729e-05 2.55360064329579e-05 
0.0736662223935127 -0.000114546135591809 -5.22586524311919e-05 2.54943515756167e-05 
0.0676257535815239 -0.000101484911283478 -5.1607632485684e-05 2.60849301412236e-05 
0.0619096048176289 -8.93819087650627e-05 -5.06252072227653e-05 2.56951825576834e-05 
0.056721530854702 -7.77146924519911e-05 -4.78368747280911e-05 2.55446484516142e-05 
0.0521194525063038 -6.57856653560884e-05 -4.58251561212819e-05 2.49916938628303e-05 
0.0481195896863937 -5.62009408895392e-05 -4.41858173871879e-05 2.50726425292669e-05 
0.0446287468075752 -4.6774457587162e-05 -4.26568149123341e-05 2.46469553530915e-05 
0.0416019894182682 -3.81638201361056e-05 -4.23982673964929e-05 2.44498733081855e-05 
0.0389549992978573 -3.2234955142485e-05 -4.20041324105114e-05 2.44990787905408e-05 
0.0366322994232178 -2.71334374701837e-05 -4.16958828282077e-05 2.46879953920143e-05 
0.034599706530571 -1.94571366591845e-05 -4.14598580391612e-05 2.49200656980975e-05 
0.0328394658863544 -1.38077102747047e-05 -4.21087024733424e-05 2.56574203376658e-05 
0.0312537886202335 -8.65535912453197e-06 -4.12856825278141e-05 2.55737504630815e-05 
0.0297863408923149 -3.0805808819423e-06 -4.04185921070166e-05 2.61213936028071e-05 
0.0284207537770271 2.40046188082488e-06 -3.91752364521381e-05 2.69912816293072e-05 
0.0270662680268288 7.41443136575981e-06 -3.76857387891505e-05 2.76387054327643e-05 
0.0257315784692764 1.18274901979021e-05 -3.57462777174078e-05 2.82304972643033e-05 
0.0244281906634569 1.69755239767255e-05 -3.43631108989939e-05 2.91887063212926e-05 
0.0231593623757362 2.07720677281031e-05 -3.41920895152725e-05 2.95059799100272e-05 
0.0218795947730541 2.38269076362485e-05 -3.32421659550164e-05 2.98861141345697e-05 
0.0206608511507511 2.60694596363464e-05 -3.31798692059238e-05 2.96679390885402e-05 
0.0194829776883125 2.91129290417302e-05 -3.28092282870784e-05 2.93537377729081e-05 
0.0183869507163763 3.11039730149787e-05 -3.29554823110811e-05 2.8947290047654e-05 
0.0173876564949751 3.32387426169589e-05 -3.20925973937847e-05 2.86479535134276e-05 
0.0165257751941681 3.51182607118972e-05 -3.19360769935884e-05 2.8109920094721e-05 
0.0157856270670891 3.67257089237683e-05 -3.13458913296927e-05 2.78889983746922e-05 
0.0151752084493637 3.76283933292143e-05 -3.06706024275627e-05 2.77764229394961e-05 
0.0146737098693848 3.79373195755761e-05 -2.97742280963575e-05 2.74341400654521e-05 
0.0142705580219626 3.8572874473175e-05 -2.90554453385994e-05 2.72044599114452e-05 
0.0139480838552117 3.8891339499969e-05 -2.83453373413067e-05 2.70030977844726e-05 
0.0137264030054212 3.94843045796733e-05 -2.71850258286577e-05 2.68322746705962e-05 
0.0135800233110785 3.97880867240019e-05 -2.67186915152706e-05 2.66630377154797e-05 
0.0135086728259921 3.98269366996828e-05 -2.65076705545653e-05 2.67151917796582e-05 
0.0135105550289154 4.01391880586743e-05 -2.62449502770323e-05 2.68714902631473e-05 
0.0135710081085563 4.06716681027319e-05 -2.61919558397494e-05 2.70964264927898e-05 
0.0136668058112264 4.09474523621611e-05 -2.68063758994685e-05 2.74554458883358e-05 
0.0137753589078784 4.17452502006199e-05 -2.69730353466002e-05 2.75477996183326e-05 
0.0138972727581859 4.26972692366689e-05 -2.68681178567931e-05 2.78629104286665e-05 
0.013989687897265 4.29302817792632e-05 -2.67058621830074e-05 2.78826792055042e-05 
0.0140538876876235 4.31318549090065e-05 -2.62751218542689e-05 2.78704701486276e-05 
0.0140654407441616 4.42302589362953e-05 -2.59256703429855e-05 2.7463438527775e-05 
0.0140441609546542 4.46563462901395e-05 -2.54197475442197e-05 2.73759633273585e-05 
0.0139681855216622 4.53262291557621e-05 -2.47568041231716e-05 2.70155651378445e-05 
0.0138654829934239 4.58659342257306e-05 -2.44374805333791e-05 2.68520561803598e-05 
0.0137510029599071 4.6683031541761e-05 -2.40109675360145e-05 2.66586230281973e-05 
0.0136308036744595 4.63792748632841e-05 -2.28358403546736e-05 2.65851122094318e-05 
0.0135185457766056 4.63595970359165e-05 -2.19718422158621e-05 2.6260760932928e-05 
0.0134406359866261 4.71989769721404e-05 -2.13442290259991e-05 2.63480742432876e-05 
0.0133895371109247 4.83467993035447e-05 -2.07998382393271e-05 2.60981123574311e-05 
0.0133705325424671 4.92143044539262e-05 -2.06467902899021e-05 2.60748238360975e-05 
0.0133846756070852 5.052952474216e-05 -2.07936718652491e-05 2.61118730122689e-05 
0.0134155927225947 5.15753599756863e-05 -2.08960627787746e-05 2.64246991719119e-05 
0.013470945879817 5.25126852153335e-05 -2.19031589949736e-05 2.63100937445415e-05 
0.0135182766243815 5.33759412064683e-05 -2.2440875909524e-05 2.62621106230654e-05 
0.0135556869208813 5.46617484360468e-05 -2.34872022701893e-05 2.58916825259803e-05 
0.0135937910526991 5.59869295102544e-05 -2.42481273744488e-05 2.5653711418272e-05 
0.0136208543553948 5.70561351196375e-05 -2.46592662733747e-05 2.51563906203955e-05 
0.0136113492771983 5.76291567995213e-05 -2.41103480220772e-05 2.46690451604081e-05 
0.0136124640703201 5.89832197874784e-05 -2.42661571974168e-05 2.42393489315873e-05 
0.0136016039177775 5.85769230383448e-05 -2.39915316342376e-05 2.38005886785686e-05 
0.0135605921968818 5.87123759032693e-05 -2.37089534493862e-05 2.33501850743778e-05 
0.0135123450309038 5.91654534218833e-05 -2.34657309192698e-05 2.27868240472162e-05 
0.0134516963735223 5.98314582020976e-05 -2.35987208725419e-05 2.20267629629234e-05 
0.0133738433942199 5.94580378674436e-05 -2.38227694353554e-05 2.10793768928852e-05 
0.0132615212351084 6.03043117735069e-05 -2.29581528401468e-05 1.9899218386854e-05 
0.0131488731130958 6.00856328674126e-05 -2.31553185585653e-05 1.86339439096628e-05 
0.0130025753751397 6.11407012911513e-05 -2.36410014622379e-05 1.708285890345e-05 
0.0128393582999706 6.16770630585961e-05 -2.44480033870786e-05 1.53545806824695e-05 
0.0126543389633298 6.34615644230507e-05 -2.51950114034116e-05 1.34124966280069e-05 
0.012492785230279 6.52748785796575e-05 -2.73011246463284e-05 1.1419852853578e-05 
0.0122942887246609 6.82999598211609e-05 -2.91523847408826e-05 8.847131539369e-06 
0.0120959021151066 7.08688603481278e-05 -3.15991710522212e-05 6.40195685264189e-06 
0.0118526192381978 7.37585505703464e-05 -3.45623266184703e-05 3.4638114811969e-06 
0.0115759372711182 7.63037096476182e-05 -3.71117930626497e-05 5.93256913816731e-07 
0.0112278629094362 7.9265511885751e-05 -3.95626157114748e-05 -2.31389822147321e-06 
0.0108273839578032 8.21434514364228e-05 -4.19380266976077e-05 -5.47032459508046e-06 
0.01032395940274 8.44928072183393e-05 -4.44160832557827e-05 -9.11884217202896e-06 
0.00979011598974466 8.68142087711021e-05 -4.67928512080107e-05 -1.27425182654406e-05 
0.00917666405439377 8.74508914421313e-05 -4.8958452680381e-05 -1.65381406986853e-05 
0.00853561609983444 8.81796149769798e-05 -5.12943624926265e-05 -2.06946715479717e-05 
0.00787431094795465 8.71037555043586e-05 -5.34011160198133e-05 -2.44265283981804e-05 
0.00722744269296527 8.64956455188803e-05 -5.46725605090614e-05 -2.78593215625733e-05 
0.00655083172023296 8.44649548525922e-05 -5.4758940677857e-05 -3.1175855838228e-05 
0.00589077500626445 8.22830843389966e-05 -5.45768270967528e-05 -3.40927836077753e-05 
0.00522088399156928 7.84523144830018e-05 -5.26672993146349e-05 -3.60817430191673e-05 
0.00454582693055272 7.35658541088924e-05 -4.95068707095925e-05 -3.7593134038616e-05 
0.00389137305319309 6.65254701743834e-05 -4.43773969891481e-05 -3.78253062081058e-05 
0.00326912826858461 5.97394791839179e-05 -3.75361960323062e-05 -3.6857007216895e-05 
0.00269513903185725 5.26270305272192e-05 -2.96129564958392e-05 -3.51266899087932e-05 
0.00217100372537971 4.63174255855847e-05 -2.11963961191941e-05 -3.29548565787263e-05 
0.00170244602486491 4.04747806896921e-05 -1.21922757898574e-05 -3.01925756502897e-05 
0.00129623769316822 3.57330500264652e-05 -3.91006369682145e-06 -2.74801604973618e-05 
0.000959413882810622 3.18341371894348e-05 2.84888233181846e-06 -2.44800321524963e-05 
0.000697375158779323 2.87471684714546e-05 7.98810106061865e-06 -2.15214167837985e-05 
0.000487907935166731 2.54181031777989e-05 1.13933656393783e-05 -1.88108006113907e-05 
0.000352975417627022 2.3239377696882e-05 1.29578747873893e-05 -1.62271953740856e-05 
0.000245113216806203 2.11925544135738e-05 1.33818339236313e-05 -1.37871265906142e-05 
0.000170635728863999 1.81800405698596e-05 1.28073770611081e-05 -1.19968426588457e-05 
9.99591720756143e-05 1.55019624799024e-05 1.22145765999448e-05 -1.0337917956349e-05 
5.3240786655806e-05 1.35771661007311e-05 1.1861262464663e-05 -8.71240627020597e-06 
5.74838577449555e-06 1.1406172234274e-05 1.11908266262617e-05 -7.57079487812007e-06 
-2.16250355151715e-05 9.43272152653662e-06 1.01990490293247e-05 -6.76403487887001e-06 
-5.05315547343343e-05 8.41526525618974e-06 9.53754533838946e-06 -5.8904588513542e-06 
-7.71189879742451e-05 7.69136931921821e-06 9.29173438635189e-06 -5.21369565831264e-06 
-0.000102272839285433 6.70547751724371e-06 8.52883113111602e-06 -4.71147495773039e-06 
-0.00014857726637274 6.28646557743195e-06 9.42196857067756e-06 -4.05164928451995e-06 
0 0 0 0 
0 0 0 0 
0 0 0 0 
0 0 0 0 
0 0 0 0 
0 0 0 0 
0 0 0 0 
0 0 0 0 
0 0 0 0 
0 0 0 0 
0 0 0 0 
0 0 0 0 
0 0 0 0 
0 0 0 0 
99.5766372680664 0.309601217508316 0.0757878124713898 0.0286864023655653 
