0 0 0 0 
0 0 0 0 
0 0 0 0 
0 0 0 0 
0 0 0 0 
0 0 0 0 
0 0 0 0 
0 0 0 0 
0 0 0 0 
0 0 0 0 
0.00681220320984721 0.000404545426135883 -2.06753065867815e-06 2.99272178381216e-05 
0.0108145317062736 0.000632515468169004 -7.51031575418892e-06 3.6850011383649e-05 
0.0158830005675554 0.000899318722076714 -5.97784583078464e-06 3.95951101381797e-05 
0.0215772073715925 0.00116472051013261 -1.21925972962345e-06 4.17439368902706e-05 
0.0296460520476103 0.00144487083889544 8.16871579445433e-06 4.07781335525215e-05 
0.0400217287242413 0.00169216422364116 2.86811791738728e-05 3.14959252136759e-05 
0.0516095124185085 0.00184199225623161 5.36535590072162e-05 1.69432241818868e-05 
0.0640687793493271 0.00186084012966603 7.24441488273442e-05 2.66926258518652e-06 
0.0768315717577934 0.00173303135670722 8.38210180518217e-05 -1.02860149127082e-05 
0.0883063748478889 0.00147101352922618 8.79853978403844e-05 -2.14888732443796e-05 
0.0980391725897789 0.00114191474858671 7.78793255449273e-05 -2.48167798417853e-05 
0.106612727046013 0.000832425255794078 5.98716687818523e-05 -2.29429515457014e-05 
0.11393953114748 0.000589970790315419 4.31953085353598e-05 -2.15394884435227e-05 
0.119826272130013 0.000427241931902245 2.89008294203086e-05 -2.06624627026031e-05 
0.124669499695301 0.000335932418238372 1.64165758178569e-05 -1.95724769582739e-05 
0.128708109259605 0.000288901355816051 6.74424973112764e-06 -1.83521824510535e-05 
0.132349163293839 0.000251352408668026 -1.32530502128247e-07 -1.73729586094851e-05 
0.135926380753517 0.000225172014324926 -6.1435684983735e-06 -1.61075258802157e-05 
0.139450713992119 0.000205887132324278 -1.06562247310649e-05 -1.50614514495828e-05 
0.142841279506683 0.000188459962373599 -1.31818305817433e-05 -1.4674078556709e-05 
0.146047100424767 0.0001760180311976 -1.57204503921093e-05 -1.46601205415209e-05 
0.148950770497322 0.000179646885953844 -1.75608529389137e-05 -1.42452418003813e-05 
0.151424705982208 0.00017980117991101 -1.78709869942395e-05 -1.42424478326575e-05 
0.153704404830933 0.000179216265678406 -1.94017575267935e-05 -1.23633553812397e-05 
0.155751451849937 0.00017253210535273 -2.25705007323995e-05 -8.34017282613786e-06 
0.157687291502953 0.000160400290042162 -2.76287846645573e-05 -3.02830562759482e-06 
0.159474655985832 0.000137818526127376 -3.15839242830407e-05 3.09276543930537e-07 
0.16125699877739 0.000115363283839542 -3.63081453542691e-05 2.7706471428246e-06 
0.162932008504868 9.07977519091219e-05 -4.1123366827378e-05 3.47434024661197e-06 
0.164341166615486 7.21773467375897e-05 -4.29316023655701e-05 2.15090904021054e-06 
0.165375873446465 4.64183649455663e-05 -4.08355226682033e-05 -8.19295223664085e-07 
0.166245967149734 1.66447516676271e-05 -4.17060837207828e-05 -1.10928777274921e-08 
0.166636362671852 -1.55731995619135e-05 -4.22524935856927e-05 2.04609932552557e-06 
0.16663633286953 -5.44516769878101e-05 -4.10712600569241e-05 4.20695778302616e-06 
0.166228175163269 -9.5550472906325e-05 -4.12344743381254e-05 7.22666254659998e-06 
0.165406480431557 -0.000131635461002588 -4.03849735448603e-05 1.05698327388382e-05 
0.164057105779648 -0.000166813362739049 -3.65898995369207e-05 1.07661107904278e-05 
0.162332907319069 -0.00020226978813298 -3.04772729577962e-05 1.11742074295762e-05 
0.160082668066025 -0.000230863195611164 -2.42132209677948e-05 1.18807174658286e-05 
0.157512202858925 -0.000258842686889693 -1.79408434632933e-05 1.12554280349286e-05 
0.154617920517921 -0.000285598100163043 -1.49492771015503e-05 1.10236223918037e-05 
0.151438996195793 -0.000302817177725956 -1.16045093818684e-05 1.16766277642455e-05 
0.147915303707123 -0.000315615208819509 -1.02951789813233e-05 1.14229778773733e-05 
0.143973410129547 -0.000320114457281306 -7.85220709076384e-06 9.95402024273062e-06 
0.13970060646534 -0.000316929974360391 -4.53048096460407e-06 8.87735495780362e-06 
0.135137125849724 -0.000317496451316401 6.28862039775413e-07 7.53199265091098e-06 
0.130321651697159 -0.000318684295052662 5.286028226692e-06 5.82571738050319e-06 
0.125360101461411 -0.000324785622069612 9.12012546905316e-06 4.43518092652084e-06 
0.120487257838249 -0.000340576400049031 1.11133767859428e-05 3.79462767341465e-06 
0.115460179746151 -0.000359902827767655 1.24654470710084e-05 3.44080785907863e-06 
0.110349394381046 -0.000373018177924678 1.4106467460806e-05 2.9044588245597e-06 
0.10503925383091 -0.000387891865102574 1.50935220517567e-05 2.74000490207982e-06 
0.0995563194155693 -0.000401523662731051 1.67003763635876e-05 2.80579206446419e-06 
0.0937806069850922 -0.000407879531849176 1.87742389243795e-05 2.82629025605274e-06 
0.0877945199608803 -0.000415178714320064 2.13815364986658e-05 2.46099534706445e-06 
0.0816848799586296 -0.000422494893427938 2.35368715948425e-05 2.61587501881877e-06 
0.0756865814328194 -0.000429534760769457 2.67430859821616e-05 2.33840796681761e-06 
0.0699231252074242 -0.000432407454354689 3.00744977721479e-05 2.42869509747834e-06 
0.0646307021379471 -0.000443415105110034 3.34862852469087e-05 2.73646764981095e-06 
0.0599162429571152 -0.00044921986409463 3.60803896910511e-05 3.43672013514151e-06 
0.0557548329234123 -0.000453551998361945 3.83734550268855e-05 3.47740228789917e-06 
0.0520798452198505 -0.000453461776487529 3.88173029932659e-05 4.12808640248841e-06 
0.0488590486347675 -0.000455670960946009 3.80711535399314e-05 4.77223284178763e-06 
0.0459721572697163 -0.000448714301455766 3.73614711861592e-05 5.52910796614015e-06 
0.0434305854141712 -0.000444443605374545 3.70601192116737e-05 5.98683936914313e-06 
0.0412105023860931 -0.000437980284914374 3.70526759070344e-05 6.38648634776473e-06 
0.0392821989953518 -0.000435755908256397 3.77864671463612e-05 6.7620285335579e-06 
0.0375456884503365 -0.000432527478551492 3.89281813113485e-05 6.74244938636548e-06 
0.0359471701085567 -0.000429147650720552 3.90899986086879e-05 6.3294792198576e-06 
0.0344083346426487 -0.000423705234425142 3.87753752875142e-05 5.850937213836e-06 
0.0328857861459255 -0.000419755902839825 3.79009179596324e-05 5.23458129464416e-06 
0.0313043594360352 -0.00040893375989981 3.65258092642762e-05 4.59294551546918e-06 
0.0297751780599356 -0.000396146846469492 3.52633360307664e-05 3.98623751607374e-06 
0.028257355093956 -0.000383606762625277 3.51093949575443e-05 3.22966479870956e-06 
0.0267543233931065 -0.000370782363461331 3.50561022059992e-05 2.62739536083245e-06 
0.025250380858779 -0.000356617674697191 3.51367198163643e-05 2.27218720283417e-06 
0.0238139741122723 -0.000347475375747308 3.5174689401174e-05 1.92500124285289e-06 
0.0224207956343889 -0.000337841804139316 3.50357549905311e-05 1.73073635778564e-06 
0.021113084629178 -0.000328993861330673 3.41741724696476e-05 1.71978103935544e-06 
0.0199111700057983 -0.00032089083106257 3.29287322529126e-05 1.72857062352705e-06 
0.0188720896840096 -0.000313291646307334 3.16482328344136e-05 1.76303922216903e-06 
0.0179570540785789 -0.000304633722407743 3.02063981507672e-05 1.92531751963543e-06 
0.0171602685004473 -0.000298481230856851 2.87231196125504e-05 2.13933321902005e-06 
0.0165095962584019 -0.00029345610528253 2.74391404673224e-05 2.35531501857622e-06 
0.0159565657377243 -0.00028885158826597 2.68449002760462e-05 2.6491084099689e-06 
0.0155098289251328 -0.000285673682810739 2.66896877292311e-05 2.81037864624523e-06 
0.015138235874474 -0.00028197726351209 2.74326484941412e-05 2.82299379250617e-06 
0.0148785933852196 -0.00028084046789445 2.85293936030939e-05 2.85695364254934e-06 
0.0146884638816118 -0.000281101296423003 3.01052732538665e-05 2.82641735793732e-06 
0.0145725309848785 -0.000283539615338668 3.14068638544995e-05 2.84172028841567e-06 
0.0144553715363145 -0.000285456102574244 3.25595065078232e-05 3.00325723401329e-06 
0.0143562322482467 -0.000289118324872106 3.3358624932589e-05 3.18099409923889e-06 
0.0142015339806676 -0.000287815229967237 3.42670937243383e-05 3.2019324862631e-06 
0.0139931291341782 -0.000285662012174726 3.46930864907335e-05 3.30567286255246e-06 
0.0137181421741843 -0.000281459011603147 3.50557711499278e-05 3.28000942317885e-06 
0.013371360488236 -0.000275472702924162 3.49324836861342e-05 3.19003629556391e-06 
0.0129475044086576 -0.000266720104264095 3.45880762324668e-05 3.05231719721633e-06 
0.012464040890336 -0.000258073327131569 3.37005585606676e-05 2.97490032608039e-06 
0.0119334999471903 -0.00024833480711095 3.27440975524951e-05 2.92010463454062e-06 
0.0113714020699263 -0.000237310014199466 3.158523759339e-05 2.80369158645044e-06 
0.0108109628781676 -0.000226528965868056 3.03647921100492e-05 2.6910058750218e-06 
0.0102727981284261 -0.000217414839426056 2.88667415588861e-05 2.68845519713068e-06 
0.0097600631415844 -0.000209388017538004 2.75179900199873e-05 2.67128825726104e-06 
0.00928418152034283 -0.000201757880859077 2.6051166059915e-05 2.63320180238225e-06 
0.00884858798235655 -0.000195004147826694 2.49462063948158e-05 2.66844494944962e-06 
0.00847373064607382 -0.000190147489774972 2.41289817495272e-05 2.70514556177659e-06 
0.00814833678305149 -0.000185188488103449 2.3805314413039e-05 2.57896408584202e-06 
0.00787714030593634 -0.000181226860149764 2.37149833992589e-05 2.51035976361891e-06 
0.00765342125669122 -0.000178427057107911 2.37964977714e-05 2.45316482505586e-06 
0.00746698956936598 -0.000176416710019112 2.35814459301764e-05 2.49514073402679e-06 
0.00731543963775039 -0.000174347864231095 2.35383358813124e-05 2.45580372393306e-06 
0.0071890470571816 -0.000172760264831595 2.33503615163499e-05 2.44716216002416e-06 
0.00709964707493782 -0.000172204134287313 2.3093572963262e-05 2.45041519519873e-06 
0.00702525395900011 -0.000170863539096899 2.31101403187495e-05 2.40782901528291e-06 
0.00699154613539577 -0.000170291823451407 2.34844792430522e-05 2.32217507800669e-06 
0.00697880005463958 -0.000169920531334355 2.38125812757062e-05 2.28898829846003e-06 
0.00699423253536224 -0.000170095314388163 2.4201628548326e-05 2.28428598347818e-06 
0.0070085278712213 -0.000170749190147035 2.43029535340611e-05 2.31044509746425e-06 
0.0070257936604321 -0.000171487292391248 2.43179292738205e-05 2.30645241572347e-06 
0.00704396888613701 -0.000171763487742282 2.40321005549049e-05 2.22669109462004e-06 
0.00705436198040843 -0.000171081206644885 2.37198273680406e-05 2.17412389247329e-06 
0.00703492294996977 -0.000168618193129078 2.35610532399733e-05 2.14607030102343e-06 
0.00701553607359529 -0.000164117242093198 2.3576625608257e-05 2.11552378459601e-06 
0.00699718203395605 -0.000160113020683639 2.35649931710213e-05 2.04636648959422e-06 
0.00694867689162493 -0.000154826877405867 2.35335792240221e-05 1.99548480850353e-06 
0.00687598111107945 -0.000148792183608748 2.34523831750266e-05 1.90554806067667e-06 
0.00681786984205246 -0.000144115372677334 2.30590521823615e-05 1.82687176675245e-06 
0.0067323837429285 -0.000139384501380846 2.31058129429584e-05 1.52125710428663e-06 
0.00663760816678405 -0.000135342692374252 2.32342154049547e-05 1.46624688568409e-06 
0.00651862286031246 -0.000132301734993234 2.34768594964407e-05 1.3422525171336e-06 
0.00638517271727324 -0.000130629792693071 2.37271833611885e-05 1.28533611132298e-06 
0.00619018031284213 -0.000128780215163715 2.43048471020302e-05 1.15943623768544e-06 
0.00595710193738341 -0.000127621999126859 2.44774710154161e-05 1.2684635066762e-06 
0.00566315278410912 -0.000125371196190827 2.4463573936373e-05 1.15462046323955e-06 
0.00533718429505825 -0.000123036137665622 2.42212699959055e-05 1.15104069209337e-06 
0.00496719684451818 -0.000120004675409291 2.36468968068948e-05 1.04401522094122e-06 
0.00457446789368987 -0.000116519644507207 2.25868116103811e-05 9.6641326763347e-07 
0.00415305513888597 -0.000111896733869798 2.11689603020204e-05 8.84177552507026e-07 
0.00371330324560404 -0.000106210623926017 1.939902358572e-05 8.01726685040194e-07 
0.0032526773866266 -9.76033770712093e-05 1.73018634086475e-05 7.35175433419499e-07 
0.00278962519951165 -8.84770124685019e-05 1.50529522215948e-05 7.0701844379073e-07 
0.00233687902800739 -7.86318996688351e-05 1.25094820759841e-05 7.34000195734552e-07 
0.00191697815898806 -6.90735396347009e-05 9.95207483356353e-06 7.06161642938241e-07 
0.00154052919242531 -5.91128518863115e-05 7.41580106478068e-06 7.31689056010509e-07 
0.0012158463941887 -5.02583534398582e-05 5.36681955054519e-06 7.42226802685764e-07 
0.000948072236496955 -4.15391332353465e-05 3.59031764674e-06 6.73569672926533e-07 
0.000738037924747914 -3.36903140123468e-05 2.23233246288146e-06 5.60858211429149e-07 
0.000575798097997904 -2.65174312517047e-05 1.308527657784e-06 4.04257008312925e-07 
0.000439944938989356 -2.00799076992553e-05 6.52271921808278e-07 2.774714005227e-07 
0.000347930093994364 -1.64863577083452e-05 -7.99642663196209e-08 1.82251326918959e-07 
0.0002811323502101 -1.39708354254253e-05 -5.01338490721537e-07 8.20351786501305e-08 
0.000222527072764933 -1.09375459942385e-05 -7.67755523156666e-07 1.19701255130167e-07 
0.000182199932169169 -8.83571010490414e-06 -9.45225224313617e-07 1.48936678101563e-07 
0.000159407005412504 -7.34225795895327e-06 -7.3211566586906e-07 1.88544220236508e-07 
0.00013618022785522 -5.63029288969119e-06 -1.04883696394609e-07 9.31087029698574e-08 
0.000117531992145814 -3.7198581139819e-06 7.55218991344009e-07 7.45418020642319e-08 
0.000124028403661214 -3.32048944073904e-06 2.10814050660701e-06 -8.51236308108128e-08 
0.000129076404846273 -2.76716195912741e-06 3.92419951822376e-06 -1.79532989363906e-07 
0.000149269457324408 -2.57563601735455e-06 6.0777279031754e-06 -3.31575080281254e-07 
0.000178458605660126 -2.22742414734967e-06 8.42949521029368e-06 -4.14905372281282e-07 
0.000214697283809073 -1.51204892517853e-06 1.1352821275068e-05 -4.46887725047418e-07 
0 0 0 0 
0 0 0 0 
0 0 0 0 
0 0 0 0 
0 0 0 0 
0 0 0 0 
0 0 0 0 
0 0 0 0 
0 0 0 0 
0 0 0 0 
0 0 0 0 
0 0 0 0 
0 0 0 0 
0 0 0 0 
99.3685607910156 0.563703715801239 0.0368781499564648 0.0126188788563013 
