0 0 0 0 
0 0 0 0 
0 0 0 0 
0 0 0 0 
0 0 0 0 
0 0 0 0 
0 0 0 0 
0 0 0 0 
0 0 0 0 
0 0 0 0 
0.00276771234348416 6.50625634079915e-06 -9.27854998735711e-05 -1.15219099825481e-05 
0.00374727393500507 1.33388411995838e-05 -0.000116812763735652 -1.52572911247262e-05 
0.00462867552414536 2.22343787754653e-05 -0.000136247501359321 -1.87446712516248e-05 
0.0055617387406528 3.30192706314847e-05 -0.000154519904754125 -2.16657663258957e-05 
0.00658899126574397 5.13449667778332e-05 -0.000164990589837544 -2.31602971325628e-05 
0.00762221636250615 7.3253017035313e-05 -0.000167934020282701 -2.25953717745142e-05 
0.0085682449862361 9.41073449212126e-05 -0.000166330821230076 -2.05179112526821e-05 
0.00935891643166542 0.000111136912892107 -0.000161500938702375 -1.757184327289e-05 
0.00990260951220989 0.00012090274685761 -0.000154518871568143 -1.41351692946046e-05 
0.0101169524714351 0.000118101459520403 -0.000150729014421813 -1.1139365597046e-05 
0.0100620239973068 0.000107725558336824 -0.000149150582728907 -8.97455083759269e-06 
0.00984911527484655 9.32221664697863e-05 -0.00014867122808937 -7.27594851923641e-06 
0.00955450721085072 7.79171678004786e-05 -0.00014781643403694 -5.62099603484967e-06 
0.00920724403113127 6.35556061752141e-05 -0.000145598707604222 -4.13894122175407e-06 
0.00882404670119286 5.13625491294079e-05 -0.000141365366289392 -2.66627898781735e-06 
0.00843781232833862 4.01705729018431e-05 -0.000136081565869972 -1.54982569711137e-06 
0.00805886089801788 3.09977986034937e-05 -0.000128951694932766 -6.928638640602e-07 
0.00768752256408334 2.34909257414984e-05 -0.000121042110549752 3.48914923620214e-08 
0.0073319892399013 1.72070340340724e-05 -0.000112468558654655 6.95383562288043e-07 
0.00697908410802484 1.21170387501479e-05 -0.00010438307072036 1.14551949081942e-06 
0.0066296299919486 8.35872742754873e-06 -9.62947015068494e-05 1.52140341924678e-06 
0.00629203720018268 5.15580359206069e-06 -8.93116521183401e-05 1.84205521236436e-06 
0.0059706075116992 2.94220740215678e-06 -8.26733812573366e-05 1.96719656742061e-06 
0.00565776461735368 1.80581230324606e-06 -7.72979910834692e-05 1.96728592527506e-06 
0.00531420297920704 3.51019423305843e-07 -7.21973192412406e-05 1.84295060989825e-06 
0.00496639497578144 -1.20186302865477e-06 -6.66582782287151e-05 1.7023066902766e-06 
0.00466008111834526 -2.13236535273609e-06 -5.9952955780318e-05 1.6932522157731e-06 
0.00440759351477027 -3.97268559026998e-06 -5.30629367858637e-05 1.61727029990288e-06 
0.00421999488025904 -6.05811737841577e-06 -4.58647664345335e-05 1.67022392361105e-06 
0.00414135586470366 -7.8135599324014e-06 -3.84080449293833e-05 1.77011645519087e-06 
0.00415886426344514 -9.10210110305343e-06 -3.14934113703202e-05 1.91946560335055e-06 
0.00421300623565912 -1.11427671072306e-05 -2.56644161709119e-05 1.8456366888131e-06 
0.00430458318442106 -1.24445459732669e-05 -1.98547641048208e-05 1.82988685537566e-06 
0.00443937396630645 -1.39510184453684e-05 -1.41459458973259e-05 1.6577778296778e-06 
0.00463335169479251 -1.56076785060577e-05 -8.85910139913904e-06 1.49955656070233e-06 
0.00488527351990342 -1.75683380803093e-05 -4.14276473748032e-06 1.33805576751911e-06 
0.00519472407177091 -1.93979176401626e-05 2.23250694375565e-07 1.19330775305571e-06 
0.00554667832329869 -2.14112806133926e-05 3.98026168113574e-06 1.06966047042079e-06 
0.0059173759073019 -2.32307338592364e-05 7.4594640864234e-06 8.56806877891358e-07 
0.00628714403137565 -2.52448935498251e-05 1.05078970591421e-05 6.20950515894947e-07 
0.0066332072019577 -2.7802949261968e-05 1.28913297885447e-05 2.95807694783434e-07 
0.00695299636572599 -3.00160154438345e-05 1.5221223293338e-05 9.22084524290767e-08 
0.00724639929831028 -3.27720990753733e-05 1.80250863195397e-05 -3.62109005891398e-07 
0.00753943622112274 -3.61334496119525e-05 2.13662715395913e-05 -7.77170498622581e-07 
0.00783748831599951 -3.96475079469383e-05 2.55078521149699e-05 -1.23876748148177e-06 
0.00813999213278294 -4.25611797254533e-05 3.08491034957115e-05 -1.69972645380767e-06 
0.00846412964165211 -4.60688861494418e-05 3.70857960660942e-05 -2.36431651501334e-06 
0.00880052801221609 -4.92224498884752e-05 4.36827031080611e-05 -2.88216119770368e-06 
0.00914325471967459 -5.16359286848456e-05 5.06629839946982e-05 -3.11555504595162e-06 
0.00949616730213165 -5.43413152627181e-05 5.79214574827347e-05 -3.36989251081832e-06 
0.00986555777490139 -5.62195782549679e-05 6.5425963839516e-05 -3.4069605590048e-06 
0.010264802724123 -5.76117126911413e-05 7.30599713278934e-05 -3.34573496729718e-06 
0.0107128126546741 -5.92096948821563e-05 8.11559220892377e-05 -3.28692044604395e-06 
0.0112201916053891 -6.05267596256454e-05 8.97598802112043e-05 -3.22154892273829e-06 
0.0118153635412455 -6.14208765910007e-05 9.90177722997032e-05 -2.93098196380015e-06 
0.0125183556228876 -6.39029458397999e-05 0.000108793879917357 -2.80960466625402e-06 
0.0133248819038272 -6.67589047225192e-05 0.0001194360665977 -2.54338237937191e-06 
0.0142171885818243 -7.03794867149554e-05 0.000130226981127635 -2.34924686992599e-06 
0.0151861999183893 -7.41445473977365e-05 0.000141391792567447 -2.10951702683815e-06 
0.0161954034119844 -7.78992034611292e-05 0.000152773689478636 -1.93223536371079e-06 
0.0171882193535566 -8.16858446341939e-05 0.00016357412096113 -1.67723521826701e-06 
0.018092205747962 -8.47748378873803e-05 0.000173097767401487 -1.3719529761147e-06 
0.0188442338258028 -8.69959621923044e-05 0.000181649462319911 -9.73802457338024e-07 
0.0193394739180803 -8.90525698196143e-05 0.000187367870239541 -7.63390687552601e-07 
0.0194815751165152 -8.92919924808666e-05 0.000189029800822027 -6.85885879647685e-07 
0.0193013660609722 -8.73699682415463e-05 0.000188056175829843 -5.96822985698964e-07 
0.018805880099535 -8.55911275721155e-05 0.000183684474905021 -7.21069966402865e-07 
0.0180733688175678 -8.11312565929256e-05 0.000176227258634754 -8.34979857700091e-07 
0.0172159802168608 -7.7475851867348e-05 0.000167252204846591 -1.24168411730352e-06 
0.0163754187524319 -7.43497657822445e-05 0.000158133203512989 -1.57723115989938e-06 
0.015578955411911 -7.23628400010057e-05 0.00014917430235073 -2.2381143480743e-06 
0.0149216949939728 -7.02089819242246e-05 0.00014160705904942 -2.75949219030736e-06 
0.0144073748961091 -7.02554316376336e-05 0.000135075853904709 -3.34507785737514e-06 
0.0140497051179409 -6.89001753926277e-05 0.000130452637677081 -3.57055887434399e-06 
0.0138180376961827 -6.89518565195613e-05 0.000126875151181594 -3.88301805287483e-06 
0.0137163354083896 -6.78120995871723e-05 0.000124521902762353 -3.82689586331253e-06 
0.0136999078094959 -6.64216058794409e-05 0.000123041783808731 -3.84111172024859e-06 
0.0137588586658239 -6.60401929053478e-05 0.000122925630421378 -3.87434783988283e-06 
0.0138839641585946 -6.66416599415243e-05 0.000122990852105431 -4.09775111620547e-06 
0.0140737071633339 -6.74611073918641e-05 0.000124181678984314 -4.15654994867509e-06 
0.0143310613930225 -6.95943526807241e-05 0.000126430866657756 -4.37507651440683e-06 
0.014726790599525 -7.30631218175404e-05 0.000130667933262885 -4.56295902040438e-06 
0.0153640145435929 -7.64196302043274e-05 0.000137950119096786 -4.64647564513143e-06 
0.0165061708539724 -8.30631324788556e-05 0.000152253836859018 -4.85476675748941e-06 
0.0186414569616318 -9.45760257309303e-05 0.000177576905116439 -5.12003953190288e-06 
0.0227025970816612 -0.000113518020953052 0.000220627305679955 -5.44434078619815e-06 
0.0297602992504835 -0.000143800512887537 0.000283497327473015 -6.48669538350077e-06 
0.0408953875303268 -0.000182809220859781 0.000359783938620239 -6.88470117893303e-06 
0.0567397810518742 -0.000228286880883388 0.0004338463768363 -6.82146674080286e-06 
0.0771278217434883 -0.000272756995400414 0.00049023429164663 -5.44149588677101e-06 
0.100697107613087 -0.000317351223202422 0.000506844371557236 -3.71096075468813e-06 
0.124966368079185 -0.000343416148098186 0.000473066669655964 1.59869472327046e-07 
0.147715061903 -0.000363226397894323 0.000397178635466844 4.20852938987082e-06 
0.166821613907814 -0.000361634913133457 0.000292165466817096 8.46777038532309e-06 
0.181303709745407 -0.000359431083779782 0.000174530301592313 1.23894697026117e-05 
0.190911307930946 -0.000336458237143233 7.19669405953027e-05 1.37426923174644e-05 
0.196696415543556 -0.000315373443299904 -1.07265786937205e-05 1.47055552588427e-05 
0.199248746037483 -0.000297490507364273 -7.94615116319619e-05 1.3633640264743e-05 
0.199618324637413 -0.00028807733906433 -0.000117237301310524 1.19134128908627e-05 
0.19844776391983 -0.000272084347670898 -0.000137562063173391 1.04126793303294e-05 
0.196165502071381 -0.000268539966782555 -0.000164706623763777 9.85983569989912e-06 
0.193150132894516 -0.000258252868661657 -0.000185457291081548 8.87270743987756e-06 
0.189889281988144 -0.000244670925894752 -0.000188540012459271 6.981592377997e-06 
0.186419799923897 -0.000221306661842391 -0.000200466587557457 7.10584299667971e-06 
0.182931020855904 -0.000207403369131498 -0.000205271950107999 4.98837016493781e-06 
0.179610311985016 -0.000182142757694237 -0.000197096873307601 4.90091315441532e-06 
0.176237493753433 -0.000167269332450815 -0.000186751422006637 5.29790850123391e-06 
0.173064261674881 -0.000137446448206902 -0.000170078492374159 6.82698373566382e-06 
0.169818982481956 -0.000120797754789237 -0.000155611691297963 6.67177891955362e-06 
0.166359230875969 -8.60964501043782e-05 -0.000143075929372571 7.21842070561252e-06 
0.162800028920174 -5.4565112804994e-05 -0.000125688544358127 7.85694282967597e-06 
0.159110099077225 -3.22765081364196e-05 -0.000113631707790773 4.97573228130932e-06 
0.155097872018814 -2.02059527509846e-05 -0.000111394154373556 2.19090520658938e-06 
0.151203483343124 5.10959898747387e-06 -9.6695359388832e-05 -5.15736985562398e-07 
0.14709997177124 1.95586508198176e-05 -8.57317209010944e-05 -3.17843523589545e-06 
0.14284285902977 2.78570150840096e-05 -7.38195885787718e-05 -7.67476194596384e-06 
0.138600021600723 5.01057111250702e-05 -6.02913496550173e-05 -1.03883876363398e-05 
0.134168654680252 7.77109016780742e-05 -4.27634186053183e-05 -1.27797302411636e-05 
0.129546627402306 0.000103365113318432 -2.92123822873691e-05 -1.55818634084426e-05 
0.124912284314632 0.000137206065119244 -1.80521547008539e-05 -1.82178355316864e-05 
0.120206989347935 0.000171411302289926 -6.95335484124371e-06 -2.00966151169268e-05 
0.115282602608204 0.000215336767723784 9.82491837930866e-06 -2.23291353904642e-05 
0.11040285974741 0.00025989199639298 2.24446739593986e-05 -2.32688289543148e-05 
0.10540845990181 0.000313224561978132 3.31517730955966e-05 -2.37611620832467e-05 
0.100581988692284 0.000372954295016825 4.8567741032457e-05 -2.30376645049546e-05 
0.0957599580287933 0.000442480872152373 6.27366098342463e-05 -2.21394475374836e-05 
0.0910554751753807 0.000508457014802843 7.69008547649719e-05 -2.02074043045286e-05 
0.0861786007881165 0.000582607521209866 8.96251294761896e-05 -1.85871012945427e-05 
0.0813884437084198 0.000651729118544608 0.000100780685897917 -1.7156124158646e-05 
0.07646494358778 0.000711370201315731 0.000112700370664243 -1.66283643920906e-05 
0.0714306235313416 0.000776952540036291 0.000117732750368305 -1.51720132635091e-05 
0.0661677792668343 0.000838887644931674 0.000123510486446321 -1.20628901640885e-05 
0.0609236769378185 0.000899377220775932 0.000126927217934281 -7.62700165068964e-06 
0.0555529184639454 0.000949243782088161 0.000128867977764457 -2.49106187766301e-06 
0.0502494126558304 0.00100024987477809 0.000126612561871298 3.65980781680264e-06 
0.0451195724308491 0.0010359538719058 0.000124583049910143 1.02440508271684e-05 
0.0403135232627392 0.00106442347168922 0.000116894792881794 1.59852552314987e-05 
0.0357895046472549 0.00107322621624917 0.000104854087112471 1.99282640096499e-05 
0.0315645486116409 0.00107090582605451 8.9276785729453e-05 2.36318392126122e-05 
0.0275351498275995 0.00104745198041201 7.07648578099906e-05 2.56233252002858e-05 
0.0237576030194759 0.00100783456582576 4.92103863507509e-05 2.59298576565925e-05 
0.0202510040253401 0.00094626861391589 2.52231839112937e-05 2.37615131482016e-05 
0.0170145127922297 0.000871059426572174 1.04213131635333e-06 2.0096782463952e-05 
0.0140886669978499 0.000783661555033177 -2.351595867367e-05 1.45290405271226e-05 
0.0114969881251454 0.000693685782607645 -4.7179182729451e-05 8.25983079266734e-06 
0.00922031886875629 0.000599421618971974 -6.85269114910625e-05 1.59862031523517e-06 
0.00729914288967848 0.000511129037477076 -8.48417766974308e-05 -4.05129185310216e-06 
0.00571991363540292 0.000430347572546452 -9.44966595852748e-05 -8.1794232755783e-06 
0.00445332704111934 0.000359666242729872 -9.84475773293525e-05 -1.08086051113787e-05 
0.00345832318998873 0.000297157821478322 -9.82501805992797e-05 -1.23907329907524e-05 
0.00270639709196985 0.000246231153141707 -9.35985954129137e-05 -1.25674159789924e-05 
0.00213305233046412 0.000204862080863677 -8.61956141307019e-05 -1.19001151688281e-05 
0.0016949272248894 0.000170430634170771 -7.81007765908726e-05 -1.09980428533163e-05 
0.00135334627702832 0.000141366719617508 -6.9774963776581e-05 -1.01967170849093e-05 
0.00110160454642028 0.000118691939860582 -6.15180979366414e-05 -8.98515918379417e-06 
0.000896215904504061 9.92638160823844e-05 -5.45661641808692e-05 -8.1265343396808e-06 
0.000741694413591176 8.40485809021629e-05 -4.85103810206056e-05 -7.36393894840148e-06 
0.000608045724220574 7.15100904926658e-05 -4.35429465142079e-05 -6.69432620270527e-06 
0.000503983930684626 6.11405557719991e-05 -3.92287111026235e-05 -5.95171695749741e-06 
0.000412084453273565 5.18711312906817e-05 -3.45737098541576e-05 -5.30667739440105e-06 
0.000315587472869083 4.25070684286766e-05 -3.15066245093476e-05 -4.90805086883483e-06 
0 0 0 0 
0 0 0 0 
0 0 0 0 
0 0 0 0 
0 0 0 0 
0 0 0 0 
0 0 0 0 
0 0 0 0 
0 0 0 0 
0 0 0 0 
0 0 0 0 
0 0 0 0 
0 0 0 0 
0 0 0 0 
99.3578796386719 0.431721091270447 0.181888714432716 0.0128636648878455 
