0 0 0 0 
0 0 0 0 
0 0 0 0 
0 0 0 0 
0 0 0 0 
0 0 0 0 
0 0 0 0 
0 0 0 0 
0 0 0 0 
0 0 0 0 
0.0159427896142006 0.00081653764937073 -8.8085413153749e-05 9.20379625313217e-06 
0.0206847731024027 0.00103882793337107 -0.000116989416710567 9.60381021286594e-06 
0.0259845685213804 0.00120788835920393 -0.000131115317344666 7.66086486692075e-06 
0.0329830721020699 0.00130396278109401 -0.00012055008119205 4.13211728300666e-06 
0.0435185842216015 0.00125381525140256 -6.34780517430045e-05 -8.13055123671802e-07 
0.0561800822615623 0.00108229124452919 2.70767231995706e-05 -4.58144586445997e-06 
0.0693830400705338 0.000844549387693405 0.000127204766613431 -6.29923670203425e-06 
0.0824980661273003 0.000591630174312741 0.000221533176954836 -5.77433411308448e-06 
0.0939657166600227 0.000379530712962151 0.000289416202576831 -2.88461160380393e-06 
0.102086126804352 0.000269107957137749 0.000309649796690792 6.67087306283065e-07 
0.108037732541561 0.000235439016250893 0.000296842335956171 3.14868771056354e-06 
0.113306365907192 0.000226836098590866 0.000270349177299067 3.52357983501861e-06 
0.118131846189499 0.000218068162212148 0.000239463013713248 2.03125978259777e-06 
0.122584864497185 0.000205062839086168 0.000205776275834069 3.13619295866374e-07 
0.126738294959068 0.000182701187441126 0.000173709253431298 -1.5286517509594e-06 
0.130630165338516 0.000161923642735928 0.000140609627123922 -3.15478450829687e-06 
0.134522080421448 0.000144008212373592 0.000111472974822391 -4.61760919279186e-06 
0.138455122709274 0.000116176102892496 8.19503329694271e-05 -4.94049481858383e-06 
0.142376974225044 9.39098244998604e-05 5.60276821488515e-05 -3.99875580114895e-06 
0.146152138710022 8.30966819194146e-05 3.37199635396246e-05 -2.49899699156231e-06 
0.149728715419769 6.61571830278262e-05 1.22109258882119e-05 -2.92871789042692e-07 
0.152813374996185 5.45206858078018e-05 -8.2230289990548e-06 1.80066365373932e-06 
0.155487835407257 5.24809875059873e-05 -2.43684098677477e-05 3.62935838893463e-06 
0.157714694738388 4.17812952946406e-05 -3.64488259947393e-05 4.32289880336612e-06 
0.15968544781208 2.56006769632222e-05 -4.83679359604139e-05 4.26190263169701e-06 
0.161539241671562 1.31861461341032e-05 -5.63852445338853e-05 2.55829718298628e-06 
0.163365110754967 -3.70011730410624e-06 -6.2376435380429e-05 7.46867783618654e-07 
0.165125668048859 -2.11309361475287e-05 -6.91863315296359e-05 -1.35178993332374e-06 
0.166827335953712 -3.97744479414541e-05 -7.58302630856633e-05 -3.50400159732089e-06 
0.168289974331856 -5.81019558012486e-05 -7.90861231507733e-05 -4.88223804495647e-06 
0.169132962822914 -6.8107940023765e-05 -8.24753151391633e-05 -6.29244823358022e-06 
0.169440224766731 -8.31406287034042e-05 -8.81296509760432e-05 -7.73169176682131e-06 
0.169184952974319 -8.80838269949891e-05 -8.8985230831895e-05 -8.6502468548133e-06 
0.168419167399406 -9.46250729612075e-05 -8.69656432769261e-05 -8.4403782238951e-06 
0.167065247893333 -9.269956353819e-05 -9.05915658222511e-05 -8.94991717359517e-06 
0.165432214736938 -9.73950227489695e-05 -9.28048029891215e-05 -7.15321220923215e-06 
0.163408875465393 -0.000101127232483122 -9.11608804017305e-05 -5.49590595255722e-06 
0.161002337932587 -0.000110499677248299 -8.818854985293e-05 -3.16149657919595e-06 
0.158296093344688 -0.000113110349047929 -8.72794917086139e-05 -1.72232353179425e-06 
0.155366241931915 -0.000133155728690326 -8.4654675447382e-05 3.45474802543322e-07 
0.152046337723732 -0.000145545898703858 -7.94742882135324e-05 9.14014776753902e-07 
0.148393616080284 -0.00015695950423833 -7.46514851925895e-05 2.81577285932144e-06 
0.144504189491272 -0.000170586223248392 -6.80663724779151e-05 2.56121143138444e-06 
0.139811038970947 -0.000181592244189233 -6.17463156231679e-05 2.12964437196206e-06 
0.134711608290672 -0.000179415466845967 -5.09120181959588e-05 1.46233173836663e-06 
0.129371583461761 -0.000188946156413294 -4.25902580900583e-05 5.49356968804204e-07 
0.123821929097176 -0.000192609732039273 -3.30653638229705e-05 -1.06456269577393e-07 
0.118060290813446 -0.000198667214135639 -2.58509226114256e-05 4.0693328173802e-07 
0.112485244870186 -0.0002096978132613 -1.90406699402956e-05 1.24392499856185e-06 
0.10689315199852 -0.000224287883611396 -1.33943049149821e-05 2.71686735686671e-06 
0.101222358644009 -0.00023592499201186 -7.37840764486464e-06 4.14187752539874e-06 
0.0955505296587944 -0.000244821218075231 -2.74439094027912e-06 4.99215639138129e-06 
0.0897204056382179 -0.000244366354309022 -3.18523660780556e-07 5.98025189901819e-06 
0.0838347747921944 -0.000241387257119641 3.12165025206923e-06 6.77040816299268e-06 
0.0778107196092606 -0.000234497056226246 6.90284150550724e-06 6.95203607392614e-06 
0.0717820227146149 -0.00022108355187811 9.39422443479998e-06 7.19276431482285e-06 
0.0658453106880188 -0.000206114302272908 1.02953954410623e-05 7.46073965274263e-06 
0.0602410286664963 -0.000191866609384306 1.0634614227456e-05 7.43210284781526e-06 
0.0551606714725494 -0.000172613916220143 1.02371204775409e-05 6.88308455210063e-06 
0.0506992563605309 -0.000156384150614031 9.38978519116063e-06 6.88971840645536e-06 
0.0468352772295475 -0.000141695723868906 7.35208550395328e-06 6.97019231665763e-06 
0.0435158498585224 -0.000132411645608954 8.24960352474591e-06 6.68902430334128e-06 
0.0406604520976543 -0.000123373916721903 8.88549402588978e-06 6.2988510762807e-06 
0.0381516292691231 -0.000116169969260227 9.2855316324858e-06 6.13507290836424e-06 
0.0359417274594307 -0.000108100226498209 8.89180500962539e-06 6.11499081060174e-06 
0.0340397842228413 -0.00010031602869276 1.08166559584788e-05 5.97894222664763e-06 
0.0323511101305485 -9.01234743651003e-05 1.06318830148666e-05 6.02347427047789e-06 
0.030850226059556 -8.46247348817997e-05 1.16135051939636e-05 6.15388444202836e-06 
0.0294575002044439 -7.67490564612672e-05 1.0986092092935e-05 6.09863081990625e-06 
0.0281556490808725 -6.80680022924207e-05 1.09114935185062e-05 5.6938583838928e-06 
0.026834549382329 -5.85358247917611e-05 8.97859627002617e-06 5.35645449417643e-06 
0.0255406480282545 -5.03089286212344e-05 7.18900491847307e-06 4.95410813527997e-06 
0.024290731176734 -3.86700266972184e-05 5.51080893274047e-06 4.43861517851474e-06 
0.0231082867830992 -3.21322841045912e-05 4.87580018670997e-06 4.14202258980367e-06 
0.0219000354409218 -2.55003287747968e-05 3.15026318276068e-06 4.01389161197585e-06 
0.0207645781338215 -2.18501299968921e-05 2.8284850941418e-06 3.85292878490873e-06 
0.0197128690779209 -1.79841226781718e-05 2.69703923549969e-06 3.80248457076959e-06 
0.0186969786882401 -1.38454261104926e-05 1.57998636041157e-06 3.72774456991465e-06 
0.0177491065114737 -7.93295839685015e-06 2.83383712940122e-07 3.67443885807006e-06 
0.0169402323663235 -8.88082411165669e-07 -5.61258502784767e-07 3.73077637050301e-06 
0.0162632912397385 4.68401094622095e-06 -1.46479226259544e-06 3.71496980733355e-06 
0.0156952776014805 1.05620129033923e-05 -3.26192957800231e-06 3.48187086274265e-06 
0.0152322836220264 1.54262870637467e-05 -4.921449090034e-06 3.60789044862031e-06 
0.0148664806038141 2.03394702111837e-05 -6.10351344221272e-06 3.50593768416729e-06 
0.014591502957046 2.4161232431652e-05 -7.46767136661219e-06 3.29981480717834e-06 
0.0143945720046759 2.97396600217326e-05 -9.08569290913874e-06 3.2977550290525e-06 
0.014283299446106 3.39406069542747e-05 -1.05213348433608e-05 3.1277634207072e-06 
0.0142694301903248 3.72587310266681e-05 -1.11442477646051e-05 2.81197389995214e-06 
0.0143619263544679 3.89026317861862e-05 -1.14374443000997e-05 2.72356169261911e-06 
0.0145042277872562 4.00108510802966e-05 -1.22048268167418e-05 2.56871408055304e-06 
0.0146997170522809 4.18107920268085e-05 -1.28568544823793e-05 2.33445734920679e-06 
0.0148756923153996 4.3679858208634e-05 -1.28244655570597e-05 2.35383413382806e-06 
0.0150856645777822 4.48673090431839e-05 -1.33147004817147e-05 2.41414250012895e-06 
0.0152258593589067 4.731962326332e-05 -1.48218414324219e-05 2.35148172578192e-06 
0.015327850356698 4.86497447127476e-05 -1.53876299009426e-05 2.40841382037615e-06 
0.0153452651575208 5.05659772898071e-05 -1.60574654728407e-05 2.25179724111513e-06 
0.0153599567711353 5.14256753376685e-05 -1.5782323316671e-05 2.19154276237532e-06 
0.015279364772141 5.47359923075419e-05 -1.60269391926704e-05 2.18002878682455e-06 
0.0151833510026336 5.50664080947172e-05 -1.57065060193418e-05 2.33243349612167e-06 
0.0150867253541946 5.49738761037588e-05 -1.54945664689876e-05 2.25817120735883e-06 
0.0149803888052702 5.64193105674349e-05 -1.47133150676382e-05 2.28484100261994e-06 
0.0148478178307414 5.88306538702454e-05 -1.49139614222804e-05 2.15896898225765e-06 
0.0147776734083891 5.75970188947394e-05 -1.48544004332507e-05 2.15022828342626e-06 
0.0147071005776525 5.79542065679561e-05 -1.41576010719291e-05 1.99864462047117e-06 
0.0146600883454084 5.84852241445333e-05 -1.34118117784965e-05 1.96393420992536e-06 
0.0146647868677974 5.54040088900365e-05 -1.32279146782821e-05 2.19833646042389e-06 
0.0146990343928337 5.07160693814512e-05 -1.31554370454978e-05 2.29682677854726e-06 
0.0147195998579264 4.78779948025476e-05 -1.17931749628042e-05 2.14205829252023e-06 
0.0147534143179655 4.3607760744635e-05 -1.08258609543554e-05 2.13070211430022e-06 
0.0147542944177985 3.91606990888249e-05 -9.22482013265835e-06 2.05555147658742e-06 
0.014749962836504 3.27634734276216e-05 -6.49644471195643e-06 1.73101307154866e-06 
0.0146584892645478 2.89598992821993e-05 -3.97997519030469e-06 1.48846913816669e-06 
0.0145169729366899 2.48505002673483e-05 -2.12511690733663e-06 1.3736093933403e-06 
0.0143864694982767 1.98107754840748e-05 4.24756702033235e-10 1.15819148049923e-06 
0.0142182540148497 1.4465114873019e-05 2.57386932389636e-06 1.18204843602143e-06 
0.0139716453850269 1.01140767583274e-05 4.07743800678873e-06 9.73525970948685e-07 
0.0137775707989931 3.10414316118113e-06 6.36019012745237e-06 1.02573108051729e-06 
0.0135866394266486 -7.9160508903442e-06 9.29407724470366e-06 8.5389376636158e-07 
0.0133527060970664 -1.82463190867566e-05 1.29150985230808e-05 7.16938700406899e-07 
0.013065667822957 -2.8599801225937e-05 1.56895202962914e-05 1.46797631828122e-07 
0.0128207439556718 -4.26239421358332e-05 1.9906790839741e-05 1.98777840410003e-07 
0.0125121138989925 -5.66793933103327e-05 2.50848697760375e-05 -2.7332987428963e-07 
0.0121793933212757 -7.11209941073321e-05 2.95639056275832e-05 -5.23686480846663e-07 
0.0117863202467561 -8.69005671120249e-05 3.478748476482e-05 -7.33260151264403e-07 
0.0114601068198681 -0.000105347055068705 4.08025916840415e-05 -7.67073061069823e-07 
0.0110878702253103 -0.000121798548207153 4.68726029794198e-05 -1.39724204473168e-06 
0.0107117472216487 -0.000139472060254775 5.29217213625088e-05 -1.40432655371114e-06 
0.0103070409968495 -0.000156992900883779 5.97890102653764e-05 -1.50945709265216e-06 
0.00993348471820354 -0.000173375345184468 6.60598161630332e-05 -1.70110229191778e-06 
0.00947715435177088 -0.000188494552276097 7.16914728400297e-05 -1.5867368574618e-06 
0.00899665802717209 -0.000204527488676831 7.73082429077476e-05 -1.30417606669653e-06 
0.00848110858350992 -0.000217876804526895 8.24100716272369e-05 -1.51813162574399e-06 
0.00793994497507811 -0.000229547993512824 8.75062687555328e-05 -1.82186818165064e-06 
0.0073914541862905 -0.000241087298491038 9.21688988455571e-05 -1.53741859776346e-06 
0.00686643598601222 -0.000247806281549856 9.61651021498255e-05 -1.65838923749106e-06 
0.00634143082424998 -0.000251268327701837 9.81398625299335e-05 -1.3180191444917e-06 
0.0058438153937459 -0.000250205048359931 9.85634833341464e-05 -7.65370032240753e-07 
0.00534616969525814 -0.000245023955358192 9.7262134659104e-05 4.78007279980375e-07 
0.00479657249525189 -0.000232493373914622 9.35030693653971e-05 1.51510926116316e-06 
0.00424025254324079 -0.000217992419493385 8.74906982062384e-05 2.70862892648438e-06 
0.00365894241258502 -0.000196873224922456 7.98929904703982e-05 3.84722807211801e-06 
0.00308405398391187 -0.000173095861100592 7.13069457560778e-05 5.09663550474215e-06 
0.00247648311778903 -0.000143028461025096 6.09954477113206e-05 5.6042636060738e-06 
0.00187136151362211 -0.000112506611912977 5.12104415975045e-05 5.42499765288085e-06 
0.00134473945945501 -8.49496136652306e-05 4.26920487370808e-05 5.35583376404247e-06 
0.000843950023408979 -5.79008992644958e-05 3.57898716174532e-05 4.61469653600943e-06 
0.000376754556782544 -3.27916641253978e-05 2.87145485344809e-05 3.51945186594094e-06 
5.97383113927208e-05 -1.69865834322991e-05 2.44409638980869e-05 2.66464053311211e-06 
-0.00013168370060157 -5.54147709408426e-06 2.11669575946871e-05 2.15072736864386e-06 
-0.000317822501529008 4.83550411445322e-06 1.88147168955766e-05 1.39441749524849e-06 
-0.000416588067309931 1.12438792712055e-05 1.54404897330096e-05 1.16564137897512e-06 
-0.000458240014268085 1.26573477245984e-05 1.44677533171489e-05 1.08833421563759e-06 
-0.000484068325022236 1.53435685206205e-05 1.31924171000719e-05 8.54085271839722e-07 
-0.000490227248519659 1.5388281099149e-05 1.1698394700943e-05 6.38421965959424e-07 
-0.000478897447464988 1.63404110935517e-05 1.01220721262507e-05 5.54462928903376e-07 
-0.000470051163574681 1.62065734912176e-05 1.00815032055834e-05 3.22396687124638e-07 
-0.000442870514234528 1.5707633792772e-05 9.69231768976897e-06 4.20742622964099e-07 
-0.000448090257123113 1.50783753269934e-05 8.73291628522566e-06 5.75065826069476e-07 
-0.000470734899863601 1.70788243849529e-05 8.05647505330853e-06 3.98772925791491e-07 
-0.000470881350338459 1.70887196873082e-05 7.77167224441655e-06 6.11429129548924e-07 
-0.000501644739415497 2.07424163818359e-05 6.74583861837164e-06 -4.22126987587035e-07 
0 0 0 0 
0 0 0 0 
0 0 0 0 
0 0 0 0 
0 0 0 0 
0 0 0 0 
0 0 0 0 
0 0 0 0 
0 0 0 0 
0 0 0 0 
0 0 0 0 
0 0 0 0 
0 0 0 0 
0 0 0 0 
99.5580902099609 0.33396327495575 0.0951851978898048 0.00493861269205809 
