0 0 0 0 
0 0 0 0 
0 0 0 0 
0 0 0 0 
0 0 0 0 
0 0 0 0 
0 0 0 0 
0 0 0 0 
0 0 0 0 
0 0 0 0 
0.00139491993468255 -8.88235153979622e-05 -1.07272826426197e-05 -7.94429183770262e-07 
0.0014851454179734 -9.21839455259033e-05 -1.0671582458599e-05 -9.77108811639482e-07 
0.00157267809845507 -9.07408757484518e-05 -1.14556969492696e-05 -1.43400711749564e-06 
0.0017064829589799 -8.25048264232464e-05 -1.22433393698884e-05 -1.80404197180906e-06 
0.00193972338456661 -6.48217101115733e-05 -1.30485987028806e-05 -2.14393412534264e-06 
0.00222817831672728 -4.34549583587795e-05 -1.3207878510002e-05 -2.40879239754577e-06 
0.00253391126170754 -1.98694961000001e-05 -1.26467093650717e-05 -2.28211979447224e-06 
0.00278392620384693 6.4771614916026e-07 -1.1510309377627e-05 -2.03145054911147e-06 
0.00294137350283563 1.38074847200187e-05 -9.9407761808834e-06 -1.7066029158741e-06 
0.00292094703763723 1.70069888554281e-05 -8.35436276247492e-06 -1.44330579132657e-06 
0.00278659397736192 1.66230856848415e-05 -7.23511720934766e-06 -1.17507920549542e-06 
0.0025849302764982 1.36530516101629e-05 -6.63687615087838e-06 -1.14261808903393e-06 
0.00239610788412392 1.16070259537082e-05 -6.22595871391241e-06 -1.06228424101573e-06 
0.0022461493499577 9.51535457716091e-06 -5.97091229792568e-06 -1.06464358395897e-06 
0.00218137516640127 8.84123983269092e-06 -5.66330072615528e-06 -9.98463633550273e-07 
0.00218715751543641 7.86073269409826e-06 -5.43104488315294e-06 -9.8398834325053e-07 
0.00227651908062398 7.06331184119335e-06 -5.13026498083491e-06 -1.01583225387003e-06 
0.00243216683156788 6.21143317403039e-06 -4.93456946060178e-06 -1.06226070784032e-06 
0.00261800177395344 5.26536905454122e-06 -4.72354668090702e-06 -1.03046988897404e-06 
0.00280927610583603 3.92013271266478e-06 -4.57283749710768e-06 -1.0772879477372e-06 
0.00297667272388935 3.25869882544794e-06 -4.43194221588783e-06 -1.05349545265199e-06 
0.00308642373420298 2.45901310336194e-06 -4.44366514784633e-06 -1.04935350009328e-06 
0.00312759191729128 2.19370258491836e-06 -4.43166209151968e-06 -1.04204252693307e-06 
0.00308875157497823 2.71048952527053e-06 -4.68137932330137e-06 -1.07875143839919e-06 
0.00298368115909398 3.70699945051456e-06 -5.24300503457198e-06 -1.1025523463104e-06 
0.0028836471028626 4.66960227640811e-06 -5.62670538784005e-06 -1.17429135571001e-06 
0.00286122597754002 5.17232183483429e-06 -5.69869143873802e-06 -1.18710420338175e-06 
0.00296736462041736 4.78047286378569e-06 -5.54970756638795e-06 -1.2118630365876e-06 
0.00327091640792787 4.34167213825276e-06 -4.99263023812091e-06 -1.25587575894315e-06 
0.00386626995168626 4.11216751672328e-06 -4.09186031902209e-06 -1.27343867006857e-06 
0.00483063049614429 2.87221200778731e-06 -3.34364949594601e-06 -1.41565897138207e-06 
0.0063162581063807 2.72382021648809e-06 -2.70932673629432e-06 -1.76272772023367e-06 
0.00853810179978609 2.91433525489992e-06 -2.27014402298664e-06 -2.1195357930992e-06 
0.0117619056254625 2.76180753644439e-06 -1.82870189746609e-06 -2.60032811638666e-06 
0.0162249282002449 -5.48883974715864e-07 -1.14943179596594e-06 -3.33887896886154e-06 
0.0221050940454006 -4.83434587295051e-06 -3.30519753788394e-07 -3.97945996155613e-06 
0.0293955579400063 -8.86707402969478e-06 7.39419590445323e-07 -4.76863306175801e-06 
0.0378576219081879 -1.52483025885886e-05 1.8615364751895e-06 -5.20482262800215e-06 
0.0471602044999599 -2.44661878241459e-05 2.82384303318395e-06 -5.65575601285673e-06 
0.0568118020892143 -3.13060227199458e-05 4.39568702859106e-06 -5.68973882764112e-06 
0.0662245079874992 -4.3261385144433e-05 5.30423722011619e-06 -5.42906991540804e-06 
0.0749712958931923 -6.03345433773939e-05 5.75101421418367e-06 -4.64862978333258e-06 
0.0829064846038818 -7.53419881220907e-05 5.73467286812956e-06 -4.51221831099247e-06 
0.0899517387151718 -9.72156922216527e-05 5.32675949216355e-06 -4.22332595917396e-06 
0.0959346368908882 -0.000123354664538056 3.94055223296164e-06 -4.0636236917635e-06 
0.100991353392601 -0.000142020333441906 3.314788955322e-06 -4.63044580101268e-06 
0.105293340981007 -0.000155552988871932 2.79582513940113e-06 -4.50716788691352e-06 
0.108949042856693 -0.000163242046255618 2.7411651899456e-06 -4.71755311082234e-06 
0.111876949667931 -0.000156103298650123 3.44972454513481e-06 -4.48231867267168e-06 
0.11446025967598 -0.000140681673656218 4.93666448164731e-06 -4.24172185375937e-06 
0.116721920669079 -0.000121765333460644 6.92637695465237e-06 -3.68279756912671e-06 
0.118714854121208 -9.72274574451149e-05 8.19540582597256e-06 -4.05432638217462e-06 
0.120344430208206 -8.30576391308568e-05 9.62363264989108e-06 -3.65509458788438e-06 
0.121833883225918 -6.11666255281307e-05 1.07479672806221e-05 -3.36002540279878e-06 
0.12305736541748 -3.96535870095249e-05 1.11493200165569e-05 -3.7694276215916e-06 
0.124013788998127 -2.4395041691605e-05 1.10762421172694e-05 -3.65292180504184e-06 
0.124709293246269 -1.81820723810233e-05 1.19754840852693e-05 -2.62786625171429e-06 
0.125206142663956 -8.96322490007151e-06 1.21448611025698e-05 -1.73674118286726e-06 
0.12552934885025 -9.87482599157374e-06 1.20788154163165e-05 -1.72187321823003e-06 
0.125833138823509 -8.54392146720784e-06 1.20757413242245e-05 -3.5232241657468e-07 
0.126176074147224 -1.27103830891429e-05 1.26019076560624e-05 8.59214139836695e-07 
0.126624569296837 -8.02706836111611e-06 1.23799700304517e-05 1.25562314678973e-06 
0.127161890268326 -9.92144123301841e-06 1.31033202706021e-05 2.16708531297627e-06 
0.12772361934185 -1.27656503536855e-05 1.33175717564882e-05 2.7282756036584e-06 
0.128172695636749 -1.86454453796614e-05 1.31729702843586e-05 3.42723160429159e-06 
0.128613129258156 -2.18732420762535e-05 1.15087523226975e-05 3.61093293577142e-06 
0.128886252641678 -3.56533237209078e-05 1.06953293652623e-05 4.76395371151739e-06 
0.129014700651169 -3.82821635867003e-05 8.82954009284731e-06 5.15562078362564e-06 
0.128921031951904 -6.00431085331365e-05 7.17478769729496e-06 5.79932748223655e-06 
0.128792271018028 -8.82639506016858e-05 5.4388515309256e-06 4.60807177660172e-06 
0.128441348671913 -0.000114997805212624 4.62071739093517e-06 4.60702267446322e-06 
0.128134369850159 -0.000134493777295575 3.51037442669622e-06 3.45599642059824e-06 
0.127766326069832 -0.000161095478688367 2.26897691391059e-06 1.63063646141381e-06 
0.127562090754509 -0.00015935608826112 1.86887166364613e-06 2.25312106749698e-07 
0.127200201153755 -0.000160336407134309 1.67491043612245e-06 1.06524225884641e-07 
0.126904591917992 -0.000149209634400904 1.47946354900341e-06 -1.88216006336006e-07 
0.126455411314964 -0.000138357252581045 6.21102969944332e-07 -5.25352277236379e-07 
0.125945597887039 -0.000127453080494888 7.10674385118182e-07 9.24363732224265e-08 
0.125156611204147 -0.000133270732476376 -8.54675263894933e-08 9.43264240049757e-07 
0.124316155910492 -0.000137636627187021 -1.98603430590083e-07 1.91718572750688e-06 
0.123380638659 -0.000145783473271877 -1.05454773802194e-06 2.02533783522085e-06 
0.122332669794559 -0.000161995994858444 -1.16605747280119e-06 1.89855120424909e-06 
0.121165305376053 -0.000171987165231258 -2.02597198040166e-06 1.7651482266956e-06 
0.119941174983978 -0.000179122464032844 -2.73009072770947e-06 1.36082064727816e-06 
0.118711031973362 -0.000175844659679569 -4.62215848529013e-06 7.61342050736857e-07 
0.117521554231644 -0.000177882495336235 -5.41801864528679e-06 9.97806409941404e-07 
0.116386272013187 -0.000174255095771514 -5.8625814745028e-06 1.72100283180043e-06 
0.115507550537586 -0.000163972203154117 -6.52871722195414e-06 1.8819675915438e-06 
0.114824421703815 -0.000153331668116152 -6.79760933053331e-06 2.32114143727813e-06 
0.114340133965015 -0.000137630981043912 -5.83042537982692e-06 2.4826649678289e-06 
0.113894492387772 -0.000127651786897331 -6.04358638156555e-06 2.43975273406249e-06 
0.113447397947311 -0.000114415626740083 -6.62812180962646e-06 2.36456639868265e-06 
0.112969592213631 -0.000109326269011945 -6.5339027059963e-06 2.66757365352532e-06 
0.112277507781982 -0.000103990678326227 -6.67439871904207e-06 3.22907203553768e-06 
0.111270532011986 -0.000103910228062887 -7.96871972852387e-06 3.02909393212758e-06 
0.109938718378544 -9.66090519796126e-05 -8.56681435834616e-06 1.88812828127993e-06 
0.108390010893345 -9.45903593674302e-05 -1.02073181551532e-05 1.66758400155231e-06 
0.106395646929741 -9.86864106380381e-05 -1.1794767488027e-05 1.29305146856495e-06 
0.104340068995953 -9.54961069510318e-05 -1.1774542144849e-05 7.01835915606353e-07 
0.102229312062263 -9.74125796346925e-05 -1.09624033939326e-05 4.59610788539067e-07 
0.0999944880604744 -0.000102009464171715 -1.14129352368764e-05 6.19623108377709e-07 
0.0978094711899757 -9.20666934689507e-05 -1.07956466308679e-05 -4.20365608988504e-07 
0.095818005502224 -8.08898621471599e-05 -9.89050477073761e-06 -3.79552091089863e-07 
0.093870647251606 -6.07202273386065e-05 -1.11446861410514e-05 -6.67229471673636e-07 
0.0919823572039604 -4.05723149015103e-05 -1.21912271424662e-05 -1.47455295973486e-07 
0.0902903378009796 -1.15398916022968e-05 -1.20477461678092e-05 4.16691648297274e-07 
0.0885324105620384 1.4300655493571e-05 -1.18360094347736e-05 1.17462332127616e-06 
0.0868441611528397 5.16400250489824e-05 -1.21354160000919e-05 1.19625690331304e-06 
0.0849524363875389 8.15188759588636e-05 -1.15154698505648e-05 1.90769651453593e-06 
0.0829035714268684 0.000120418233564124 -1.19242067739833e-05 2.22383800974058e-06 
0.0808156430721283 0.000167765931109898 -1.19001770144678e-05 2.35332458942139e-06 
0.0784714221954346 0.000201164468307979 -1.21178991321358e-05 1.79580615622399e-06 
0.0758073180913925 0.00022950918355491 -1.21540206237114e-05 1.19241269658232e-06 
0.0732716545462608 0.000263687543338165 -1.22052451843047e-05 1.50184334302139e-07 
0.0705689415335655 0.00029386262758635 -1.15550901682582e-05 -6.61957244574296e-08 
0.067702516913414 0.000314225442707539 -1.08536069092224e-05 -7.84667406605877e-07 
0.0649627968668938 0.000345007283613086 -1.05083254311467e-05 -7.08284062511666e-07 
0.0622459724545479 0.000384305691113696 -9.71222470980138e-06 -1.45273850193917e-06 
0.059427447617054 0.000424351135734469 -8.96662095328793e-06 -2.07786069950089e-06 
0.0566172115504742 0.000467794336145744 -7.68945210438687e-06 -3.20746494253399e-06 
0.0538165010511875 0.000516592874191701 -7.02513989381259e-06 -3.75372428607079e-06 
0.0509616769850254 0.00057044462300837 -6.25669235887472e-06 -4.5659448915103e-06 
0.048169944435358 0.000626990338787436 -5.40388782610535e-06 -5.15647843712941e-06 
0.0453061051666737 0.000680211698636413 -4.50595189249725e-06 -5.22000073033269e-06 
0.0425994843244553 0.000736999209038913 -3.81933932658285e-06 -5.63377807338838e-06 
0.0399350225925446 0.000793565472122282 -3.01799650515022e-06 -6.17453997620032e-06 
0.03736262768507 0.000846195500344038 -1.57445265358547e-06 -6.1464675127354e-06 
0.034855704754591 0.000897183024790138 -1.93399003478589e-07 -5.38241602043854e-06 
0.0325077399611473 0.000942028418648988 1.20699610306474e-06 -5.13824306835886e-06 
0.0302487052977085 0.000977447023615241 2.29178431254695e-06 -4.52423546448699e-06 
0.0281031727790833 0.00100615224801004 3.40927226716303e-06 -3.65592563866812e-06 
0.0260710623115301 0.00102785381022841 4.14174292018288e-06 -3.28130204252375e-06 
0.0240916516631842 0.00103513314388692 4.85545479023131e-06 -2.9188242933742e-06 
0.0221667792648077 0.00103246129583567 5.43682881470886e-06 -1.75068942098733e-06 
0.0203568153083324 0.00102096749469638 5.88030889048241e-06 -6.28687473636091e-07 
0.0185855384916067 0.000993604655377567 6.14078135185991e-06 1.17646118269477e-06 
0.0168759655207396 0.000953884329646826 6.32268483968801e-06 3.41928557645588e-06 
0.0151576194912195 0.000898651662282646 5.80743926548166e-06 6.10527240496594e-06 
0.0134724779054523 0.000831724901217967 4.97780683872406e-06 8.1538755694055e-06 
0.0116704283282161 0.000748064310755581 3.71286387235159e-06 9.99275380308973e-06 
0.00990347750484943 0.000658723991364241 2.322165755686e-06 1.15560651465785e-05 
0.00812537875026464 0.000559540407266468 6.69887185722473e-07 1.21820248750737e-05 
0.00647347839549184 0.00046297485823743 -9.43745078529901e-07 1.18593397928635e-05 
0.0049435026012361 0.000371645466657355 -2.58130467045703e-06 1.09251104731811e-05 
0.00364159583114088 0.000292650918709114 -3.90914783565677e-06 9.55907762545394e-06 
0.00250524166040123 0.000222160088014789 -5.17534363098093e-06 7.17234706826275e-06 
0.00163414666894823 0.00016868302191142 -6.15009184912196e-06 5.28648160980083e-06 
0.000954920134972781 0.000126495404401794 -6.95216203894233e-06 3.58841384695552e-06 
0.000470007682451978 9.49067107285373e-05 -7.39191727916477e-06 2.05851438295213e-06 
0.000123268124298193 7.15748683433048e-05 -7.66004905017326e-06 8.80710672390705e-07 
-8.60837972140871e-05 5.54093057871796e-05 -7.70267070038244e-06 2.74198242777857e-07 
-0.00021155338617973 4.36084155808203e-05 -7.67698384152027e-06 -2.25575519152699e-07 
-0.000285712565528229 3.61494385288097e-05 -7.38286735213478e-06 -4.74349661772067e-07 
-0.000341307837516069 2.93570337817073e-05 -7.12605515218456e-06 -6.62213892610453e-07 
-0.000353690818883479 2.49145668931305e-05 -6.8419567469391e-06 -7.08203970134491e-07 
-0.000363572005880997 2.18542299990077e-05 -6.54350606055232e-06 -8.28646818717971e-07 
-0.000376486888853833 1.89915244845906e-05 -6.23192408966133e-06 -9.12184475510003e-07 
-0.000377793185180053 1.6117128325277e-05 -6.01114561504801e-06 -9.98967834675568e-07 
-0.00037167058326304 1.47747796290787e-05 -5.77894070374896e-06 -9.83538370746828e-07 
-0.000377529882825911 1.30766557049355e-05 -5.48886237083934e-06 -9.6003532235045e-07 
-0.000382426456781104 1.28914516608347e-05 -5.19787772645941e-06 -9.12646441975085e-07 
0 0 0 0 
0 0 0 0 
0 0 0 0 
0 0 0 0 
0 0 0 0 
0 0 0 0 
0 0 0 0 
0 0 0 0 
0 0 0 0 
0 0 0 0 
0 0 0 0 
0 0 0 0 
0 0 0 0 
0 0 0 0 
99.5509033203125 0.429073691368103 0.00963877700269222 0.00456320773810148 
