0 0 0 0 
0 0 0 0 
0 0 0 0 
0 0 0 0 
0 0 0 0 
0 0 0 0 
0 0 0 0 
0 0 0 0 
0 0 0 0 
0 0 0 0 
0.0101534146815538 0.000243051224970259 -7.71363047533669e-05 5.27787733517471e-06 
0.0147839421406388 0.000334736483637244 -0.00011024691775674 4.99568795930827e-06 
0.0201555769890547 0.000425840233219787 -0.000139264695462771 2.78696870736894e-06 
0.0270559228956699 0.000498220673762262 -0.000151267129695043 1.29844340790441e-06 
0.0374757796525955 0.000527665950357914 -0.000127427469124086 4.90794207053113e-07 
0.050344280898571 0.000511310063302517 -7.26114885765128e-05 1.28350097838847e-06 
0.0640005990862846 0.000460153562016785 -2.89821491605835e-06 3.3419237297494e-06 
0.0777762159705162 0.000387206702725962 7.15559217496775e-05 6.07256515650079e-06 
0.0902292504906654 0.000312868738546968 0.000132787215989083 8.1066800703411e-06 
0.0995528325438499 0.000263869442278519 0.000160420779138803 8.8790375230019e-06 
0.10645330697298 0.000237560117966495 0.000161440460942686 7.25026393411099e-06 
0.112486988306046 0.000219595458474942 0.000149575862451456 4.26317910751095e-06 
0.117785207927227 0.000203837058506906 0.000131854860228486 4.18526951762033e-07 
0.12254074960947 0.000184581178473309 0.000113179841719102 -2.71762723969005e-06 
0.126763537526131 0.00015803228598088 9.60401885095052e-05 -5.43993974133627e-06 
0.130597040057182 0.000134409128804691 7.81315611675382e-05 -7.26344524082378e-06 
0.134335026144981 0.000114393449621275 6.30598588031717e-05 -8.82027143234154e-06 
0.138122290372849 8.97657955647446e-05 4.90917846036609e-05 -8.60400450619636e-06 
0.141923293471336 6.81670790072531e-05 3.6093348171562e-05 -8.51785807753913e-06 
0.145683109760284 5.2138388127787e-05 2.43428967223736e-05 -8.20598143036477e-06 
0.149335458874702 3.44193504133727e-05 1.39073781610932e-05 -7.55735572965932e-06 
0.152580335736275 2.02661249204539e-05 2.71973181042995e-06 -6.18139893049374e-06 
0.155452787876129 1.40070105771883e-05 -7.95822961663362e-06 -5.71468081034254e-06 
0.157847031950951 4.12037479691207e-06 -1.26193262985907e-05 -5.00648775414447e-06 
0.159897804260254 -1.02520807558903e-05 -1.67313555721194e-05 -4.91835226057447e-06 
0.161750495433807 -2.22882426896831e-05 -1.87143650691723e-05 -4.45060959464172e-06 
0.163381859660149 -3.73768707504496e-05 -1.9177916328772e-05 -4.88448904434335e-06 
0.164981201291084 -5.21544243383687e-05 -1.7576152458787e-05 -5.35122171640978e-06 
0.166440978646278 -6.56282136333175e-05 -1.98077268578345e-05 -5.25230734638171e-06 
0.16768741607666 -7.23228513379581e-05 -2.1800551621709e-05 -4.78618540000753e-06 
0.168525233864784 -7.63820789870806e-05 -2.52777299465379e-05 -5.16536920258659e-06 
0.16899311542511 -8.21701833046973e-05 -2.91419419227168e-05 -5.02916964251199e-06 
0.16892072558403 -8.38425694382749e-05 -3.36382108798716e-05 -4.29734427598305e-06 
0.16836029291153 -8.46371694933623e-05 -3.59892837877851e-05 -3.92242145608179e-06 
0.167302504181862 -8.3015656855423e-05 -4.1900926589733e-05 -3.12877477881557e-06 
0.165816143155098 -8.43113302835263e-05 -4.64758450107183e-05 -2.22475205191586e-06 
0.163866370916367 -8.14264130895026e-05 -4.94772866659332e-05 -3.66702977316891e-07 
0.16144797205925 -8.11537902336568e-05 -4.99284215038642e-05 5.84431802508334e-07 
0.158814132213593 -8.07459218776785e-05 -5.04705130879302e-05 1.44452474160062e-06 
0.155813276767731 -9.1009249445051e-05 -4.74626394861843e-05 2.50894208875252e-06 
0.152474984526634 -9.58690070547163e-05 -4.36650734627619e-05 3.93872551285313e-06 
0.148825883865356 -0.000103098223917186 -4.06260842282791e-05 4.71071962238057e-06 
0.14499069750309 -0.000111026165541261 -3.52260140061844e-05 6.1284390540095e-06 
0.140380457043648 -0.000114639966341201 -3.16457262670156e-05 6.70697136229137e-06 
0.135516196489334 -0.000109120817796793 -2.65014386968687e-05 6.86121029502829e-06 
0.130394265055656 -0.000108040127088316 -2.1816440494149e-05 6.82930476614274e-06 
0.125137433409691 -0.000101882433227729 -1.67007547133835e-05 6.97774657965056e-06 
0.119662083685398 -9.66082370723598e-05 -1.48652861753362e-05 6.28684801995405e-06 
0.11437201499939 -9.32053153519519e-05 -1.31597143990803e-05 7.01716908224626e-06 
0.108961999416351 -9.24697087612003e-05 -1.2139191312599e-05 7.79197762312833e-06 
0.103430286049843 -9.15396449272521e-05 -1.10061591840349e-05 8.43724410515279e-06 
0.0978479981422424 -9.12589603103697e-05 -8.84433848113986e-06 7.95166852185503e-06 
0.0921467989683151 -8.73381868586875e-05 -8.60966247273609e-06 7.94839343143394e-06 
0.0862955078482628 -8.54046083986759e-05 -6.77446678309934e-06 7.5757593549497e-06 
0.080287754535675 -8.004348637769e-05 -5.29753560840618e-06 6.86084240442142e-06 
0.0742943361401558 -7.45182696846314e-05 -4.24944391852478e-06 6.05869126957259e-06 
0.0683411061763763 -6.84916667523794e-05 -4.2195988498861e-06 6.22027209828957e-06 
0.0626503676176071 -6.33258096058853e-05 -3.36785615218105e-06 6.13049815001432e-06 
0.0574576705694199 -5.47138733963948e-05 -3.49985839420697e-06 5.54437747268821e-06 
0.05288315564394 -4.86279168399051e-05 -2.97761857837031e-06 5.22995651408564e-06 
0.0489176474511623 -4.38777606177609e-05 -3.05583375848073e-06 4.96732991450699e-06 
0.0454595312476158 -3.99229975300841e-05 -2.61561717707082e-06 4.70134773422615e-06 
0.0424735359847546 -3.65144187526312e-05 -2.54770498031576e-06 4.2833153202082e-06 
0.0398924052715302 -3.38235222443473e-05 -2.45591741077078e-06 4.02699197366019e-06 
0.037614718079567 -3.13480450131465e-05 -2.44285956796375e-06 3.81703284801915e-06 
0.0356284976005554 -2.68191761279013e-05 -1.89670265626773e-06 3.70740031030437e-06 
0.0339147858321667 -2.32549682550598e-05 -2.07474158742116e-06 3.52589040630846e-06 
0.0323655977845192 -2.06436143344035e-05 -1.37305175940128e-06 3.56523742084391e-06 
0.0309474915266037 -1.72694672073703e-05 -1.66887775776559e-06 3.41838358508539e-06 
0.0296107605099678 -1.21882967505371e-05 -2.67366613115883e-06 3.12860561280104e-06 
0.0282787643373013 -8.54968129715417e-06 -3.65605842489458e-06 2.768774947981e-06 
0.0269965678453445 -4.59041166323004e-06 -4.49678464065073e-06 2.39133782997669e-06 
0.0257297363132238 7.47505794151948e-07 -5.86330725127482e-06 1.89249931281665e-06 
0.0244778450578451 3.40883298122208e-06 -6.01973761149566e-06 1.51916276536213e-06 
0.0232136268168688 5.29966791873449e-06 -6.60556224829634e-06 1.31061688080081e-06 
0.0219951253384352 6.63181981508387e-06 -6.46016360406065e-06 1.15243017262401e-06 
0.020809143781662 7.58206397222239e-06 -6.02806176175363e-06 9.36209232804686e-07 
0.0197152830660343 7.82070401328383e-06 -5.67701454201597e-06 1.00214742815297e-06 
0.0187065657228231 9.12667928787414e-06 -5.8069463193533e-06 9.86407258096733e-07 
0.0178391691297293 9.94745641946793e-06 -5.55958922632271e-06 8.47475916998519e-07 
0.0171015486121178 1.12841507871053e-05 -5.90889385421178e-06 7.79366700953688e-07 
0.016469232738018 1.24436055557453e-05 -6.95459129929077e-06 6.14310351920722e-07 
0.0159460827708244 1.29498494061409e-05 -7.35020785214147e-06 3.7746499970126e-07 
0.0155231468379498 1.35760337798274e-05 -7.57210636948003e-06 8.28718498269154e-08 
0.0151955848559737 1.46432012115838e-05 -7.68405516282655e-06 -3.7791481055649e-09 
0.0149547243490815 1.55499874381348e-05 -7.92542323324597e-06 -2.23957584921664e-07 
0.0148054249584675 1.59589508257341e-05 -7.98508426669287e-06 -2.67972694700802e-07 
0.0147215751931071 1.6535403119633e-05 -7.96209133113734e-06 -3.36685161528294e-07 
0.0147232003509998 1.69174800248584e-05 -8.47873980092118e-06 -3.80498164531673e-07 
0.0148003408685327 1.60272702487418e-05 -8.36879280541325e-06 -3.70281838968367e-07 
0.0149209666997194 1.58469174493803e-05 -8.64382218423998e-06 -3.77313597255124e-07 
0.0150598250329494 1.64883422257844e-05 -8.40700886328705e-06 -4.4967291046305e-07 
0.0152086326852441 1.68328861036571e-05 -8.54880272527225e-06 -4.8755998705019e-07 
0.0153189152479172 1.62134438141948e-05 -8.33867761684814e-06 -4.54454834653006e-07 
0.0153762865811586 1.72284762811614e-05 -8.62140859680949e-06 -6.34506363894616e-07 
0.0153688620775938 1.76823923538905e-05 -7.88215947977733e-06 -7.63520858981792e-07 
0.0153327919542789 1.78542413777905e-05 -7.5876359915128e-06 -8.7096185552582e-07 
0.0152489142492414 1.8561833712738e-05 -7.31822592570097e-06 -1.0168987500947e-06 
0.0151378819718957 1.97657082026126e-05 -7.05047477822518e-06 -1.08973301848891e-06 
0.0150221763178706 2.01254715648247e-05 -6.94721029503853e-06 -1.13519092792558e-06 
0.0149036757647991 2.08297115023015e-05 -7.22461118130013e-06 -1.33336368435266e-06 
0.0147889368236065 2.13798521144781e-05 -7.24861865819548e-06 -1.39096709972364e-06 
0.0147193968296051 2.23523493332323e-05 -7.42610836823587e-06 -1.36474284317956e-06 
0.0146872224286199 2.33943919738522e-05 -7.23691709936247e-06 -1.35013135604822e-06 
0.0146888727322221 2.40872104768641e-05 -7.04374997440027e-06 -1.29751697386382e-06 
0.0147361652925611 2.48779342655325e-05 -6.57359441902372e-06 -1.12180657652061e-06 
0.0147854797542095 2.51139626925578e-05 -6.68173333906452e-06 -1.01391151474672e-06 
0.014848031103611 2.48003252636408e-05 -6.06728417551494e-06 -1.17492254503304e-06 
0.0149086406454444 2.4487882910762e-05 -5.81184895054321e-06 -1.15264515443414e-06 
0.0149763356894255 2.42647183767986e-05 -4.9517161642143e-06 -1.12239263216907e-06 
0.0150249544531107 2.34692943195114e-05 -4.19061234424589e-06 -1.11502561139787e-06 
0.0150604965165257 2.38585507759126e-05 -3.30374723489513e-06 -1.15367367925501e-06 
0.0150538571178913 2.35135030379752e-05 -2.77680464932928e-06 -1.10106373085728e-06 
0.0150543116033077 2.31279482250102e-05 -1.97818212654965e-06 -1.14605632006715e-06 
0.015005636960268 2.28699027502444e-05 -1.73629757682647e-06 -1.24242308174871e-06 
0.0149474134668708 2.27827495109523e-05 -1.56312228227762e-06 -1.27682392303541e-06 
0.0148885846138 2.18117511394667e-05 -8.68148219979048e-07 -1.4163489368002e-06 
0.0148220276460052 2.10729431273649e-05 -2.32711041547873e-08 -1.38197765409132e-06 
0.0147174037992954 2.03510498977266e-05 1.1328685332046e-06 -1.52361644722987e-06 
0.0145917255431414 1.91332746908301e-05 2.36026426136959e-06 -1.61238961027266e-06 
0.0144546078518033 1.72490490513155e-05 3.60096760232409e-06 -1.78090351710125e-06 
0.0142783364281058 1.55561629071599e-05 5.09613573740353e-06 -1.71529688941519e-06 
0.0140970088541508 1.31715105453623e-05 6.85812847223133e-06 -1.85858471013489e-06 
0.0138730118051171 1.03847623904585e-05 8.65240508574061e-06 -1.88492458619294e-06 
0.0136770559474826 7.16150907464908e-06 1.12915304271155e-05 -2.00611930267769e-06 
0.0134728169068694 3.34458127326798e-06 1.47286400533631e-05 -1.99718442672747e-06 
0.0132653983309865 -2.18890545511385e-06 1.81653140316484e-05 -2.20253855331976e-06 
0.0130071705207229 -7.6688411354553e-06 2.11750611924799e-05 -2.10828238778049e-06 
0.0127567248418927 -1.37618490043678e-05 2.4839406250976e-05 -2.08824030778487e-06 
0.0124137299135327 -1.91856343008112e-05 2.82791697827633e-05 -1.9608644379332e-06 
0.0119951674714684 -2.49137701757718e-05 3.19252067129128e-05 -1.8247125126436e-06 
0.0114876376464963 -2.88858354906552e-05 3.57678873115219e-05 -1.49699610574316e-06 
0.0109182372689247 -3.46211199939717e-05 4.11041619372554e-05 -1.31306796902209e-06 
0.0102467807009816 -4.03917038056534e-05 4.5712040446233e-05 -1.01927412288205e-06 
0.00956784002482891 -4.60824339825194e-05 5.1075669034617e-05 -6.7077053245157e-07 
0.00884501449763775 -5.15878200531006e-05 5.55599945073482e-05 -2.23330658855048e-07 
0.00812849402427673 -5.68857903999742e-05 6.03366170253139e-05 4.30471004619903e-07 
0.00735998200252652 -6.01279098191299e-05 6.31672664894722e-05 9.17532133826171e-07 
0.00660586170852184 -6.24632521066815e-05 6.51791488053277e-05 1.4118884337222e-06 
0.00580721022561193 -6.37311095488258e-05 6.51839291094802e-05 1.87590933364845e-06 
0.00501241208985448 -6.32047740509734e-05 6.39971549389884e-05 2.27813416131539e-06 
0.00421571498736739 -6.12266449024901e-05 6.01185201958288e-05 2.4350638341275e-06 
0.0034809960052371 -5.64803194720298e-05 5.46793999092188e-05 2.76084551842359e-06 
0.00276603270322084 -4.88912628497928e-05 4.83638687001076e-05 2.75005936600792e-06 
0.00211919937282801 -3.99939308408648e-05 4.0864986658562e-05 2.67508153228846e-06 
0.00154964125249535 -2.94488709187135e-05 3.31520350300707e-05 2.41680754697882e-06 
0.00103847298305482 -1.84209402505076e-05 2.58196942013456e-05 1.90836817637319e-06 
0.000643364910501987 -9.69030134001514e-06 2.03309773496585e-05 1.29121826830669e-06 
0.000354854506440461 -2.09272184292786e-06 1.51262875078828e-05 9.00649467894254e-07 
0.000135107766254805 3.37958294949203e-06 1.14874846985913e-05 5.09640301515901e-07 
-7.19342415322899e-06 7.20625848771306e-06 8.47767205414129e-06 2.60730899981354e-07 
-7.61503324611112e-05 8.83813117980026e-06 6.8967697188782e-06 2.24887301669696e-07 
-0.0001401108893333 1.10519231384387e-05 4.82840187032707e-06 7.46784749594553e-08 
-0.000184084492502734 1.15996272143093e-05 3.67095140063611e-06 -1.52991219692922e-08 
-0.000199682253878564 1.17218878585845e-05 2.88846217699756e-06 -9.13982223238463e-09 
-0.000216685060877353 1.06746529127122e-05 2.70395594270667e-06 -7.67756347386239e-08 
-0.000246332230744883 1.05536928458605e-05 2.15454565477557e-06 -3.20840484846485e-07 
-0.000248771801125258 9.95922255242476e-06 1.89984564258339e-06 -2.76342433380705e-07 
-0.000257882726145908 9.0402181740501e-06 1.70927660292364e-06 -2.44483175038113e-07 
-0.000276756007224321 9.42083534027915e-06 1.18855746222835e-06 -4.15958680832773e-07 
-0.000290990457870066 7.330912467296e-06 9.51939512106037e-07 -2.80671258678922e-07 
0 0 0 0 
0 0 0 0 
0 0 0 0 
0 0 0 0 
0 0 0 0 
0 0 0 0 
0 0 0 0 
0 0 0 0 
0 0 0 0 
0 0 0 0 
0 0 0 0 
0 0 0 0 
0 0 0 0 
0 0 0 0 
99.783805847168 0.149500116705894 0.0557428523898125 0.00482012052088976 
