90,0.0001,0.95,0.95
50,0.3,0.5,
100,0.3,0.5,
200,0.3,0.5,
400,0.4,0.5,
600,0.5,0.5,
800,0.5,0.6,
1200,0.6,0.7,
1600,0.7,0.85,
2000,0.8,0.85,
2400,0.85,0.9,
2800,0.9,0.95,
3200,0.95,0.95,
3600,0.95,0.95,
4000,0.95,0.95,
4400,0.95,0.95,
4800,0.95,0.95,
5200,0.95,0.95,
5600,0.95,0.95,
6000,0.95,0.95,
6400,0.95,0.95,
