0 0 0 0 
0 0 0 0 
0 0 0 0 
0 0 0 0 
0 0 0 0 
0 0 0 0 
0 0 0 0 
0 0 0 0 
0 0 0 0 
0 0 0 0 
0.00444687902927399 -0.000253063422860578 -0.000192242907360196 -2.34639846894424e-05 
0.0049869935028255 -0.000277208862826228 -0.000201119211851619 -2.55140930676134e-05 
0.00532773323357105 -0.000276132283033803 -0.000201566130272113 -2.53330199484481e-05 
0.00573527626693249 -0.000255739199928939 -0.000201038550585508 -2.41251891566208e-05 
0.00626235548406839 -0.000199227579287253 -0.000190458944416605 -2.09984045795863e-05 
0.00693024881184101 -0.000114547678094823 -0.000173388863913715 -1.61211755766999e-05 
0.00763826631009579 -2.86529830191284e-05 -0.000154853754793294 -1.03954507721937e-05 
0.00824060849845409 4.28099629061762e-05 -0.00013711724022869 -5.23619928571861e-06 
0.00870045088231564 8.95858611329459e-05 -0.000120403252367396 -9.74524482444394e-07 
0.0088448179885745 0.000103326281532645 -0.000112020054075401 2.19170146920078e-06 
0.00868246890604496 8.67780254338868e-05 -0.000108875799924135 3.73057241631614e-06 
0.00839759781956673 6.98900912539102e-05 -0.000106659826997202 4.96002758154646e-06 
0.00801830273121595 5.41472982149571e-05 -0.000104918763099704 6.07399215368787e-06 
0.00765488715842366 4.20159158238675e-05 -0.000102444188087247 6.96391225574189e-06 
0.00729868980124593 3.16509504045825e-05 -9.85597071121447e-05 7.72124531067675e-06 
0.00696540670469403 2.6564761355985e-05 -9.36177966650575e-05 8.42797544464702e-06 
0.00665615918114781 2.17198412428843e-05 -8.82285821717232e-05 8.7152920968947e-06 
0.00637190649285913 1.85252720257267e-05 -8.24379458208568e-05 8.85582721821265e-06 
0.00608773762360215 1.46149277497898e-05 -7.64912183512934e-05 8.82341828400968e-06 
0.00582184968516231 1.58214770635823e-05 -7.03658952261321e-05 8.85029021446826e-06 
0.00554510345682502 1.25954193208599e-05 -6.49919675197452e-05 8.47933915792964e-06 
0.00527180638164282 1.01875448308419e-05 -5.96726313233376e-05 8.20559216663241e-06 
0.00498984893783927 1.04224582173629e-05 -5.53255013073795e-05 7.84427174949087e-06 
0.00468073692172766 1.34387055368279e-05 -5.2471601520665e-05 7.58984788262751e-06 
0.00433585233986378 9.77462877926882e-06 -5.05345815327018e-05 7.05152615410043e-06 
0.00402055447921157 1.48560557136079e-05 -4.725933104055e-05 6.97495897838962e-06 
0.00372139969840646 1.69592804013519e-05 -4.41560005128849e-05 6.68143275106559e-06 
0.00354007072746754 1.55585130414693e-05 -3.93270383938216e-05 6.35326114206691e-06 
0.00345528312027454 1.46111960930284e-05 -3.36760167556349e-05 6.11547238804633e-06 
0.00348646845668554 1.76174380612792e-05 -2.72365614364389e-05 6.0165539252921e-06 
0.00355901336297393 1.49236166180344e-05 -2.21592945308657e-05 5.47810714124353e-06 
0.00369505723938346 1.66704612638569e-05 -1.71548545040423e-05 5.29608951183036e-06 
0.00380986486561596 1.71566225617426e-05 -1.34653291752329e-05 5.11124653712614e-06 
0.00395806087180972 1.84634118340909e-05 -9.99216172203887e-06 4.95122003485449e-06 
0.00417990051209927 1.9131552107865e-05 -6.44082501821686e-06 4.74634225611226e-06 
0.00447007175534964 1.82453441084363e-05 -3.14362932840595e-06 4.64913273390266e-06 
0.00479834154248238 1.46862957990379e-05 -3.23077017583273e-07 4.38432880400796e-06 
0.00517567479982972 1.20243312267121e-05 2.27721056944574e-06 4.21358072344447e-06 
0.00559318065643311 7.98657856648788e-06 4.84389283883502e-06 3.99471491618897e-06 
0.00597684038802981 2.31744434131542e-06 6.91147806719528e-06 3.76843354388257e-06 
0.0063138185068965 -4.29076408181572e-06 8.23989648779389e-06 3.69259942090139e-06 
0.00662525044754148 -1.16620176413562e-05 9.32044713408686e-06 3.54449389305955e-06 
0.00691185146570206 -1.67952257470461e-05 1.0756409210444e-05 3.25563928527117e-06 
0.00716686202213168 -2.45671653829049e-05 1.25614815260633e-05 2.81551410807879e-06 
0.00740948086604476 -3.33778807544149e-05 1.45208732647006e-05 2.30437240134052e-06 
0.00768913328647614 -3.81168611056637e-05 1.80771185114281e-05 1.7878071503219e-06 
0.00796015560626984 -4.3774583900813e-05 2.19526627915911e-05 1.19878313853405e-06 
0.00824884139001369 -4.71374150947668e-05 2.66647239186568e-05 7.34876266506035e-07 
0.0085496436804533 -4.82498071505688e-05 3.1137045880314e-05 5.25734435541381e-07 
0.00887174531817436 -4.60405062767677e-05 3.63112521881703e-05 4.6318632485054e-07 
0.00920725706964731 -4.369219095679e-05 4.1382823837921e-05 3.71672257415412e-07 
0.00958811957389116 -3.82320395146962e-05 4.6714940253878e-05 2.4921615704443e-07 
0.0100209806114435 -3.6082805308979e-05 5.22867449035402e-05 2.38989400713763e-07 
0.0105432104319334 -3.06199362967163e-05 5.9103735111421e-05 2.27064006708133e-07 
0.0111723886802793 -2.57543979387265e-05 6.59530924167484e-05 2.10702751246572e-07 
0.0119247445836663 -2.07229386433028e-05 7.39988317945972e-05 1.79122963572809e-07 
0.0128107219934464 -1.79708786163246e-05 8.32408550195396e-05 2.94973204972848e-07 
0.0138020645827055 -1.58440689119743e-05 9.30294336285442e-05 2.01661336518555e-07 
0.0148445283994079 -1.74773413164075e-05 0.000102321297163144 -1.72679378351859e-07 
0.0159386657178402 -1.80212391569512e-05 0.000112362511572428 -5.07574043240311e-07 
0.0170163717120886 -1.94838557945332e-05 0.000121632059745025 -7.89439297932404e-07 
0.0180074442178011 -1.69814011314884e-05 0.000129593012388796 -1.12856616851786e-06 
0.018808813765645 -1.76882531377487e-05 0.000136107439175248 -1.45181650168524e-06 
0.0193579122424126 -1.71097162819933e-05 0.000140613730764017 -1.6857245555002e-06 
0.0195331573486328 -2.01166185433976e-05 0.000141290322062559 -1.97522831513197e-06 
0.0193849951028824 -2.13295261346502e-05 0.000139824609505013 -2.29659849537711e-06 
0.0189108178019524 -2.47272273554699e-05 0.000136511036544107 -2.21314303416875e-06 
0.0182017404586077 -2.41842171817552e-05 0.000130412954604253 -2.11389988180599e-06 
0.0173570364713669 -2.98422146443045e-05 0.000123391568195075 -2.03307786250662e-06 
0.0165063571184874 -3.58110191882588e-05 0.000116646275273524 -2.15203044717782e-06 
0.0156734213232994 -4.56503657915164e-05 0.00010948654380627 -2.22752510126156e-06 
0.0149834435433149 -5.58882202312816e-05 0.000102893842267804 -2.59183480011416e-06 
0.0144369248300791 -6.86832499923185e-05 9.74450304056518e-05 -3.03702199744293e-06 
0.0140626281499863 -7.34101122361608e-05 9.33764531509951e-05 -3.17465742227796e-06 
0.0138421673327684 -7.63441930757836e-05 9.05076449271291e-05 -3.08453400066355e-06 
0.0137462327256799 -7.73813007981516e-05 8.82975218701176e-05 -2.97869814858132e-06 
0.0137399947270751 -7.67484598327428e-05 8.68507268023677e-05 -2.92645836452721e-06 
0.0138160586357117 -7.39847164368257e-05 8.63328605191782e-05 -2.67493464889412e-06 
0.0139480531215668 -7.6130912930239e-05 8.6018284491729e-05 -2.7763933303504e-06 
0.0141421062871814 -7.7230783062987e-05 8.60930886119604e-05 -2.65329413196014e-06 
0.0144617604091763 -7.80320551712066e-05 8.75676705618389e-05 -2.56701559919748e-06 
0.0149247562512755 -8.25340757728554e-05 9.06774075701833e-05 -2.69747101810935e-06 
0.0156548265367746 -8.79312719916925e-05 9.62569902185351e-05 -2.87873490378843e-06 
0.0169082414358854 -9.57201191340573e-05 0.00010683396976674 -3.18335651172674e-06 
0.0192683693021536 -0.000108341715531424 0.000127134058857337 -3.95512870454695e-06 
0.0236648954451084 -0.000133049616124481 0.000161985342856497 -5.53167774342e-06 
0.0312546715140343 -0.00017947876767721 0.000213083709240891 -8.10095934866695e-06 
0.0432003661990166 -0.000249963108217344 0.000277824728982523 -1.10446617327398e-05 
0.0600353926420212 -0.000349284324329346 0.000342714163707569 -1.40228921736707e-05 
0.0815517380833626 -0.000474141968879849 0.000395448063500226 -1.67419457284268e-05 
0.106206521391869 -0.000640832062344998 0.00041961541865021 -1.7538613974466e-05 
0.131310880184174 -0.000811516656540334 0.000403627142077312 -1.5161464943958e-05 
0.154699489474297 -0.000977466814219952 0.000354976509697735 -1.0460173143656e-05 
0.174162536859512 -0.00112843746319413 0.000280393345747143 -5.25421819475014e-06 
0.188654467463493 -0.00125556346029043 0.000192617444554344 1.67473183410038e-06 
0.198036432266235 -0.00132927892263979 0.000109697692096233 6.28076259090449e-06 
0.203532621264458 -0.00137044186703861 4.01925499318168e-05 1.00481820481946e-05 
0.205524981021881 -0.00141531822737306 -2.16778062167577e-05 1.19283404274029e-05 
0.205436408519745 -0.00142045458778739 -5.83147811994422e-05 1.38830573632731e-05 
0.203868240118027 -0.00141037942375988 -7.98473120084964e-05 1.42751659950591e-05 
0.201192826032639 -0.00139948178548366 -0.000102305239124689 1.55800389620708e-05 
0.197881266474724 -0.00133348046801984 -0.00011802080553025 1.74346369021805e-05 
0.194370254874229 -0.00126073765568435 -0.000121077871881425 1.72805357578909e-05 
0.190630197525024 -0.00115158339031041 -0.000129523410578258 1.82838157343213e-05 
0.186755612492561 -0.00105479487683624 -0.000133325447677635 1.83579486474628e-05 
0.183028116822243 -0.000920766615308821 -0.000128748128190637 1.86713205039268e-05 
0.179108306765556 -0.000812121317721903 -0.000123498408356681 1.72852433024673e-05 
0.175386637449265 -0.000646635366138071 -0.000114763388410211 1.62686137628043e-05 
0.171303033828735 -0.000514019746333361 -0.000107898573332932 1.42494500323664e-05 
0.166997075080872 -0.0003286495921202 -0.00010308701894246 1.2025347132294e-05 
0.162562340497971 -0.000125201186165214 -9.46005384321325e-05 9.89205182122532e-06 
0.157722562551498 3.81307472707704e-05 -9.18671721592546e-05 5.93456798014813e-06 
0.152383804321289 0.000188247402547859 -9.454940300202e-05 1.80922734216438e-06 
0.147285014390945 0.000363975821528584 -8.84061882970855e-05 -3.99140799345332e-06 
0.141832992434502 0.000515782099682838 -8.6212508904282e-05 -8.3724080468528e-06 
0.136131837964058 0.000643882085569203 -8.54750542202964e-05 -1.42752396641299e-05 
0.130619838833809 0.000806330528575927 -7.9780445958022e-05 -1.91714279935695e-05 
0.124948315322399 0.000979699310846627 -7.38029557396658e-05 -2.3663733372814e-05 
0.119121089577675 0.00116029672790319 -7.24147466826253e-05 -2.7902042347705e-05 
0.113399907946587 0.00136006413958967 -7.01646131346934e-05 -3.24889624607749e-05 
0.107626780867577 0.00156131736002862 -6.51843947707675e-05 -3.5933502658736e-05 
0.101702973246574 0.00178702606353909 -5.86291716899723e-05 -3.92106339859311e-05 
0.0959299057722092 0.00202530669048429 -5.24722599948291e-05 -4.13863599533215e-05 
0.0899579524993896 0.00225266139023006 -4.64346667286009e-05 -4.07930892833974e-05 
0.0842657312750816 0.00248417071998119 -3.8691025110893e-05 -4.01012912334409e-05 
0.078735813498497 0.00271875550970435 -3.13492673740257e-05 -3.83096921723336e-05 
0.0733731612563133 0.00292600248940289 -2.23418664972996e-05 -3.46133165294304e-05 
0.0681272819638252 0.00311861839145422 -1.3140493138053e-05 -2.87089660560014e-05 
0.0632807090878487 0.00328773818910122 -3.90711284126155e-06 -2.29741654038662e-05 
0.0584262348711491 0.00340490322560072 6.15786120761186e-06 -1.59003284352366e-05 
0.0538363792002201 0.00350021198391914 1.39296753332019e-05 -8.10370147519279e-06 
0.0494489893317223 0.00356241245754063 2.506778400857e-05 5.32707019829104e-07 
0.0453011393547058 0.00358794466592371 3.78809854737483e-05 9.72791167441756e-06 
0.0411962792277336 0.00355253601446748 5.00860915053636e-05 1.87113910214975e-05 
0.0373438559472561 0.00348882586695254 6.15201934124343e-05 2.73677796940319e-05 
0.0336087718605995 0.00337016466073692 7.2595983510837e-05 3.5668934287969e-05 
0.0300958268344402 0.00320770964026451 7.85648808232509e-05 4.22851117036771e-05 
0.0266108326613903 0.00298020034097135 7.81026392360218e-05 4.59896909887902e-05 
0.0233259703963995 0.0027350983582437 7.51781262806617e-05 4.80545713799074e-05 
0.0200262889266014 0.00244353525340557 6.81325545883738e-05 4.76637032988947e-05 
0.0167713183909655 0.00212371977977455 5.55460537725594e-05 4.46335543529131e-05 
0.013689829967916 0.0017928167944774 4.03602134610992e-05 3.98824595322367e-05 
0.0108786271885037 0.0014766133390367 2.47426796704531e-05 3.42161329172086e-05 
0.00829363521188498 0.00117528589908034 7.46529121897765e-06 2.77739200100768e-05 
0.00619385298341513 0.000920291116926819 -6.9596853791154e-06 2.15661657421151e-05 
0.00447001866996288 0.000703414436429739 -1.94956410268787e-05 1.60033469001064e-05 
0.00309868389740586 0.000530450372025371 -2.91302221739898e-05 1.10324663182837e-05 
0.00206274911761284 0.000397471361793578 -3.52348433807492e-05 6.9008956415928e-06 
0.00133901135995984 0.000297197955660522 -3.80130804842338e-05 3.6427945815376e-06 
0.000775627908296883 0.000218047338421457 -4.01719917135779e-05 1.38186112508265e-06 
0.000407302024541423 0.000168345402926207 -3.97724907088559e-05 1.94234921480074e-08 
0.000173625987372361 0.000131971741211601 -3.82440412067808e-05 -6.42626218905207e-07 
1.00075167210889e-05 0.000106019913800992 -3.6001940316055e-05 -9.85776864581567e-07 
-0.000102637604868505 8.66678747115657e-05 -3.35304393956903e-05 -1.11390318124904e-06 
-0.000155702131451108 7.57280722609721e-05 -3.09910865325946e-05 -1.18018101602502e-06 
-0.000194178894162178 6.11566138104536e-05 -2.82364308077376e-05 -1.43659394780116e-06 
-0.000258390442468226 5.19636087119579e-05 -2.65636936092051e-05 -1.59225805873575e-06 
-0.000271382683422416 4.5094628148945e-05 -2.52171394095058e-05 -1.36020923946489e-06 
-0.000287546252366155 3.64351290045306e-05 -2.4079470676952e-05 -1.52729410274333e-06 
-0.000329805712681264 3.10491086565889e-05 -2.34043091040803e-05 -1.49251036418718e-06 
-0.00034492471604608 2.03469844564097e-05 -2.2288309992291e-05 -2.28550652536796e-06 
0 0 0 0 
0 0 0 0 
0 0 0 0 
0 0 0 0 
0 0 0 0 
0 0 0 0 
0 0 0 0 
0 0 0 0 
0 0 0 0 
0 0 0 0 
0 0 0 0 
0 0 0 0 
0 0 0 0 
0 0 0 0 
98.3316116333008 1.48098003864288 0.14453125 0.0205413307994604 
