[
  {
    "name": "custom_mask",
    "type": "MaskImage",
    "path": "decor.png",
    "startDiffX": 0,
    "startDiffY": 0,
    "endDiffX": 0,
    "endDiffY": 0,
    "startScale": 1.0,
    "endScale": 3.5,
    "startAlpha": 1.0,
    "endAlpha": 0.0
  }
]


