{
   "color":
   [
      {
         "name":"fa_emphasize","value":"#317AF7"
      },{
         "name":"fa_activated","value":"#5291FF"
      },{
         "name":"fa_emphasize_outline","value":"#5291FF"
      },{
         "name":"fa_foreground","value":"#FFFFFF"
      },{
         "name":"fa_foreground_contrary","value":"#FFFFFF"
      },{
         "name":"fa_component_normal","value":"#19FFFFFF"
      },{
         "name":"fa_list_separator","value":"#33FFFFFF"
      },{
         "name":"fa_icon_primary","value":"#DBFFFFFF"
      },{
         "name":"fa_icon_secondary","value":"#99FFFFFF"
      },{
         "name":"fa_icon_tertiary","value":"#66FFFFFF"
      },{
         "name":"fa_icon_fourth","value":"#33FFFFFF"
      },{
         "name":"fa_icon_contrary","value":"#FFFFFF"
      },{
         "name":"fa_text_primary","value":"#DBFFFFFF"
      },{
         "name":"fa_text_secondary","value":"#99FFFFFF"
      },{
         "name":"fa_text_tertiary","value":"#66FFFFFF"
      },{
         "name":"fa_text_fourth","value":"#33FFFFFF"
      },{
         "name":"fa_text_contrary","value":"#FFFFFF"
      },{
         "name":"fa_text_activated","value":"#5291FF"
      },{
         "name":"fa_click_effect","value":"#19FFFFFF"
      },{
         "name":"fa_palette1","value":"#5F58C7"
      },{
         "name":"fa_palette2","value":"#4796C4"
      },{
         "name":"fa_palette3","value":"#5AADA0"
      },{
         "name":"fa_palette4","value":"#5BA854"
      },{
         "name":"fa_palette5","value":"#86AD53"
      },{
         "name":"fa_palette6","value":"#8C55C2"
      },{
         "name":"fa_palette7","value":"#D64966"
      },{
         "name":"fa_palette8","value":"#D94838"
      },{
         "name":"fa_palette9","value":"#DB6B42"
      },{
         "name":"fa_palette10","value":"#E08C3A"
      },{
         "name":"fa_palette11","value":"#D1A738"
      },{
         "name":"fa_palette12","value":"#838388"
      },{
         "name":"fa_emphasize_dark","value":"#317AF7"
      },{
         "name":"fa_emphasize_outline_dark","value":"#5291FF"
      },{
         "name":"fa_activated_dark","value":"#5291FF"
      },{
         "name":"fa_foreground_dark","value":"#FFFFFF"
      },{
         "name":"fa_foreground_contrary_dark","value":"#FFFFFF"
      },{
         "name":"fa_component_normal_dark","value":"#19FFFFFF"
      },{
         "name":"fa_list_separator_dark","value":"#33FFFFFF"
      },{
         "name":"fa_icon_primary_dark","value":"#DBFFFFFF"
      },{
         "name":"fa_icon_secondary_dark","value":"#99FFFFFF"
      },{
         "name":"fa_icon_tertiary_dark","value":"#66FFFFFF"
      },{
         "name":"fa_icon_fourth_dark","value":"#33FFFFFF"
      },{
         "name":"fa_icon_contrary_dark","value":"#FFFFFF"
      },{
         "name":"fa_text_primary_dark","value":"#DBFFFFFF"
      },{
         "name":"fa_text_secondary_dark","value":"#99FFFFFF"
      },{
         "name":"fa_text_tertiary_dark","value":"#66FFFFFF"
      },{
       "name":"fa_text_fourth_dark","value":"#33FFFFFF"
      },{
      "name":"fa_text_contrary_dark","value":"#FFFFFF"
      },{
         "name":"fa_text_activated_dark","value":"#5291FF"
      },{
         "name":"fa_click_effect_dark","value":"#19FFFFFF"
      },{
         "name":"fa_palette1_dark","value":"#5F58C7"
      },{
         "name":"fa_palette2_dark","value":"#4796C4"
      },{
         "name":"fa_palette3_dark","value":"#5AADA0"
      },{
         "name":"fa_palette4_dark","value":"#5BA854"
      },{
         "name":"fa_palette5_dark","value":"#86AD53"
      },{
         "name":"fa_palette6_dark","value":"#8C55C2"
      },{
         "name":"fa_palette7_dark","value":"#D64966"
      },{
         "name":"fa_palette8_dark","value":"#D94838"
      },{
         "name":"fa_palette9_dark","value":"#DB6B42"
      },{
         "name":"fa_palette10_dark","value":"#E08C3A"
      },{
         "name":"fa_palette12_dark","value":"#838388"
      },{
         "name":"fa_palette11_dark","value":"#D1A738"
      }

   ]

}