0 0 0 0 
0 0 0 0 
0 0 0 0 
0 0 0 0 
0 0 0 0 
0 0 0 0 
0 0 0 0 
0 0 0 0 
0 0 0 0 
0 0 0 0 
0.000940667639952153 -4.94359956064727e-05 -2.51392320933519e-05 -4.24620156991296e-06 
0.00103726075030863 -4.62020689155906e-05 -2.43186859734124e-05 -4.36397476732964e-06 
0.00111029634717852 -3.73193543055095e-05 -2.45223436650122e-05 -4.89926515001571e-06 
0.00118867249693722 -2.12647828448098e-05 -2.49268978222972e-05 -5.40169730811613e-06 
0.00135990092530847 1.13299950044166e-06 -2.47772695729509e-05 -5.6727485571173e-06 
0.00164303253404796 2.5964085580199e-05 -2.33165592362639e-05 -5.56341865376453e-06 
0.00193299492821097 4.72922365588602e-05 -2.11330552701838e-05 -4.99668340125936e-06 
0.00221767579205334 6.09585767961107e-05 -1.80868355528219e-05 -4.36294249084312e-06 
0.00243683438748121 6.52487869956531e-05 -1.45570857057464e-05 -3.50055188391707e-06 
0.00249689514748752 6.06766152486671e-05 -1.16861447168048e-05 -2.88935780190513e-06 
0.00239306408911943 5.26031290064566e-05 -1.01913374237483e-05 -2.37122321777861e-06 
0.00223108124919236 4.71023122372571e-05 -9.32537022890756e-06 -2.22916378334048e-06 
0.00206001987680793 4.2633600969566e-05 -8.8459528342355e-06 -2.02654587155848e-06 
0.00193569750990719 3.89519846066833e-05 -8.54178051667986e-06 -1.86172076155344e-06 
0.00186896871309727 3.61745915142819e-05 -8.31157922220882e-06 -1.76555090547481e-06 
0.00189024279825389 3.46959313901607e-05 -8.03697730589192e-06 -1.64650930400967e-06 
0.00198883144184947 3.35186086886097e-05 -7.77383502281737e-06 -1.65476217262039e-06 
0.00213356246240437 3.21328443533275e-05 -7.46418163544149e-06 -1.63391234764276e-06 
0.00231913407333195 3.11920957756229e-05 -7.17105649528094e-06 -1.60290335315949e-06 
0.00252431142143905 3.13232849293854e-05 -6.60588239043136e-06 -1.5657418543924e-06 
0.00268492475152016 3.02431071759202e-05 -6.31847160548205e-06 -1.6323434692822e-06 
0.0027820139657706 2.93024550046539e-05 -6.05302147960174e-06 -1.46951583701593e-06 
0.00281414343044162 2.84804755210644e-05 -6.13901829638053e-06 -1.49164952745195e-06 
0.00274709286168218 2.97668666462414e-05 -6.80899756844155e-06 -1.58679824835417e-06 
0.00259898696094751 3.18085694743786e-05 -8.05629315436818e-06 -1.79910614406253e-06 
0.00247894180938601 3.47531095030718e-05 -8.84807832335355e-06 -1.82253450020653e-06 
0.0024468582123518 3.52360002580099e-05 -9.08035235624993e-06 -1.90373839359381e-06 
0.00255977036431432 3.54662406607531e-05 -8.49612752062967e-06 -1.87728244327445e-06 
0.00288784597069025 3.35610166075639e-05 -7.11516531737288e-06 -1.77165702552884e-06 
0.00350534310564399 3.06607435049955e-05 -5.1597562560346e-06 -1.69023019225278e-06 
0.00445963395759463 2.71882836386794e-05 -3.30867123921053e-06 -1.82846360985423e-06 
0.00591887161135674 2.58040290646022e-05 -1.62375113177404e-06 -2.12155941881065e-06 
0.00810024980455637 2.53745256486582e-05 -9.23054983559268e-08 -2.48825494963967e-06 
0.0112559460103512 2.57949268416269e-05 1.62138587711524e-06 -3.00751298709656e-06 
0.015636932104826 2.32498914556345e-05 4.0310760596185e-06 -3.81654945158516e-06 
0.0214408338069916 2.00385311472928e-05 6.98141229804605e-06 -4.67999416287057e-06 
0.0286566019058228 1.68573133123573e-05 1.0575121450529e-05 -5.64943820791086e-06 
0.0370260924100876 1.21521679830039e-05 1.43761235449347e-05 -6.36864569969475e-06 
0.0462350398302078 5.20979028806323e-06 1.80830265890108e-05 -7.00139344189665e-06 
0.0558524057269096 -2.90032107841398e-06 2.26546017074725e-05 -6.75575347486301e-06 
0.065208688378334 -2.04394782485906e-05 2.5109753551078e-05 -6.43143721390516e-06 
0.0739331096410751 -4.28796811320353e-05 2.59209045907483e-05 -5.46968840353657e-06 
0.0818798616528511 -6.25977627350949e-05 2.59690950770164e-05 -5.18097976964782e-06 
0.0889513343572617 -9.23331535886973e-05 2.47146344918292e-05 -4.86008639200008e-06 
0.0949446931481361 -0.000121680830488913 2.09926674870076e-05 -5.39885104444693e-06 
0.10004834830761 -0.00014166186156217 1.92103088920703e-05 -6.25504981144331e-06 
0.104403749108315 -0.000155167173943482 1.80252827703953e-05 -6.66213009026251e-06 
0.108123779296875 -0.000163448174134828 1.69915765582118e-05 -6.79419008520199e-06 
0.111185111105442 -0.000158921917318366 1.73412263393402e-05 -6.8546778493328e-06 
0.113913841545582 -0.00014712028496433 1.93318937817821e-05 -5.98212182012503e-06 
0.116294242441654 -0.000133176421513781 2.12794366234448e-05 -4.83328813061235e-06 
0.118370436131954 -0.000114603979454841 2.23658353206702e-05 -4.50014113084762e-06 
0.120046123862267 -0.000105391904071439 2.34424351219786e-05 -3.69201438843447e-06 
0.121514730155468 -8.95841149031185e-05 2.4645050871186e-05 -2.58806085184915e-06 
0.12264908105135 -7.62739073252305e-05 2.49130607699044e-05 -2.72487068286864e-06 
0.123585589230061 -6.70273075229488e-05 2.51938690780662e-05 -2.48641072175815e-06 
0.12430415302515 -6.6039792727679e-05 2.62722496700007e-05 -1.3743218687523e-06 
0.124849207699299 -6.47086126264185e-05 2.67550658463733e-05 -5.38863446308824e-07 
0.125277414917946 -6.38743076706305e-05 2.59875123447273e-05 -4.82903260490275e-07 
0.125747054815292 -5.97656071477104e-05 2.52816771535436e-05 5.18632134571817e-07 
0.126195430755615 -6.43433013465255e-05 2.49105596594745e-05 1.74582123690925e-06 
0.126741766929626 -5.8213212469127e-05 2.29834968195064e-05 1.97541066881968e-06 
0.127361878752708 -6.25839165877551e-05 2.27482942136703e-05 2.6948271170113e-06 
0.127962097525597 -6.88237996655516e-05 2.24349696509307e-05 2.96552752843127e-06 
0.128441393375397 -7.79682013671845e-05 2.10888083529426e-05 3.70976044905547e-06 
0.12886668741703 -7.9272453149315e-05 1.78169266291661e-05 3.47746708939667e-06 
0.129091873764992 -9.74548675003462e-05 1.63260610861471e-05 4.38124379797955e-06 
0.12924562394619 -9.79102696874179e-05 1.25818332890049e-05 4.945663476974e-06 
0.12909996509552 -0.000122431214549579 8.33512967801653e-06 5.49976493857685e-06 
0.128955543041229 -0.000148336781421676 4.49167009719531e-06 4.32688057117048e-06 
0.128662005066872 -0.000173210690263659 2.15290037886007e-06 4.2963456508005e-06 
0.128422632813454 -0.000188292455277406 -4.33964203239157e-07 3.4670456443564e-06 
0.128066137433052 -0.0002110955392709 -2.61785658040026e-06 1.54790404849336e-06 
0.127958238124847 -0.000205400996492244 -2.38516759054619e-06 3.6742005704582e-07 
0.127650961279869 -0.000208463228773326 -2.61347167906933e-06 5.74728744595632e-07 
0.127427861094475 -0.000201500923139974 -2.91710603050888e-06 7.20650803032186e-07 
0.126990169286728 -0.000189584112376906 -4.29267129220534e-06 4.00292464064478e-07 
0.126474127173424 -0.00017860894149635 -4.24254312747507e-06 1.17492947993014e-06 
0.125720381736755 -0.0001834056165535 -6.44601823296398e-06 1.73164733041631e-06 
0.1248829215765 -0.000186541365110315 -7.56893177822349e-06 2.21037430492288e-06 
0.123917683959007 -0.000189683851203881 -9.23687366594095e-06 2.25716985369218e-06 
0.122925162315369 -0.000205445743631572 -9.2799427875434e-06 2.23063125304179e-06 
0.121789626777172 -0.000211666731047444 -1.1837953934446e-05 1.84558325599937e-06 
0.120566748082638 -0.00021482958982233 -1.26919794638525e-05 1.72728346115036e-06 
0.119311191141605 -0.000204848402063362 -1.46424263220979e-05 1.66520919719915e-06 
0.118109628558159 -0.00020248482178431 -1.64426819537766e-05 1.36707717501849e-06 
0.116937167942524 -0.000193472922546789 -1.74532524397364e-05 2.06942877412075e-06 
0.116054058074951 -0.000178312839125283 -1.73948628798826e-05 2.81226903098286e-06 
0.11531239002943 -0.000165122095495462 -1.81447776412824e-05 3.66500785276003e-06 
0.114794164896011 -0.000147796657984145 -1.67048729053931e-05 4.1073599277297e-06 
0.114255100488663 -0.000136666916660033 -1.5646588508389e-05 4.82772975374246e-06 
0.11371536552906 -0.000122041601571254 -1.62327523867134e-05 5.42238194611855e-06 
0.113141231238842 -0.00011909788736375 -1.60893923748517e-05 5.85227917326847e-06 
0.112344510853291 -0.000114137837954331 -1.69572285813047e-05 6.58711678624968e-06 
0.111237660050392 -0.000117372052045539 -1.92283750948263e-05 6.21567915004562e-06 
0.109814144670963 -0.000110189612314571 -2.07710054382915e-05 4.8989004426403e-06 
0.108112417161465 -0.000106876737845596 -2.34933249885216e-05 3.91437106372905e-06 
0.105958849191666 -0.000111853587441146 -2.66900933638681e-05 2.5461472432653e-06 
0.103770606219769 -0.000108355729025789 -2.61184341070475e-05 7.92740422639326e-07 
0.10157161206007 -0.00010321062291041 -2.46190866164397e-05 2.05482763249165e-07 
0.0993606671690941 -9.92436544038355e-05 -2.47837378992699e-05 1.73709565842728e-07 
0.0972519740462303 -8.11448626336642e-05 -2.3506028810516e-05 -1.01079046999075e-06 
0.0953280106186867 -5.8163652283838e-05 -2.12438426387962e-05 -8.58257067193335e-07 
0.0934873223304749 -2.40775934798876e-05 -2.17418219108367e-05 -7.94128141023975e-07 
0.0916523337364197 5.21844185641385e-06 -2.24062005145242e-05 -5.11173368522577e-07 
0.089953824877739 4.06256804126315e-05 -2.19177745748311e-05 2.56747085813913e-07 
0.0882135853171349 7.03137848176993e-05 -2.08124565688195e-05 9.66394964052597e-07 
0.0865847393870354 0.00011316725431243 -1.99284932023147e-05 8.30307499199989e-07 
0.0847497060894966 0.000145321726449765 -1.87798013939755e-05 1.27190003240685e-06 
0.0827859789133072 0.000191961458767764 -1.86120541911805e-05 1.43095462590281e-06 
0.0807370617985725 0.000246398209128529 -1.79636372195091e-05 8.37140646581247e-07 
0.0783856064081192 0.000289356423309073 -1.85223561857129e-05 -3.20077106152894e-07 
0.0757125169038773 0.000328610884025693 -1.92174684343627e-05 -1.51927144997899e-06 
0.0731207430362701 0.000376215786673129 -1.93080813915003e-05 -3.47193736160989e-06 
0.0703457370400429 0.000417394825490192 -1.94028252735734e-05 -4.57980468127062e-06 
0.0674465000629425 0.000449347629910335 -1.88839876500424e-05 -5.93262484471779e-06 
0.0646668151021004 0.000492662831675261 -1.84898544830503e-05 -6.21511708231992e-06 
0.0619098693132401 0.000545245362445712 -1.71167921507731e-05 -6.64545996187371e-06 
0.059046596288681 0.000595069257542491 -1.58639086293988e-05 -7.01275439496385e-06 
0.05624895170331 0.00064705079421401 -1.3670083717443e-05 -7.73327974457061e-06 
0.0534205213189125 0.000702426943462342 -1.22205210573156e-05 -7.93727031123126e-06 
0.0505916923284531 0.000762741314247251 -9.93908997770632e-06 -8.30713179311715e-06 
0.047788992524147 0.000817483640275896 -8.29473719932139e-06 -8.83526263351087e-06 
0.0449563674628735 0.000871714670211077 -6.77362231726875e-06 -8.17222280602437e-06 
0.0422937087714672 0.000929450441617519 -5.31846399098868e-06 -8.10934488981729e-06 
0.0397136770188808 0.000985686667263508 -3.69052099813416e-06 -8.03261809778633e-06 
0.0372536666691303 0.00103562267031521 -1.17746435535082e-06 -7.65186996432021e-06 
0.0348720885813236 0.00108311523217708 1.54977192323713e-06 -6.18006652075564e-06 
0.0327024310827255 0.00112365232780576 4.44530269305687e-06 -5.35241406396381e-06 
0.0305529329925776 0.00114976952318102 7.29896873963298e-06 -3.8923885767872e-06 
0.0285483356565237 0.00117002124898136 1.0086353540828e-05 -1.97417830349877e-06 
0.0265610441565514 0.00117521814536303 1.23804366012337e-05 -6.72091630349314e-07 
0.0246530808508396 0.00116702856030315 1.4407634807867e-05 7.19184242825577e-07 
0.0226827375590801 0.00114301673602313 1.54904500959674e-05 3.06680385619984e-06 
0.0207940004765987 0.00110961683094501 1.61836978804786e-05 5.24310507898917e-06 
0.0188569091260433 0.00105685414746404 1.63189306476852e-05 7.68703466746956e-06 
0.0169564075767994 0.000994238769635558 1.55704528879141e-05 1.08784515759908e-05 
0.0149858882650733 0.000915670301765203 1.34972915475373e-05 1.39205394589226e-05 
0.013048380613327 0.00082638394087553 1.08190070022829e-05 1.55468660523184e-05 
0.0110055394470692 0.000724233803339303 7.10612221155316e-06 1.64969551406102e-05 
0.00904560554772615 0.000621126731857657 3.0033413622732e-06 1.69409613590688e-05 
0.00716758705675602 0.000516890257131308 -1.27761211388133e-06 1.61452753673075e-05 
0.00548468250781298 0.000420640746597201 -5.32940930497716e-06 1.42217277243617e-05 
0.00398977333679795 0.000336519005941227 -8.89092461875407e-06 1.19512305900571e-05 
0.00277506606653333 0.000268121104454622 -1.1844413165818e-05 9.68640142673394e-06 
0.00175940268673003 0.000211165694054216 -1.44953783092205e-05 6.8975346039224e-06 
0.00100568041671067 0.000168885380844586 -1.64570210472448e-05 4.52867288913694e-06 
0.000406180275604129 0.000136510527227074 -1.77667643583845e-05 2.70138093583228e-06 
-1.63975946634309e-05 0.000113079186121468 -1.86736178875435e-05 1.21623759241629e-06 
-0.00031431601382792 9.5650932053104e-05 -1.88215562957339e-05 1.48446801517821e-07 
-0.000482252478832379 8.31958750495687e-05 -1.82229323399952e-05 -6.21875074102718e-07 
-0.000597149366512895 7.37244772608392e-05 -1.74714878085069e-05 -9.9431076705514e-07 
-0.000642522005364299 6.73186732456088e-05 -1.65097571880324e-05 -1.21966934329976e-06 
-0.0006786216981709 6.05484201514628e-05 -1.52788488776423e-05 -1.28542501443007e-06 
-0.000667539599817246 5.5228803830687e-05 -1.4252659639169e-05 -1.39617566219385e-06 
-0.000682155194226652 4.99658672197256e-05 -1.35818700073287e-05 -1.31777608203265e-06 
-0.000675995950587094 4.58023896499071e-05 -1.29074987853528e-05 -1.34738615997776e-06 
-0.000677120173349977 4.22598095610738e-05 -1.2310280908423e-05 -1.29687111893872e-06 
-0.00064950663363561 3.98959127778653e-05 -1.18145298984018e-05 -1.36766504965635e-06 
-0.000631837407127023 3.83456645067781e-05 -1.12584648377378e-05 -1.38985797093483e-06 
-0.000606246059760451 3.59726400347427e-05 -1.08551566881943e-05 -1.65837116128387e-06 
0 0 0 0 
0 0 0 0 
0 0 0 0 
0 0 0 0 
0 0 0 0 
0 0 0 0 
0 0 0 0 
0 0 0 0 
0 0 0 0 
0 0 0 0 
0 0 0 0 
0 0 0 0 
0 0 0 0 
0 0 0 0 
99.4678268432617 0.495282799005508 0.0205515958368778 0.00651152618229389 
