#,version,,,,,,,,,,,,,,,,,,,,,,,,,,,,,,,,,,,,,,,,,,,,,,,,,
2021,5,6,4,,,,,,,,,,,,,,,,,,,,,,,,,,,,,,,,,,,,,,,,,,,,,,,
#,row_col_num,,,,,,,,,,,,,,,,,,,,,,,,,,,,,,,,,,,,,,,,,,,,,,,,,
34,17,,,,,,,,,,,,,,,,,,,,,,,,,,,,,,,,,,,,,,,,,,,,,,,,,
#,noise,,,,,,,,,,,,,,,,,,,,,,,,,,,,,,,,,,,,,,,,,,,,,,,,,
-500,500,,,,,,,,,,,,,,,,,,,,,,,,,,,,,,,,,,,,,,,,,,,,,,,,,
#,raw_max,,,,,,,,,,,,,,,,,,,,,,,,,,,,,,,,,,,,,,,,,,,,,,,,,
4014,4401,4471,4456,4507,4461,4423,3874,2920,3600,4176,4206,4230,4180,4189,4144,3502,,,,,,,,,,,,,,,,,,,,,,,,,,,,,,,,,,
4468,4579,4626,4611,4656,4599,4561,4477,4311,4404,4426,4428,4462,4434,4450,4429,4254,,,,,,,,,,,,,,,,,,,,,,,,,,,,,,,,,,
4435,4533,4579,4558,4611,4552,4515,4465,4467,4425,4393,4395,4438,4402,4422,4402,4278,,,,,,,,,,,,,,,,,,,,,,,,,,,,,,,,,,
4399,4504,4552,4536,4588,4528,4491,4443,4461,4399,4365,4375,4414,4378,4399,4380,4263,,,,,,,,,,,,,,,,,,,,,,,,,,,,,,,,,,
4414,4531,4587,4566,4623,4560,4518,4474,4498,4434,4399,4405,4449,4410,4431,4405,4299,,,,,,,,,,,,,,,,,,,,,,,,,,,,,,,,,,
4389,4519,4567,4554,4603,4543,4506,4458,4488,4417,4380,4395,4429,4401,4419,4393,4287,,,,,,,,,,,,,,,,,,,,,,,,,,,,,,,,,,
4396,4543,4596,4578,4627,4560,4531,4485,4507,4443,4401,4407,4450,4419,4440,4420,4315,,,,,,,,,,,,,,,,,,,,,,,,,,,,,,,,,,
4275,4423,4474,4461,4509,4443,4408,4368,4386,4324,4288,4294,4333,4302,4323,4305,4195,,,,,,,,,,,,,,,,,,,,,,,,,,,,,,,,,,
4333,4497,4540,4533,4578,4518,4477,4429,4458,4390,4360,4359,4404,4369,4390,4372,4263,,,,,,,,,,,,,,,,,,,,,,,,,,,,,,,,,,
4296,4458,4506,4500,4545,4479,4441,4392,4425,4350,4318,4324,4365,4333,4354,4336,4227,,,,,,,,,,,,,,,,,,,,,,,,,,,,,,,,,,
4291,4459,4507,4507,4546,4483,4437,4402,4416,4353,4311,4326,4366,4335,4351,4336,4227,,,,,,,,,,,,,,,,,,,,,,,,,,,,,,,,,,
4285,4461,4509,4506,4554,4488,4456,4399,4422,4354,4318,4326,4365,4332,4357,4335,4233,,,,,,,,,,,,,,,,,,,,,,,,,,,,,,,,,,
4303,4485,4533,4534,4573,4515,4477,4429,4447,4381,4344,4350,4390,4360,4381,4362,4257,,,,,,,,,,,,,,,,,,,,,,,,,,,,,,,,,,
4299,4483,4536,4533,4588,4509,4476,4438,4449,4386,4345,4356,4392,4360,4381,4368,4257,,,,,,,,,,,,,,,,,,,,,,,,,,,,,,,,,,
4284,4470,4519,4530,4564,4500,4465,4420,4438,4375,4333,4348,4384,4347,4368,4353,4251,,,,,,,,,,,,,,,,,,,,,,,,,,,,,,,,,,
4258,4449,4509,4509,4545,4483,4443,4399,4422,4362,4321,4330,4362,4330,4351,4336,4234,,,,,,,,,,,,,,,,,,,,,,,,,,,,,,,,,,
4281,4497,4536,4542,4582,4515,4483,4438,4453,4393,4360,4365,4401,4366,4387,4372,4270,,,,,,,,,,,,,,,,,,,,,,,,,,,,,,,,,,
4215,4416,4465,4473,4509,4449,4413,4366,4384,4327,4285,4296,4330,4299,4315,4305,4203,,,,,,,,,,,,,,,,,,,,,,,,,,,,,,,,,,
4279,4476,4522,4537,4570,4509,4471,4428,4447,4381,4347,4356,4392,4357,4378,4363,4261,,,,,,,,,,,,,,,,,,,,,,,,,,,,,,,,,,
4243,4461,4504,4521,4549,4491,4450,4401,4422,4362,4321,4336,4366,4339,4359,4347,4242,,,,,,,,,,,,,,,,,,,,,,,,,,,,,,,,,,
4236,4450,4500,4516,4549,4486,4453,4401,4413,4356,4317,4330,4371,4335,4354,4341,4243,,,,,,,,,,,,,,,,,,,,,,,,,,,,,,,,,,
4237,4455,4504,4525,4555,4489,4455,4405,4419,4360,4321,4335,4371,4336,4360,4347,4248,,,,,,,,,,,,,,,,,,,,,,,,,,,,,,,,,,
4300,4524,4576,4597,4624,4564,4519,4474,4494,4428,4393,4398,4443,4407,4431,4411,4314,,,,,,,,,,,,,,,,,,,,,,,,,,,,,,,,,,
4321,4554,4608,4626,4654,4584,4546,4497,4512,4450,4414,4432,4468,4435,4449,4434,4336,,,,,,,,,,,,,,,,,,,,,,,,,,,,,,,,,,
4419,4660,4714,4738,4762,4690,4650,4599,4618,4557,4516,4534,4570,4537,4555,4542,4438,,,,,,,,,,,,,,,,,,,,,,,,,,,,,,,,,,
4554,4807,4861,4884,4915,4839,4794,4744,4761,4704,4659,4672,4713,4680,4701,4681,4575,,,,,,,,,,,,,,,,,,,,,,,,,,,,,,,,,,
4644,4899,4957,4978,5007,4927,4885,4834,4863,4794,4747,4759,4801,4764,4788,4770,4671,,,,,,,,,,,,,,,,,,,,,,,,,,,,,,,,,,
4651,4908,4962,4984,5013,4933,4890,4837,4864,4800,4755,4767,4809,4773,4792,4780,4674,,,,,,,,,,,,,,,,,,,,,,,,,,,,,,,,,,
4800,5065,5115,5136,5166,5086,5041,4984,5010,4941,4902,4918,4956,4924,4945,4923,4815,,,,,,,,,,,,,,,,,,,,,,,,,,,,,,,,,,
4924,5193,5245,5259,5307,5212,5163,5107,5131,5071,5023,5040,5077,5032,5061,5040,4935,,,,,,,,,,,,,,,,,,,,,,,,,,,,,,,,,,
5023,5296,5352,5361,5409,5305,5256,5197,5229,5164,5115,5133,5170,5133,5149,5128,5017,,,,,,,,,,,,,,,,,,,,,,,,,,,,,,,,,,
5161,5442,5485,5491,5550,5430,5382,5317,5353,5281,5238,5254,5298,5253,5269,5245,5136,,,,,,,,,,,,,,,,,,,,,,,,,,,,,,,,,,
5347,5619,5655,5655,5716,5589,5535,5473,5514,5446,5394,5415,5452,5406,5433,5406,5287,,,,,,,,,,,,,,,,,,,,,,,,,,,,,,,,,,
4893,5746,5769,5743,5752,5653,5617,5575,5631,5571,5535,5587,5640,5611,5665,5641,4899,,,,,,,,,,,,,,,,,,,,,,,,,,,,,,,,,,
#,raw_min,,,,,,,,,,,,,,,,,,,,,,,,,,,,,,,,,,,,,,,,,,,,,,,,,
1338,1467,1490,1485,1502,1487,1474,1291,973,1200,1392,1402,1410,1393,1396,1381,1167,,,,,,,,,,,,,,,,,,,,,,,,,,,,,,,,,,
1489,1526,1542,1537,1552,1533,1520,1492,1437,1468,1475,1476,1487,1478,1483,1476,1418,,,,,,,,,,,,,,,,,,,,,,,,,,,,,,,,,,
1478,1511,1526,1519,1537,1517,1505,1488,1489,1475,1464,1465,1479,1467,1474,1467,1426,,,,,,,,,,,,,,,,,,,,,,,,,,,,,,,,,,
1466,1501,1517,1512,1529,1509,1497,1481,1487,1466,1455,1458,1471,1459,1466,1460,1421,,,,,,,,,,,,,,,,,,,,,,,,,,,,,,,,,,
1471,1510,1529,1522,1541,1520,1506,1491,1499,1478,1466,1468,1483,1470,1477,1468,1433,,,,,,,,,,,,,,,,,,,,,,,,,,,,,,,,,,
1463,1506,1522,1518,1534,1514,1502,1486,1496,1472,1460,1465,1476,1467,1473,1464,1429,,,,,,,,,,,,,,,,,,,,,,,,,,,,,,,,,,
1465,1514,1532,1526,1542,1520,1510,1495,1502,1481,1467,1469,1483,1473,1480,1473,1438,,,,,,,,,,,,,,,,,,,,,,,,,,,,,,,,,,
1425,1474,1491,1487,1503,1481,1469,1456,1462,1441,1429,1431,1444,1434,1441,1435,1398,,,,,,,,,,,,,,,,,,,,,,,,,,,,,,,,,,
1444,1499,1513,1511,1526,1506,1492,1476,1486,1463,1453,1453,1468,1456,1463,1457,1421,,,,,,,,,,,,,,,,,,,,,,,,,,,,,,,,,,
1432,1486,1502,1500,1515,1493,1480,1464,1475,1450,1439,1441,1455,1444,1451,1445,1409,,,,,,,,,,,,,,,,,,,,,,,,,,,,,,,,,,
1430,1486,1502,1502,1515,1494,1479,1467,1472,1451,1437,1442,1455,1445,1450,1445,1409,,,,,,,,,,,,,,,,,,,,,,,,,,,,,,,,,,
1428,1487,1503,1502,1518,1496,1485,1466,1474,1451,1439,1442,1455,1444,1452,1445,1411,,,,,,,,,,,,,,,,,,,,,,,,,,,,,,,,,,
1434,1495,1511,1511,1524,1505,1492,1476,1482,1460,1448,1450,1463,1453,1460,1454,1419,,,,,,,,,,,,,,,,,,,,,,,,,,,,,,,,,,
1433,1494,1512,1511,1529,1503,1492,1479,1483,1462,1448,1452,1464,1453,1460,1456,1419,,,,,,,,,,,,,,,,,,,,,,,,,,,,,,,,,,
1428,1490,1506,1510,1521,1500,1488,1473,1479,1458,1444,1449,1461,1449,1456,1451,1417,,,,,,,,,,,,,,,,,,,,,,,,,,,,,,,,,,
1419,1483,1503,1503,1515,1494,1481,1466,1474,1454,1440,1443,1454,1443,1450,1445,1411,,,,,,,,,,,,,,,,,,,,,,,,,,,,,,,,,,
1427,1499,1512,1514,1527,1505,1494,1479,1484,1464,1453,1455,1467,1455,1462,1457,1423,,,,,,,,,,,,,,,,,,,,,,,,,,,,,,,,,,
1405,1472,1488,1491,1503,1483,1471,1455,1461,1442,1428,1432,1443,1433,1438,1435,1401,,,,,,,,,,,,,,,,,,,,,,,,,,,,,,,,,,
1426,1492,1507,1512,1523,1503,1490,1476,1482,1460,1449,1452,1464,1452,1459,1454,1420,,,,,,,,,,,,,,,,,,,,,,,,,,,,,,,,,,
1414,1487,1501,1507,1516,1497,1483,1467,1474,1454,1440,1445,1455,1446,1453,1449,1414,,,,,,,,,,,,,,,,,,,,,,,,,,,,,,,,,,
1412,1483,1500,1505,1516,1495,1484,1467,1471,1452,1439,1443,1457,1445,1451,1447,1414,,,,,,,,,,,,,,,,,,,,,,,,,,,,,,,,,,
1412,1485,1501,1508,1518,1496,1485,1468,1473,1453,1440,1445,1457,1445,1453,1449,1416,,,,,,,,,,,,,,,,,,,,,,,,,,,,,,,,,,
1433,1508,1525,1532,1541,1521,1506,1491,1498,1476,1464,1466,1481,1469,1477,1470,1438,,,,,,,,,,,,,,,,,,,,,,,,,,,,,,,,,,
1440,1518,1536,1542,1551,1528,1515,1499,1504,1483,1471,1477,1489,1478,1483,1478,1445,,,,,,,,,,,,,,,,,,,,,,,,,,,,,,,,,,
1473,1553,1571,1579,1587,1563,1550,1533,1539,1519,1505,1511,1523,1512,1518,1514,1479,,,,,,,,,,,,,,,,,,,,,,,,,,,,,,,,,,
1518,1602,1620,1628,1638,1613,1598,1581,1587,1568,1553,1557,1571,1560,1567,1560,1525,,,,,,,,,,,,,,,,,,,,,,,,,,,,,,,,,,
1548,1633,1652,1659,1669,1642,1628,1611,1621,1598,1582,1586,1600,1588,1596,1590,1557,,,,,,,,,,,,,,,,,,,,,,,,,,,,,,,,,,
1550,1636,1654,1661,1671,1644,1630,1612,1621,1600,1585,1589,1603,1591,1597,1593,1558,,,,,,,,,,,,,,,,,,,,,,,,,,,,,,,,,,
1600,1688,1705,1712,1722,1695,1680,1661,1670,1647,1634,1639,1652,1641,1648,1641,1605,,,,,,,,,,,,,,,,,,,,,,,,,,,,,,,,,,
1641,1731,1748,1753,1769,1737,1721,1702,1710,1690,1674,1680,1692,1677,1687,1680,1645,,,,,,,,,,,,,,,,,,,,,,,,,,,,,,,,,,
1674,1765,1784,1787,1803,1768,1752,1732,1743,1721,1705,1711,1723,1711,1716,1709,1672,,,,,,,,,,,,,,,,,,,,,,,,,,,,,,,,,,
1720,1814,1828,1830,1850,1810,1794,1772,1784,1760,1746,1751,1766,1751,1756,1748,1712,,,,,,,,,,,,,,,,,,,,,,,,,,,,,,,,,,
1782,1873,1885,1885,1905,1863,1845,1824,1838,1815,1798,1805,1817,1802,1811,1802,1762,,,,,,,,,,,,,,,,,,,,,,,,,,,,,,,,,,
1631,1915,1923,1914,1917,1884,1872,1858,1877,1857,1845,1862,1880,1870,1888,1880,1633,,,,,,,,,,,,,,,,,,,,,,,,,,,,,,,,,,
#,raw_row_delta_max,,,,,,,,,,,,,,,,,,,,,,,,,,,,,,,,,,,,,,,,,,,,,,,,,
1000,600,600,600,600,600,1600,1600,1600,1600,600,600,600,600,600,600,1250,,,,,,,,,,,,,,,,,,,,,,,,,,,,,,,,,,
600,600,600,600,600,600,600,600,600,600,600,600,600,600,600,600,600,,,,,,,,,,,,,,,,,,,,,,,,,,,,,,,,,,
600,600,600,600,600,600,600,600,600,600,600,600,600,600,600,600,600,,,,,,,,,,,,,,,,,,,,,,,,,,,,,,,,,,
600,600,600,600,600,600,600,600,600,600,600,600,600,600,600,600,600,,,,,,,,,,,,,,,,,,,,,,,,,,,,,,,,,,
600,600,600,600,600,600,600,600,600,600,600,600,600,600,600,600,600,,,,,,,,,,,,,,,,,,,,,,,,,,,,,,,,,,
600,600,600,600,600,600,600,600,600,600,600,600,600,600,600,600,600,,,,,,,,,,,,,,,,,,,,,,,,,,,,,,,,,,
600,600,600,600,600,600,600,600,600,600,600,600,600,600,600,600,600,,,,,,,,,,,,,,,,,,,,,,,,,,,,,,,,,,
600,600,600,600,600,600,600,600,600,600,600,600,600,600,600,600,600,,,,,,,,,,,,,,,,,,,,,,,,,,,,,,,,,,
600,600,600,600,600,600,600,600,600,600,600,600,600,600,600,600,600,,,,,,,,,,,,,,,,,,,,,,,,,,,,,,,,,,
600,600,600,600,600,600,600,600,600,600,600,600,600,600,600,600,600,,,,,,,,,,,,,,,,,,,,,,,,,,,,,,,,,,
600,600,600,600,600,600,600,600,600,600,600,600,600,600,600,600,600,,,,,,,,,,,,,,,,,,,,,,,,,,,,,,,,,,
600,600,600,600,600,600,600,600,600,600,600,600,600,600,600,600,600,,,,,,,,,,,,,,,,,,,,,,,,,,,,,,,,,,
600,600,600,600,600,600,600,600,600,600,600,600,600,600,600,600,600,,,,,,,,,,,,,,,,,,,,,,,,,,,,,,,,,,
600,600,600,600,600,600,600,600,600,600,600,600,600,600,600,600,600,,,,,,,,,,,,,,,,,,,,,,,,,,,,,,,,,,
600,600,600,600,600,600,600,600,600,600,600,600,600,600,600,600,600,,,,,,,,,,,,,,,,,,,,,,,,,,,,,,,,,,
600,600,600,600,600,600,600,600,600,600,600,600,600,600,600,600,600,,,,,,,,,,,,,,,,,,,,,,,,,,,,,,,,,,
600,600,600,600,600,600,600,600,600,600,600,600,600,600,600,600,600,,,,,,,,,,,,,,,,,,,,,,,,,,,,,,,,,,
600,600,600,600,600,600,600,600,600,600,600,600,600,600,600,600,600,,,,,,,,,,,,,,,,,,,,,,,,,,,,,,,,,,
600,600,600,600,600,600,600,600,600,600,600,600,600,600,600,600,600,,,,,,,,,,,,,,,,,,,,,,,,,,,,,,,,,,
600,600,600,600,600,600,600,600,600,600,600,600,600,600,600,600,600,,,,,,,,,,,,,,,,,,,,,,,,,,,,,,,,,,
600,600,600,600,600,600,600,600,600,600,600,600,600,600,600,600,600,,,,,,,,,,,,,,,,,,,,,,,,,,,,,,,,,,
600,600,600,600,600,600,600,600,600,600,600,600,600,600,600,600,600,,,,,,,,,,,,,,,,,,,,,,,,,,,,,,,,,,
600,600,600,600,600,600,600,600,600,600,600,600,600,600,600,600,600,,,,,,,,,,,,,,,,,,,,,,,,,,,,,,,,,,
600,600,600,600,600,600,600,600,600,600,600,600,600,600,600,600,600,,,,,,,,,,,,,,,,,,,,,,,,,,,,,,,,,,
600,600,600,600,600,600,600,600,600,600,600,600,600,600,600,600,600,,,,,,,,,,,,,,,,,,,,,,,,,,,,,,,,,,
600,600,600,600,600,600,600,600,600,600,600,600,600,600,600,600,600,,,,,,,,,,,,,,,,,,,,,,,,,,,,,,,,,,
600,600,600,600,600,600,600,600,600,600,600,600,600,600,600,600,600,,,,,,,,,,,,,,,,,,,,,,,,,,,,,,,,,,
600,600,600,600,600,600,600,600,600,600,600,600,600,600,600,600,600,,,,,,,,,,,,,,,,,,,,,,,,,,,,,,,,,,
600,600,600,600,600,600,600,600,600,600,600,600,600,600,600,600,600,,,,,,,,,,,,,,,,,,,,,,,,,,,,,,,,,,
600,600,600,600,600,600,600,600,600,600,600,600,600,600,600,600,600,,,,,,,,,,,,,,,,,,,,,,,,,,,,,,,,,,
600,600,600,600,600,600,600,600,600,600,600,600,600,600,600,600,600,,,,,,,,,,,,,,,,,,,,,,,,,,,,,,,,,,
600,600,600,600,600,600,600,600,600,600,600,600,600,600,600,600,600,,,,,,,,,,,,,,,,,,,,,,,,,,,,,,,,,,
750,625,625,625,625,625,625,625,625,625,625,625,625,625,625,625,625,,,,,,,,,,,,,,,,,,,,,,,,,,,,,,,,,,
#,raw_row_delta_min,,,,,,,,,,,,,,,,,,,,,,,,,,,,,,,,,,,,,,,,,,,,,,,,,
-600,-600,-600,-600,-600,-600,-600,-1600,-1600,-1600,-600,-600,-600,-600,-600,-600,-1000,,,,,,,,,,,,,,,,,,,,,,,,,,,,,,,,,,
-600,-600,-600,-600,-600,-600,-600,-600,-600,-600,-600,-600,-600,-600,-600,-600,-600,,,,,,,,,,,,,,,,,,,,,,,,,,,,,,,,,,
-600,-600,-600,-600,-600,-600,-600,-600,-600,-600,-600,-600,-600,-600,-600,-600,-600,,,,,,,,,,,,,,,,,,,,,,,,,,,,,,,,,,
-600,-600,-600,-600,-600,-600,-600,-600,-600,-600,-600,-600,-600,-600,-600,-600,-600,,,,,,,,,,,,,,,,,,,,,,,,,,,,,,,,,,
-600,-600,-600,-600,-600,-600,-600,-600,-600,-600,-600,-600,-600,-600,-600,-600,-600,,,,,,,,,,,,,,,,,,,,,,,,,,,,,,,,,,
-600,-600,-600,-600,-600,-600,-600,-600,-600,-600,-600,-600,-600,-600,-600,-600,-600,,,,,,,,,,,,,,,,,,,,,,,,,,,,,,,,,,
-600,-600,-600,-600,-600,-600,-600,-600,-600,-600,-600,-600,-600,-600,-600,-600,-600,,,,,,,,,,,,,,,,,,,,,,,,,,,,,,,,,,
-600,-600,-600,-600,-600,-600,-600,-600,-600,-600,-600,-600,-600,-600,-600,-600,-600,,,,,,,,,,,,,,,,,,,,,,,,,,,,,,,,,,
-600,-600,-600,-600,-600,-600,-600,-600,-600,-600,-600,-600,-600,-600,-600,-600,-600,,,,,,,,,,,,,,,,,,,,,,,,,,,,,,,,,,
-600,-600,-600,-600,-600,-600,-600,-600,-600,-600,-600,-600,-600,-600,-600,-600,-600,,,,,,,,,,,,,,,,,,,,,,,,,,,,,,,,,,
-600,-600,-600,-600,-600,-600,-600,-600,-600,-600,-600,-600,-600,-600,-600,-600,-600,,,,,,,,,,,,,,,,,,,,,,,,,,,,,,,,,,
-600,-600,-600,-600,-600,-600,-600,-600,-600,-600,-600,-600,-600,-600,-600,-600,-600,,,,,,,,,,,,,,,,,,,,,,,,,,,,,,,,,,
-600,-600,-600,-600,-600,-600,-600,-600,-600,-600,-600,-600,-600,-600,-600,-600,-600,,,,,,,,,,,,,,,,,,,,,,,,,,,,,,,,,,
-600,-600,-600,-600,-600,-600,-600,-600,-600,-600,-600,-600,-600,-600,-600,-600,-600,,,,,,,,,,,,,,,,,,,,,,,,,,,,,,,,,,
-600,-600,-600,-600,-600,-600,-600,-600,-600,-600,-600,-600,-600,-600,-600,-600,-600,,,,,,,,,,,,,,,,,,,,,,,,,,,,,,,,,,
-600,-600,-600,-600,-600,-600,-600,-600,-600,-600,-600,-600,-600,-600,-600,-600,-600,,,,,,,,,,,,,,,,,,,,,,,,,,,,,,,,,,
-600,-600,-600,-600,-600,-600,-600,-600,-600,-600,-600,-600,-600,-600,-600,-600,-600,,,,,,,,,,,,,,,,,,,,,,,,,,,,,,,,,,
-600,-600,-600,-600,-600,-600,-600,-600,-600,-600,-600,-600,-600,-600,-600,-600,-600,,,,,,,,,,,,,,,,,,,,,,,,,,,,,,,,,,
-600,-600,-600,-600,-600,-600,-600,-600,-600,-600,-600,-600,-600,-600,-600,-600,-600,,,,,,,,,,,,,,,,,,,,,,,,,,,,,,,,,,
-600,-600,-600,-600,-600,-600,-600,-600,-600,-600,-600,-600,-600,-600,-600,-600,-600,,,,,,,,,,,,,,,,,,,,,,,,,,,,,,,,,,
-600,-600,-600,-600,-600,-600,-600,-600,-600,-600,-600,-600,-600,-600,-600,-600,-600,,,,,,,,,,,,,,,,,,,,,,,,,,,,,,,,,,
-600,-600,-600,-600,-600,-600,-600,-600,-600,-600,-600,-600,-600,-600,-600,-600,-600,,,,,,,,,,,,,,,,,,,,,,,,,,,,,,,,,,
-600,-600,-600,-600,-600,-600,-600,-600,-600,-600,-600,-600,-600,-600,-600,-600,-600,,,,,,,,,,,,,,,,,,,,,,,,,,,,,,,,,,
-600,-600,-600,-600,-600,-600,-600,-600,-600,-600,-600,-600,-600,-600,-600,-600,-600,,,,,,,,,,,,,,,,,,,,,,,,,,,,,,,,,,
-600,-600,-600,-600,-600,-600,-600,-600,-600,-600,-600,-600,-600,-600,-600,-600,-600,,,,,,,,,,,,,,,,,,,,,,,,,,,,,,,,,,
-600,-600,-600,-600,-600,-600,-600,-600,-600,-600,-600,-600,-600,-600,-600,-600,-600,,,,,,,,,,,,,,,,,,,,,,,,,,,,,,,,,,
-600,-600,-600,-600,-600,-600,-600,-600,-600,-600,-600,-600,-600,-600,-600,-600,-600,,,,,,,,,,,,,,,,,,,,,,,,,,,,,,,,,,
-600,-600,-600,-600,-600,-600,-600,-600,-600,-600,-600,-600,-600,-600,-600,-600,-600,,,,,,,,,,,,,,,,,,,,,,,,,,,,,,,,,,
-600,-600,-600,-600,-600,-600,-600,-600,-600,-600,-600,-600,-600,-600,-600,-600,-600,,,,,,,,,,,,,,,,,,,,,,,,,,,,,,,,,,
-600,-600,-600,-600,-600,-600,-600,-600,-600,-600,-600,-600,-600,-600,-600,-600,-600,,,,,,,,,,,,,,,,,,,,,,,,,,,,,,,,,,
-600,-600,-600,-600,-600,-600,-600,-600,-600,-600,-600,-600,-600,-600,-600,-600,-600,,,,,,,,,,,,,,,,,,,,,,,,,,,,,,,,,,
-600,-600,-600,-600,-600,-600,-600,-600,-600,-600,-600,-600,-600,-600,-600,-600,-600,,,,,,,,,,,,,,,,,,,,,,,,,,,,,,,,,,
-1000,-600,-600,-600,-600,-600,-600,-600,-600,-600,-600,-600,-600,-600,-600,-600,-1000,,,,,,,,,,,,,,,,,,,,,,,,,,,,,,,,,,
#,raw_col_delta_max,,,,,,,,,,,,,,,,,,,,,,,,,,,,,,,,,,,,,,,,,,,,,,,,,
625,600,600,600,600,600,600,1600,1600,1600,600,600,600,600,600,600,,,,,,,,,,,,,,,,,,,,,,,,,,,,,,,,,,,
600,600,600,600,600,600,600,600,600,600,600,600,600,600,600,600,,,,,,,,,,,,,,,,,,,,,,,,,,,,,,,,,,,
600,600,600,600,600,600,600,600,600,600,600,600,600,600,600,600,,,,,,,,,,,,,,,,,,,,,,,,,,,,,,,,,,,
600,600,600,600,600,600,600,600,600,600,600,600,600,600,600,600,,,,,,,,,,,,,,,,,,,,,,,,,,,,,,,,,,,
600,600,600,600,600,600,600,600,600,600,600,600,600,600,600,600,,,,,,,,,,,,,,,,,,,,,,,,,,,,,,,,,,,
600,600,600,600,600,600,600,600,600,600,600,600,600,600,600,600,,,,,,,,,,,,,,,,,,,,,,,,,,,,,,,,,,,
600,600,600,600,600,600,600,600,600,600,600,600,600,600,600,600,,,,,,,,,,,,,,,,,,,,,,,,,,,,,,,,,,,
600,600,600,600,600,600,600,600,600,600,600,600,600,600,600,600,,,,,,,,,,,,,,,,,,,,,,,,,,,,,,,,,,,
600,600,600,600,600,600,600,600,600,600,600,600,600,600,600,600,,,,,,,,,,,,,,,,,,,,,,,,,,,,,,,,,,,
600,600,600,600,600,600,600,600,600,600,600,600,600,600,600,600,,,,,,,,,,,,,,,,,,,,,,,,,,,,,,,,,,,
600,600,600,600,600,600,600,600,600,600,600,600,600,600,600,600,,,,,,,,,,,,,,,,,,,,,,,,,,,,,,,,,,,
600,600,600,600,600,600,600,600,600,600,600,600,600,600,600,600,,,,,,,,,,,,,,,,,,,,,,,,,,,,,,,,,,,
600,600,600,600,600,600,600,600,600,600,600,600,600,600,600,600,,,,,,,,,,,,,,,,,,,,,,,,,,,,,,,,,,,
600,600,600,600,600,600,600,600,600,600,600,600,600,600,600,600,,,,,,,,,,,,,,,,,,,,,,,,,,,,,,,,,,,
600,600,600,600,600,600,600,600,600,600,600,600,600,600,600,600,,,,,,,,,,,,,,,,,,,,,,,,,,,,,,,,,,,
600,600,600,600,600,600,600,600,600,600,600,600,600,600,600,600,,,,,,,,,,,,,,,,,,,,,,,,,,,,,,,,,,,
600,600,600,600,600,600,600,600,600,600,600,600,600,600,600,600,,,,,,,,,,,,,,,,,,,,,,,,,,,,,,,,,,,
600,600,600,600,600,600,600,600,600,600,600,600,600,600,600,600,,,,,,,,,,,,,,,,,,,,,,,,,,,,,,,,,,,
600,600,600,600,600,600,600,600,600,600,600,600,600,600,600,600,,,,,,,,,,,,,,,,,,,,,,,,,,,,,,,,,,,
600,600,600,600,600,600,600,600,600,600,600,600,600,600,600,600,,,,,,,,,,,,,,,,,,,,,,,,,,,,,,,,,,,
600,600,600,600,600,600,600,600,600,600,600,600,600,600,600,600,,,,,,,,,,,,,,,,,,,,,,,,,,,,,,,,,,,
600,600,600,600,600,600,600,600,600,600,600,600,600,600,600,600,,,,,,,,,,,,,,,,,,,,,,,,,,,,,,,,,,,
600,600,600,600,600,600,600,600,600,600,600,600,600,600,600,600,,,,,,,,,,,,,,,,,,,,,,,,,,,,,,,,,,,
600,600,600,600,600,600,600,600,600,600,600,600,600,600,600,600,,,,,,,,,,,,,,,,,,,,,,,,,,,,,,,,,,,
600,600,600,600,600,600,600,600,600,600,600,600,600,600,600,600,,,,,,,,,,,,,,,,,,,,,,,,,,,,,,,,,,,
600,600,600,600,600,600,600,600,600,600,600,600,600,600,600,600,,,,,,,,,,,,,,,,,,,,,,,,,,,,,,,,,,,
600,600,600,600,600,600,600,600,600,600,600,600,600,600,600,600,,,,,,,,,,,,,,,,,,,,,,,,,,,,,,,,,,,
600,600,600,600,600,600,600,600,600,600,600,600,600,600,600,600,,,,,,,,,,,,,,,,,,,,,,,,,,,,,,,,,,,
600,600,600,600,600,600,600,600,600,600,600,600,600,600,600,600,,,,,,,,,,,,,,,,,,,,,,,,,,,,,,,,,,,
600,600,600,600,600,600,600,600,600,600,600,600,600,600,600,600,,,,,,,,,,,,,,,,,,,,,,,,,,,,,,,,,,,
600,600,600,600,600,600,600,600,600,600,600,600,600,600,600,600,,,,,,,,,,,,,,,,,,,,,,,,,,,,,,,,,,,
600,600,600,600,600,600,600,600,600,600,600,600,600,600,600,600,,,,,,,,,,,,,,,,,,,,,,,,,,,,,,,,,,,
600,600,600,600,600,600,600,600,600,600,600,600,600,600,600,600,,,,,,,,,,,,,,,,,,,,,,,,,,,,,,,,,,,
1000,600,600,600,600,600,600,600,600,600,600,600,600,600,600,600,,,,,,,,,,,,,,,,,,,,,,,,,,,,,,,,,,,
#,raw_col_delta_min,,,,,,,,,,,,,,,,,,,,,,,,,,,,,,,,,,,,,,,,,,,,,,,,,
-600,-600,-600,-600,-600,-600,-1600,-1600,-1600,-1600,-1000,-600,-600,-600,-600,-1250,,,,,,,,,,,,,,,,,,,,,,,,,,,,,,,,,,,
-600,-600,-600,-600,-600,-600,-600,-600,-600,-600,-600,-600,-600,-600,-600,-600,,,,,,,,,,,,,,,,,,,,,,,,,,,,,,,,,,,
-600,-600,-600,-600,-600,-600,-600,-600,-600,-600,-600,-600,-600,-600,-600,-600,,,,,,,,,,,,,,,,,,,,,,,,,,,,,,,,,,,
-600,-600,-600,-600,-600,-600,-600,-600,-600,-600,-600,-600,-600,-600,-600,-600,,,,,,,,,,,,,,,,,,,,,,,,,,,,,,,,,,,
-600,-600,-600,-600,-600,-600,-600,-600,-600,-600,-600,-600,-600,-600,-600,-600,,,,,,,,,,,,,,,,,,,,,,,,,,,,,,,,,,,
-600,-600,-600,-600,-600,-600,-600,-600,-600,-600,-600,-600,-600,-600,-600,-600,,,,,,,,,,,,,,,,,,,,,,,,,,,,,,,,,,,
-600,-600,-600,-600,-600,-600,-600,-600,-600,-600,-600,-600,-600,-600,-600,-600,,,,,,,,,,,,,,,,,,,,,,,,,,,,,,,,,,,
-600,-600,-600,-600,-600,-600,-600,-600,-600,-600,-600,-600,-600,-600,-600,-600,,,,,,,,,,,,,,,,,,,,,,,,,,,,,,,,,,,
-600,-600,-600,-600,-600,-600,-600,-600,-600,-600,-600,-600,-600,-600,-600,-600,,,,,,,,,,,,,,,,,,,,,,,,,,,,,,,,,,,
-600,-600,-600,-600,-600,-600,-600,-600,-600,-600,-600,-600,-600,-600,-600,-600,,,,,,,,,,,,,,,,,,,,,,,,,,,,,,,,,,,
-600,-600,-600,-600,-600,-600,-600,-600,-600,-600,-600,-600,-600,-600,-600,-600,,,,,,,,,,,,,,,,,,,,,,,,,,,,,,,,,,,
-600,-600,-600,-600,-600,-600,-600,-600,-600,-600,-600,-600,-600,-600,-600,-600,,,,,,,,,,,,,,,,,,,,,,,,,,,,,,,,,,,
-600,-600,-600,-600,-600,-600,-600,-600,-600,-600,-600,-600,-600,-600,-600,-600,,,,,,,,,,,,,,,,,,,,,,,,,,,,,,,,,,,
-600,-600,-600,-600,-600,-600,-600,-600,-600,-600,-600,-600,-600,-600,-600,-600,,,,,,,,,,,,,,,,,,,,,,,,,,,,,,,,,,,
-600,-600,-600,-600,-600,-600,-600,-600,-600,-600,-600,-600,-600,-600,-600,-600,,,,,,,,,,,,,,,,,,,,,,,,,,,,,,,,,,,
-600,-600,-600,-600,-600,-600,-600,-600,-600,-600,-600,-600,-600,-600,-600,-600,,,,,,,,,,,,,,,,,,,,,,,,,,,,,,,,,,,
-600,-600,-600,-600,-600,-600,-600,-600,-600,-600,-600,-600,-600,-600,-600,-600,,,,,,,,,,,,,,,,,,,,,,,,,,,,,,,,,,,
-600,-600,-600,-600,-600,-600,-600,-600,-600,-600,-600,-600,-600,-600,-600,-600,,,,,,,,,,,,,,,,,,,,,,,,,,,,,,,,,,,
-600,-600,-600,-600,-600,-600,-600,-600,-600,-600,-600,-600,-600,-600,-600,-600,,,,,,,,,,,,,,,,,,,,,,,,,,,,,,,,,,,
-600,-600,-600,-600,-600,-600,-600,-600,-600,-600,-600,-600,-600,-600,-600,-600,,,,,,,,,,,,,,,,,,,,,,,,,,,,,,,,,,,
-600,-600,-600,-600,-600,-600,-600,-600,-600,-600,-600,-600,-600,-600,-600,-600,,,,,,,,,,,,,,,,,,,,,,,,,,,,,,,,,,,
-600,-600,-600,-600,-600,-600,-600,-600,-600,-600,-600,-600,-600,-600,-600,-600,,,,,,,,,,,,,,,,,,,,,,,,,,,,,,,,,,,
-600,-600,-600,-600,-600,-600,-600,-600,-600,-600,-600,-600,-600,-600,-600,-600,,,,,,,,,,,,,,,,,,,,,,,,,,,,,,,,,,,
-600,-600,-600,-600,-600,-600,-600,-600,-600,-600,-600,-600,-600,-600,-600,-600,,,,,,,,,,,,,,,,,,,,,,,,,,,,,,,,,,,
-600,-600,-600,-600,-600,-600,-600,-600,-600,-600,-600,-600,-600,-600,-600,-600,,,,,,,,,,,,,,,,,,,,,,,,,,,,,,,,,,,
-600,-600,-600,-600,-600,-600,-600,-600,-600,-600,-600,-600,-600,-600,-600,-600,,,,,,,,,,,,,,,,,,,,,,,,,,,,,,,,,,,
-600,-600,-600,-600,-600,-600,-600,-600,-600,-600,-600,-600,-600,-600,-600,-600,,,,,,,,,,,,,,,,,,,,,,,,,,,,,,,,,,,
-600,-600,-600,-600,-600,-600,-600,-600,-600,-600,-600,-600,-600,-600,-600,-600,,,,,,,,,,,,,,,,,,,,,,,,,,,,,,,,,,,
-600,-600,-600,-600,-600,-600,-600,-600,-600,-600,-600,-600,-600,-600,-600,-600,,,,,,,,,,,,,,,,,,,,,,,,,,,,,,,,,,,
-600,-600,-600,-600,-600,-600,-600,-600,-600,-600,-600,-600,-600,-600,-600,-600,,,,,,,,,,,,,,,,,,,,,,,,,,,,,,,,,,,
-600,-600,-600,-600,-600,-600,-600,-600,-600,-600,-600,-600,-600,-600,-600,-600,,,,,,,,,,,,,,,,,,,,,,,,,,,,,,,,,,,
-600,-600,-600,-600,-600,-600,-600,-600,-600,-600,-600,-600,-600,-600,-600,-600,,,,,,,,,,,,,,,,,,,,,,,,,,,,,,,,,,,
-600,-600,-600,-600,-600,-600,-600,-600,-600,-600,-600,-600,-600,-600,-600,-600,,,,,,,,,,,,,,,,,,,,,,,,,,,,,,,,,,,
-600,-600,-600,-600,-600,-600,-600,-600,-600,-600,-600,-600,-600,-600,-600,-1250,,,,,,,,,,,,,,,,,,,,,,,,,,,,,,,,,,,
#,line_max,,,,,,,,,,,,,,,,,,,,,,,,,,,,,,,,,,,,,,,,,,,,,,,,,
5000,5000,5000,5000,5000,5000,5000,5000,5000,5000,5000,5000,5000,5000,5000,5000,5000,5000,5000,5000,5000,5000,5000,5000,5000,5000,5000,5000,5000,5000,5000,5000,5000,5000,5000,5000,5000,5000,5000,5000,5000,5000,5000,5000,5000,5000,5000,5000,5000,5000,5000
#,line_min,,,,,,,,,,,,,,,,,,,,,,,,,,,,,,,,,,,,,,,,,,,,,,,,,
100,100,100,100,100,100,100,100,100,100,100,100,100,100,100,100,100,100,100,100,100,100,100,100,100,100,100,100,100,100,100,100,100,100,100,100,100,100,100,100,100,100,100,100,100,100,100,100,100,100,100
