#,version,,,,,,,,,,,,,,,,,,,,,,,,,,,,,,,,,,,,,,,,,,,,,,,,,
2018,11,24,5,,,,,,,,,,,,,,,,,,,,,,,,,,,,,,,,,,,,,,,,,,,,,,,
#,row_col_num,,,,,,,,,,,,,,,,,,,,,,,,,,,,,,,,,,,,,,,,,,,,,,,,,
34,17,,,,,,,,,,,,,,,,,,,,,,,,,,,,,,,,,,,,,,,,,,,,,,,,,
#,noise,,,,,,,,,,,,,,,,,,,,,,,,,,,,,,,,,,,,,,,,,,,,,,,,,
-500,500,,,,,,,,,,,,,,,,,,,,,,,,,,,,,,,,,,,,,,,,,,,,,,,,,
#,raw_max,,,,,,,,,,,,,,,,,,,,,,,,,,,,,,,,,,,,,,,,,,,,,,,,,
3925,4172,4151,4121,4098,4089,4086,3590,5000,3587,4164,4218,4159,4150,4133,4145,3505,,,,,,,,,,,,,,,,,,,,,,,,,,,,,,,,,,
4192,4110,4114,4095,4087,4087,4111,4078,4013,4248,4273,4314,4259,4263,4261,4296,4134,,,,,,,,,,,,,,,,,,,,,,,,,,,,,,,,,,
4219,4162,4166,4147,4141,4141,4157,4153,4196,4344,4343,4379,4325,4330,4329,4366,4221,,,,,,,,,,,,,,,,,,,,,,,,,,,,,,,,,,
4146,4121,4121,4103,4099,4098,4112,4108,4157,4302,4292,4332,4281,4284,4285,4321,4178,,,,,,,,,,,,,,,,,,,,,,,,,,,,,,,,,,
4156,4157,4158,4139,4135,4133,4147,4141,4192,4332,4330,4371,4320,4329,4326,4363,4219,,,,,,,,,,,,,,,,,,,,,,,,,,,,,,,,,,
4152,4170,4177,4155,4150,4150,4164,4158,4208,4344,4339,4381,4338,4337,4339,4376,4231,,,,,,,,,,,,,,,,,,,,,,,,,,,,,,,,,,
4122,4154,4165,4141,4134,4133,4147,4142,4190,4327,4319,4362,4317,4321,4323,4359,4214,,,,,,,,,,,,,,,,,,,,,,,,,,,,,,,,,,
4134,4177,4191,4169,4156,4156,4174,4166,4215,4352,4345,4390,4340,4344,4343,4386,4237,,,,,,,,,,,,,,,,,,,,,,,,,,,,,,,,,,
4087,4142,4156,4139,4121,4121,4138,4132,4180,4315,4309,4347,4300,4307,4312,4344,4201,,,,,,,,,,,,,,,,,,,,,,,,,,,,,,,,,,
4085,4143,4157,4147,4124,4124,4139,4134,4183,4318,4310,4349,4301,4309,4312,4348,4205,,,,,,,,,,,,,,,,,,,,,,,,,,,,,,,,,,
4071,4139,4155,4148,4125,4122,4137,4132,4181,4322,4310,4349,4300,4304,4310,4346,4203,,,,,,,,,,,,,,,,,,,,,,,,,,,,,,,,,,
4054,4127,4142,4138,4117,4110,4123,4118,4167,4305,4299,4336,4288,4291,4294,4333,4192,,,,,,,,,,,,,,,,,,,,,,,,,,,,,,,,,,
4099,4178,4191,4190,4172,4159,4175,4174,4218,4359,4351,4389,4340,4344,4345,4385,4246,,,,,,,,,,,,,,,,,,,,,,,,,,,,,,,,,,
4063,4147,4158,4155,4144,4129,4151,4139,4189,4327,4321,4357,4307,4311,4314,4350,4213,,,,,,,,,,,,,,,,,,,,,,,,,,,,,,,,,,
4086,4181,4185,4183,4171,4158,4173,4169,4217,4366,4359,4398,4346,4351,4352,4386,4247,,,,,,,,,,,,,,,,,,,,,,,,,,,,,,,,,,
4118,4215,4230,4225,4209,4200,4210,4206,4255,4405,4399,4439,4388,4390,4390,4427,4286,,,,,,,,,,,,,,,,,,,,,,,,,,,,,,,,,,
4099,4207,4219,4223,4206,4201,4208,4205,4252,4403,4397,4435,4386,4389,4388,4426,4286,,,,,,,,,,,,,,,,,,,,,,,,,,,,,,,,,,
4097,4202,4219,4231,4214,4218,4219,4215,4263,4415,4409,4445,4396,4399,4400,4437,4297,,,,,,,,,,,,,,,,,,,,,,,,,,,,,,,,,,
4113,4224,4234,4238,4238,4237,4241,4236,4285,4440,4430,4469,4418,4422,4423,4461,4320,,,,,,,,,,,,,,,,,,,,,,,,,,,,,,,,,,
4126,4240,4251,4259,4238,4253,4259,4252,4299,4455,4447,4484,4435,4440,4442,4482,4338,,,,,,,,,,,,,,,,,,,,,,,,,,,,,,,,,,
4113,4227,4239,4242,4220,4225,4249,4236,4285,4442,4434,4475,4423,4428,4429,4467,4333,,,,,,,,,,,,,,,,,,,,,,,,,,,,,,,,,,
4168,4290,4303,4307,4282,4278,4306,4296,4349,4511,4509,4556,4493,4496,4498,4540,4394,,,,,,,,,,,,,,,,,,,,,,,,,,,,,,,,,,
4155,4278,4292,4297,4273,4275,4286,4289,4340,4502,4497,4535,4482,4486,4486,4525,4383,,,,,,,,,,,,,,,,,,,,,,,,,,,,,,,,,,
4207,4340,4347,4353,4329,4326,4346,4352,4405,4573,4566,4612,4549,4552,4550,4587,4444,,,,,,,,,,,,,,,,,,,,,,,,,,,,,,,,,,
4218,4350,4368,4369,4345,4340,4368,4371,4422,4594,4586,4626,4576,4578,4578,4615,4474,,,,,,,,,,,,,,,,,,,,,,,,,,,,,,,,,,
4236,4370,4383,4388,4374,4364,4394,4390,4441,4615,4610,4652,4599,4605,4603,4642,4501,,,,,,,,,,,,,,,,,,,,,,,,,,,,,,,,,,
4263,4403,4418,4420,4398,4402,4426,4421,4483,4653,4648,4688,4635,4640,4638,4678,4534,,,,,,,,,,,,,,,,,,,,,,,,,,,,,,,,,,
4251,4393,4406,4408,4392,4397,4415,4421,4462,4644,4638,4680,4625,4630,4629,4667,4522,,,,,,,,,,,,,,,,,,,,,,,,,,,,,,,,,,
4273,4415,4430,4430,4427,4421,4439,4434,4486,4672,4666,4708,4653,4657,4656,4692,4548,,,,,,,,,,,,,,,,,,,,,,,,,,,,,,,,,,
4345,4483,4497,4499,4501,4487,4505,4499,4552,4746,4740,4783,4727,4731,4730,4767,4618,,,,,,,,,,,,,,,,,,,,,,,,,,,,,,,,,,
4400,4546,4559,4566,4561,4542,4561,4557,4612,4813,4814,4848,4791,4796,4794,4831,4682,,,,,,,,,,,,,,,,,,,,,,,,,,,,,,,,,,
4457,4602,4616,4622,4615,4592,4611,4607,4663,4871,4866,4905,4854,4851,4848,4886,4738,,,,,,,,,,,,,,,,,,,,,,,,,,,,,,,,,,
4535,4677,4697,4693,4687,4660,4678,4675,4738,4943,4937,4975,4915,4918,4915,4951,4800,,,,,,,,,,,,,,,,,,,,,,,,,,,,,,,,,,
4589,4679,4670,4643,4705,4623,4633,4656,4729,4962,4971,5028,4976,4989,4999,5026,4812,,,,,,,,,,,,,,,,,,,,,,,,,,,,,,,,,,
#,raw_min,,,,,,,,,,,,,,,,,,,,,,,,,,,,,,,,,,,,,,,,,,,,,,,,,
2354,2502,2490,2472,2458,2452,2451,2153,0,2151,2498,2530,2494,2489,2479,2486,2102,,,,,,,,,,,,,,,,,,,,,,,,,,,,,,,,,,
2514,2465,2467,2456,2451,2452,2466,2446,2407,2548,2563,2588,2555,2557,2556,2577,2479,,,,,,,,,,,,,,,,,,,,,,,,,,,,,,,,,,
2530,2496,2499,2488,2484,2484,2493,2491,2517,2605,2605,2626,2594,2597,2597,2619,2532,,,,,,,,,,,,,,,,,,,,,,,,,,,,,,,,,,
2487,2472,2472,2461,2458,2458,2466,2464,2493,2580,2574,2598,2568,2570,2570,2592,2506,,,,,,,,,,,,,,,,,,,,,,,,,,,,,,,,,,
2493,2493,2494,2482,2480,2479,2487,2484,2515,2598,2597,2622,2591,2597,2595,2617,2531,,,,,,,,,,,,,,,,,,,,,,,,,,,,,,,,,,
2490,2502,2506,2492,2489,2489,2498,2494,2524,2606,2603,2628,2602,2601,2603,2625,2538,,,,,,,,,,,,,,,,,,,,,,,,,,,,,,,,,,
2472,2491,2498,2484,2480,2479,2488,2484,2513,2595,2591,2617,2589,2592,2593,2614,2528,,,,,,,,,,,,,,,,,,,,,,,,,,,,,,,,,,
2479,2505,2514,2501,2493,2493,2503,2499,2528,2611,2606,2633,2603,2606,2605,2631,2542,,,,,,,,,,,,,,,,,,,,,,,,,,,,,,,,,,
2452,2484,2493,2483,2472,2472,2482,2478,2507,2588,2584,2607,2579,2583,2586,2606,2520,,,,,,,,,,,,,,,,,,,,,,,,,,,,,,,,,,
2450,2485,2493,2487,2473,2473,2483,2480,2509,2590,2585,2609,2580,2584,2586,2608,2522,,,,,,,,,,,,,,,,,,,,,,,,,,,,,,,,,,
2442,2482,2492,2488,2474,2472,2482,2478,2508,2593,2585,2608,2579,2582,2585,2607,2521,,,,,,,,,,,,,,,,,,,,,,,,,,,,,,,,,,
2432,2475,2484,2482,2469,2465,2473,2470,2499,2582,2578,2601,2572,2574,2575,2599,2515,,,,,,,,,,,,,,,,,,,,,,,,,,,,,,,,,,
2458,2506,2514,2513,2502,2495,2504,2504,2530,2615,2610,2633,2603,2605,2606,2630,2547,,,,,,,,,,,,,,,,,,,,,,,,,,,,,,,,,,
2437,2487,2494,2492,2485,2476,2490,2483,2513,2595,2592,2613,2584,2586,2587,2609,2527,,,,,,,,,,,,,,,,,,,,,,,,,,,,,,,,,,
2451,2508,2510,2509,2502,2494,2503,2500,2530,2619,2615,2638,2607,2610,2610,2631,2547,,,,,,,,,,,,,,,,,,,,,,,,,,,,,,,,,,
2470,2528,2537,2534,2525,2519,2526,2523,2552,2642,2639,2662,2632,2633,2633,2656,2571,,,,,,,,,,,,,,,,,,,,,,,,,,,,,,,,,,
2459,2523,2531,2533,2523,2520,2524,2522,2550,2641,2638,2660,2631,2633,2632,2655,2571,,,,,,,,,,,,,,,,,,,,,,,,,,,,,,,,,,
2457,2520,2530,2538,2528,2530,2531,2528,2557,2648,2645,2666,2637,2639,2639,2661,2577,,,,,,,,,,,,,,,,,,,,,,,,,,,,,,,,,,
2467,2533,2540,2542,2542,2541,2544,2541,2570,2663,2657,2680,2650,2652,2653,2676,2591,,,,,,,,,,,,,,,,,,,,,,,,,,,,,,,,,,
2475,2543,2550,2555,2542,2551,2554,2550,2579,2672,2668,2690,2660,2663,2664,2688,2602,,,,,,,,,,,,,,,,,,,,,,,,,,,,,,,,,,
2467,2535,2542,2544,2531,2534,2549,2541,2570,2665,2660,2684,2653,2656,2656,2680,2599,,,,,,,,,,,,,,,,,,,,,,,,,,,,,,,,,,
2500,2573,2581,2583,2568,2566,2583,2577,2608,2706,2705,2733,2695,2697,2698,2724,2636,,,,,,,,,,,,,,,,,,,,,,,,,,,,,,,,,,
2492,2566,2574,2577,2563,2564,2571,2572,2603,2700,2697,2720,2688,2691,2691,2714,2629,,,,,,,,,,,,,,,,,,,,,,,,,,,,,,,,,,
2523,2603,2607,2611,2597,2595,2607,2610,2642,2743,2739,2767,2729,2730,2729,2751,2666,,,,,,,,,,,,,,,,,,,,,,,,,,,,,,,,,,
2530,2609,2620,2621,2606,2603,2620,2622,2652,2755,2751,2775,2745,2746,2746,2768,2683,,,,,,,,,,,,,,,,,,,,,,,,,,,,,,,,,,
2541,2621,2629,2632,2623,2618,2635,2633,2664,2768,2765,2790,2759,2762,2761,2784,2700,,,,,,,,,,,,,,,,,,,,,,,,,,,,,,,,,,
2557,2641,2650,2651,2638,2641,2655,2652,2689,2791,2788,2812,2780,2783,2782,2806,2719,,,,,,,,,,,,,,,,,,,,,,,,,,,,,,,,,,
2550,2635,2643,2644,2635,2637,2648,2652,2677,2786,2782,2807,2774,2777,2777,2799,2713,,,,,,,,,,,,,,,,,,,,,,,,,,,,,,,,,,
2563,2648,2657,2657,2655,2652,2663,2659,2691,2802,2799,2824,2791,2794,2793,2815,2728,,,,,,,,,,,,,,,,,,,,,,,,,,,,,,,,,,
2606,2689,2698,2698,2700,2692,2702,2698,2730,2847,2844,2869,2835,2838,2837,2860,2770,,,,,,,,,,,,,,,,,,,,,,,,,,,,,,,,,,
2639,2727,2735,2739,2736,2725,2736,2733,2767,2887,2888,2908,2874,2877,2876,2898,2809,,,,,,,,,,,,,,,,,,,,,,,,,,,,,,,,,,
2673,2761,2769,2772,2768,2754,2766,2763,2797,2922,2919,2942,2912,2910,2908,2931,2842,,,,,,,,,,,,,,,,,,,,,,,,,,,,,,,,,,
2720,2805,2817,2815,2811,2795,2806,2804,2842,2965,2961,2984,2948,2950,2948,2970,2879,,,,,,,,,,,,,,,,,,,,,,,,,,,,,,,,,,
2753,2807,2801,2785,2822,2773,2779,2793,2837,2976,2982,3016,2985,2992,2999,3015,2886,,,,,,,,,,,,,,,,,,,,,,,,,,,,,,,,,,
#,raw_row_delta_max,,,,,,,,,,,,,,,,,,,,,,,,,,,,,,,,,,,,,,,,,,,,,,,,,
1000,500,500,500,500,500,500,1000,1000,1000,500,500,500,500,500,500,1000,,,,,,,,,,,,,,,,,,,,,,,,,,,,,,,,,,
500,500,500,500,500,500,500,500,500,500,500,500,500,500,500,500,500,,,,,,,,,,,,,,,,,,,,,,,,,,,,,,,,,,
500,500,500,500,500,500,500,500,500,500,500,500,500,500,500,500,500,,,,,,,,,,,,,,,,,,,,,,,,,,,,,,,,,,
500,500,500,500,500,500,500,500,500,500,500,500,500,500,500,500,500,,,,,,,,,,,,,,,,,,,,,,,,,,,,,,,,,,
500,500,500,500,500,500,500,500,500,500,500,500,500,500,500,500,500,,,,,,,,,,,,,,,,,,,,,,,,,,,,,,,,,,
500,500,500,500,500,500,500,500,500,500,500,500,500,500,500,500,500,,,,,,,,,,,,,,,,,,,,,,,,,,,,,,,,,,
500,500,500,500,500,500,500,500,500,500,500,500,500,500,500,500,500,,,,,,,,,,,,,,,,,,,,,,,,,,,,,,,,,,
500,500,500,500,500,500,500,500,500,500,500,500,500,500,500,500,500,,,,,,,,,,,,,,,,,,,,,,,,,,,,,,,,,,
500,500,500,500,500,500,500,500,500,500,500,500,500,500,500,500,500,,,,,,,,,,,,,,,,,,,,,,,,,,,,,,,,,,
500,500,500,500,500,500,500,500,500,500,500,500,500,500,500,500,500,,,,,,,,,,,,,,,,,,,,,,,,,,,,,,,,,,
500,500,500,500,500,500,500,500,500,500,500,500,500,500,500,500,500,,,,,,,,,,,,,,,,,,,,,,,,,,,,,,,,,,
500,500,500,500,500,500,500,500,500,500,500,500,500,500,500,500,500,,,,,,,,,,,,,,,,,,,,,,,,,,,,,,,,,,
500,500,500,500,500,500,500,500,500,500,500,500,500,500,500,500,500,,,,,,,,,,,,,,,,,,,,,,,,,,,,,,,,,,
500,500,500,500,500,500,500,500,500,500,500,500,500,500,500,500,500,,,,,,,,,,,,,,,,,,,,,,,,,,,,,,,,,,
500,500,500,500,500,500,500,500,500,500,500,500,500,500,500,500,500,,,,,,,,,,,,,,,,,,,,,,,,,,,,,,,,,,
500,500,500,500,500,500,500,500,500,500,500,500,500,500,500,500,500,,,,,,,,,,,,,,,,,,,,,,,,,,,,,,,,,,
500,500,500,500,500,500,500,500,500,500,500,500,500,500,500,500,500,,,,,,,,,,,,,,,,,,,,,,,,,,,,,,,,,,
500,500,500,500,500,500,500,500,500,500,500,500,500,500,500,500,500,,,,,,,,,,,,,,,,,,,,,,,,,,,,,,,,,,
500,500,500,500,500,500,500,500,500,500,500,500,500,500,500,500,500,,,,,,,,,,,,,,,,,,,,,,,,,,,,,,,,,,
500,500,500,500,500,500,500,500,500,500,500,500,500,500,500,500,500,,,,,,,,,,,,,,,,,,,,,,,,,,,,,,,,,,
500,500,500,500,500,500,500,500,500,500,500,500,500,500,500,500,500,,,,,,,,,,,,,,,,,,,,,,,,,,,,,,,,,,
500,500,500,500,500,500,500,500,500,500,500,500,500,500,500,500,500,,,,,,,,,,,,,,,,,,,,,,,,,,,,,,,,,,
500,500,500,500,500,500,500,500,500,500,500,500,500,500,500,500,500,,,,,,,,,,,,,,,,,,,,,,,,,,,,,,,,,,
500,500,500,500,500,500,500,500,500,500,500,500,500,500,500,500,500,,,,,,,,,,,,,,,,,,,,,,,,,,,,,,,,,,
500,500,500,500,500,500,500,500,500,500,500,500,500,500,500,500,500,,,,,,,,,,,,,,,,,,,,,,,,,,,,,,,,,,
500,500,500,500,500,500,500,500,500,500,500,500,500,500,500,500,500,,,,,,,,,,,,,,,,,,,,,,,,,,,,,,,,,,
500,500,500,500,500,500,500,500,500,500,500,500,500,500,500,500,500,,,,,,,,,,,,,,,,,,,,,,,,,,,,,,,,,,
500,500,500,500,500,500,500,500,500,500,500,500,500,500,500,500,500,,,,,,,,,,,,,,,,,,,,,,,,,,,,,,,,,,
500,500,500,500,500,500,500,500,500,500,500,500,500,500,500,500,500,,,,,,,,,,,,,,,,,,,,,,,,,,,,,,,,,,
500,500,500,500,500,500,500,500,500,500,500,500,500,500,500,500,500,,,,,,,,,,,,,,,,,,,,,,,,,,,,,,,,,,
500,500,500,500,500,500,500,500,500,500,500,500,500,500,500,500,500,,,,,,,,,,,,,,,,,,,,,,,,,,,,,,,,,,
500,500,500,500,500,500,500,500,500,500,500,500,500,500,500,500,500,,,,,,,,,,,,,,,,,,,,,,,,,,,,,,,,,,
1000,750,750,750,750,750,750,750,750,750,750,750,750,750,750,750,1000,,,,,,,,,,,,,,,,,,,,,,,,,,,,,,,,,,
#,raw_row_delta_min,,,,,,,,,,,,,,,,,,,,,,,,,,,,,,,,,,,,,,,,,,,,,,,,,
-500,-500,-500,-500,-500,-500,-500,-1000,-1000,-1000,-500,-500,-500,-500,-500,-500,-500,,,,,,,,,,,,,,,,,,,,,,,,,,,,,,,,,,
-500,-500,-500,-500,-500,-500,-500,-500,-500,-500,-500,-500,-500,-500,-500,-500,-500,,,,,,,,,,,,,,,,,,,,,,,,,,,,,,,,,,
-500,-500,-500,-500,-500,-500,-500,-500,-500,-500,-500,-500,-500,-500,-500,-500,-500,,,,,,,,,,,,,,,,,,,,,,,,,,,,,,,,,,
-500,-500,-500,-500,-500,-500,-500,-500,-500,-500,-500,-500,-500,-500,-500,-500,-500,,,,,,,,,,,,,,,,,,,,,,,,,,,,,,,,,,
-500,-500,-500,-500,-500,-500,-500,-500,-500,-500,-500,-500,-500,-500,-500,-500,-500,,,,,,,,,,,,,,,,,,,,,,,,,,,,,,,,,,
-500,-500,-500,-500,-500,-500,-500,-500,-500,-500,-500,-500,-500,-500,-500,-500,-500,,,,,,,,,,,,,,,,,,,,,,,,,,,,,,,,,,
-500,-500,-500,-500,-500,-500,-500,-500,-500,-500,-500,-500,-500,-500,-500,-500,-500,,,,,,,,,,,,,,,,,,,,,,,,,,,,,,,,,,
-500,-500,-500,-500,-500,-500,-500,-500,-500,-500,-500,-500,-500,-500,-500,-500,-500,,,,,,,,,,,,,,,,,,,,,,,,,,,,,,,,,,
-500,-500,-500,-500,-500,-500,-500,-500,-500,-500,-500,-500,-500,-500,-500,-500,-500,,,,,,,,,,,,,,,,,,,,,,,,,,,,,,,,,,
-500,-500,-500,-500,-500,-500,-500,-500,-500,-500,-500,-500,-500,-500,-500,-500,-500,,,,,,,,,,,,,,,,,,,,,,,,,,,,,,,,,,
-500,-500,-500,-500,-500,-500,-500,-500,-500,-500,-500,-500,-500,-500,-500,-500,-500,,,,,,,,,,,,,,,,,,,,,,,,,,,,,,,,,,
-500,-500,-500,-500,-500,-500,-500,-500,-500,-500,-500,-500,-500,-500,-500,-500,-500,,,,,,,,,,,,,,,,,,,,,,,,,,,,,,,,,,
-500,-500,-500,-500,-500,-500,-500,-500,-500,-500,-500,-500,-500,-500,-500,-500,-500,,,,,,,,,,,,,,,,,,,,,,,,,,,,,,,,,,
-500,-500,-500,-500,-500,-500,-500,-500,-500,-500,-500,-500,-500,-500,-500,-500,-500,,,,,,,,,,,,,,,,,,,,,,,,,,,,,,,,,,
-500,-500,-500,-500,-500,-500,-500,-500,-500,-500,-500,-500,-500,-500,-500,-500,-500,,,,,,,,,,,,,,,,,,,,,,,,,,,,,,,,,,
-500,-500,-500,-500,-500,-500,-500,-500,-500,-500,-500,-500,-500,-500,-500,-500,-500,,,,,,,,,,,,,,,,,,,,,,,,,,,,,,,,,,
-500,-500,-500,-500,-500,-500,-500,-500,-500,-500,-500,-500,-500,-500,-500,-500,-500,,,,,,,,,,,,,,,,,,,,,,,,,,,,,,,,,,
-500,-500,-500,-500,-500,-500,-500,-500,-500,-500,-500,-500,-500,-500,-500,-500,-500,,,,,,,,,,,,,,,,,,,,,,,,,,,,,,,,,,
-500,-500,-500,-500,-500,-500,-500,-500,-500,-500,-500,-500,-500,-500,-500,-500,-500,,,,,,,,,,,,,,,,,,,,,,,,,,,,,,,,,,
-500,-500,-500,-500,-500,-500,-500,-500,-500,-500,-500,-500,-500,-500,-500,-500,-500,,,,,,,,,,,,,,,,,,,,,,,,,,,,,,,,,,
-500,-500,-500,-500,-500,-500,-500,-500,-500,-500,-500,-500,-500,-500,-500,-500,-500,,,,,,,,,,,,,,,,,,,,,,,,,,,,,,,,,,
-500,-500,-500,-500,-500,-500,-500,-500,-500,-500,-500,-500,-500,-500,-500,-500,-500,,,,,,,,,,,,,,,,,,,,,,,,,,,,,,,,,,
-500,-500,-500,-500,-500,-500,-500,-500,-500,-500,-500,-500,-500,-500,-500,-500,-500,,,,,,,,,,,,,,,,,,,,,,,,,,,,,,,,,,
-500,-500,-500,-500,-500,-500,-500,-500,-500,-500,-500,-500,-500,-500,-500,-500,-500,,,,,,,,,,,,,,,,,,,,,,,,,,,,,,,,,,
-500,-500,-500,-500,-500,-500,-500,-500,-500,-500,-500,-500,-500,-500,-500,-500,-500,,,,,,,,,,,,,,,,,,,,,,,,,,,,,,,,,,
-500,-500,-500,-500,-500,-500,-500,-500,-500,-500,-500,-500,-500,-500,-500,-500,-500,,,,,,,,,,,,,,,,,,,,,,,,,,,,,,,,,,
-500,-500,-500,-500,-500,-500,-500,-500,-500,-500,-500,-500,-500,-500,-500,-500,-500,,,,,,,,,,,,,,,,,,,,,,,,,,,,,,,,,,
-500,-500,-500,-500,-500,-500,-500,-500,-500,-500,-500,-500,-500,-500,-500,-500,-500,,,,,,,,,,,,,,,,,,,,,,,,,,,,,,,,,,
-500,-500,-500,-500,-500,-500,-500,-500,-500,-500,-500,-500,-500,-500,-500,-500,-500,,,,,,,,,,,,,,,,,,,,,,,,,,,,,,,,,,
-500,-500,-500,-500,-500,-500,-500,-500,-500,-500,-500,-500,-500,-500,-500,-500,-500,,,,,,,,,,,,,,,,,,,,,,,,,,,,,,,,,,
-500,-500,-500,-500,-500,-500,-500,-500,-500,-500,-500,-500,-500,-500,-500,-500,-500,,,,,,,,,,,,,,,,,,,,,,,,,,,,,,,,,,
-500,-500,-500,-500,-500,-500,-500,-500,-500,-500,-500,-500,-500,-500,-500,-500,-500,,,,,,,,,,,,,,,,,,,,,,,,,,,,,,,,,,
-1000,-750,-750,-750,-750,-750,-750,-750,-750,-750,-750,-750,-750,-750,-750,-750,-1000,,,,,,,,,,,,,,,,,,,,,,,,,,,,,,,,,,
#,raw_col_delta_max,,,,,,,,,,,,,,,,,,,,,,,,,,,,,,,,,,,,,,,,,,,,,,,,,
500,500,500,500,500,500,500,500,500,1000,500,500,500,500,500,500,,,,,,,,,,,,,,,,,,,,,,,,,,,,,,,,,,,
500,500,500,500,500,500,500,500,500,500,500,500,500,500,500,500,,,,,,,,,,,,,,,,,,,,,,,,,,,,,,,,,,,
500,500,500,500,500,500,500,500,500,500,500,500,500,500,500,500,,,,,,,,,,,,,,,,,,,,,,,,,,,,,,,,,,,
500,500,500,500,500,500,500,500,500,500,500,500,500,500,500,500,,,,,,,,,,,,,,,,,,,,,,,,,,,,,,,,,,,
500,500,500,500,500,500,500,500,500,500,500,500,500,500,500,500,,,,,,,,,,,,,,,,,,,,,,,,,,,,,,,,,,,
500,500,500,500,500,500,500,500,500,500,500,500,500,500,500,500,,,,,,,,,,,,,,,,,,,,,,,,,,,,,,,,,,,
500,500,500,500,500,500,500,500,500,500,500,500,500,500,500,500,,,,,,,,,,,,,,,,,,,,,,,,,,,,,,,,,,,
500,500,500,500,500,500,500,500,500,500,500,500,500,500,500,500,,,,,,,,,,,,,,,,,,,,,,,,,,,,,,,,,,,
500,500,500,500,500,500,500,500,500,500,500,500,500,500,500,500,,,,,,,,,,,,,,,,,,,,,,,,,,,,,,,,,,,
500,500,500,500,500,500,500,500,500,500,500,500,500,500,500,500,,,,,,,,,,,,,,,,,,,,,,,,,,,,,,,,,,,
500,500,500,500,500,500,500,500,500,500,500,500,500,500,500,500,,,,,,,,,,,,,,,,,,,,,,,,,,,,,,,,,,,
500,500,500,500,500,500,500,500,500,500,500,500,500,500,500,500,,,,,,,,,,,,,,,,,,,,,,,,,,,,,,,,,,,
500,500,500,500,500,500,500,500,500,500,500,500,500,500,500,500,,,,,,,,,,,,,,,,,,,,,,,,,,,,,,,,,,,
500,500,500,500,500,500,500,500,500,500,500,500,500,500,500,500,,,,,,,,,,,,,,,,,,,,,,,,,,,,,,,,,,,
500,500,500,500,500,500,500,500,500,500,500,500,500,500,500,500,,,,,,,,,,,,,,,,,,,,,,,,,,,,,,,,,,,
500,500,500,500,500,500,500,500,500,500,500,500,500,500,500,500,,,,,,,,,,,,,,,,,,,,,,,,,,,,,,,,,,,
500,500,500,500,500,500,500,500,500,500,500,500,500,500,500,500,,,,,,,,,,,,,,,,,,,,,,,,,,,,,,,,,,,
500,500,500,500,500,500,500,500,500,500,500,500,500,500,500,500,,,,,,,,,,,,,,,,,,,,,,,,,,,,,,,,,,,
500,500,500,500,500,500,500,500,500,500,500,500,500,500,500,500,,,,,,,,,,,,,,,,,,,,,,,,,,,,,,,,,,,
500,500,500,500,500,500,500,500,500,500,500,500,500,500,500,500,,,,,,,,,,,,,,,,,,,,,,,,,,,,,,,,,,,
500,500,500,500,500,500,500,500,500,500,500,500,500,500,500,500,,,,,,,,,,,,,,,,,,,,,,,,,,,,,,,,,,,
500,500,500,500,500,500,500,500,500,500,500,500,500,500,500,500,,,,,,,,,,,,,,,,,,,,,,,,,,,,,,,,,,,
500,500,500,500,500,500,500,500,500,500,500,500,500,500,500,500,,,,,,,,,,,,,,,,,,,,,,,,,,,,,,,,,,,
500,500,500,500,500,500,500,500,500,500,500,500,500,500,500,500,,,,,,,,,,,,,,,,,,,,,,,,,,,,,,,,,,,
500,500,500,500,500,500,500,500,500,500,500,500,500,500,500,500,,,,,,,,,,,,,,,,,,,,,,,,,,,,,,,,,,,
500,500,500,500,500,500,500,500,500,500,500,500,500,500,500,500,,,,,,,,,,,,,,,,,,,,,,,,,,,,,,,,,,,
500,500,500,500,500,500,500,500,500,500,500,500,500,500,500,500,,,,,,,,,,,,,,,,,,,,,,,,,,,,,,,,,,,
500,500,500,500,500,500,500,500,500,500,500,500,500,500,500,500,,,,,,,,,,,,,,,,,,,,,,,,,,,,,,,,,,,
500,500,500,500,500,500,500,500,500,500,500,500,500,500,500,500,,,,,,,,,,,,,,,,,,,,,,,,,,,,,,,,,,,
500,500,500,500,500,500,500,500,500,500,500,500,500,500,500,500,,,,,,,,,,,,,,,,,,,,,,,,,,,,,,,,,,,
500,500,500,500,500,500,500,500,500,500,500,500,500,500,500,500,,,,,,,,,,,,,,,,,,,,,,,,,,,,,,,,,,,
500,500,500,500,500,500,500,500,500,500,500,500,500,500,500,500,,,,,,,,,,,,,,,,,,,,,,,,,,,,,,,,,,,
500,500,500,500,500,500,500,500,500,500,500,500,500,500,500,500,,,,,,,,,,,,,,,,,,,,,,,,,,,,,,,,,,,
750,500,500,500,500,500,500,500,500,500,500,500,500,500,500,750,,,,,,,,,,,,,,,,,,,,,,,,,,,,,,,,,,,
#,raw_col_delta_min,,,,,,,,,,,,,,,,,,,,,,,,,,,,,,,,,,,,,,,,,,,,,,,,,
-500,-625,-625,-625,-625,-625,-1000,-500,-500,-500,-500,-500,-500,-500,-500,-1000,,,,,,,,,,,,,,,,,,,,,,,,,,,,,,,,,,,
-500,-500,-500,-500,-500,-500,-500,-500,-500,-500,-500,-500,-500,-500,-500,-500,,,,,,,,,,,,,,,,,,,,,,,,,,,,,,,,,,,
-500,-500,-500,-500,-500,-500,-500,-500,-500,-500,-500,-500,-500,-500,-500,-500,,,,,,,,,,,,,,,,,,,,,,,,,,,,,,,,,,,
-500,-500,-500,-500,-500,-500,-500,-500,-500,-500,-500,-500,-500,-500,-500,-500,,,,,,,,,,,,,,,,,,,,,,,,,,,,,,,,,,,
-500,-500,-500,-500,-500,-500,-500,-500,-500,-500,-500,-500,-500,-500,-500,-500,,,,,,,,,,,,,,,,,,,,,,,,,,,,,,,,,,,
-500,-500,-500,-500,-500,-500,-500,-500,-500,-500,-500,-500,-500,-500,-500,-500,,,,,,,,,,,,,,,,,,,,,,,,,,,,,,,,,,,
-500,-500,-500,-500,-500,-500,-500,-500,-500,-500,-500,-500,-500,-500,-500,-500,,,,,,,,,,,,,,,,,,,,,,,,,,,,,,,,,,,
-500,-500,-500,-500,-500,-500,-500,-500,-500,-500,-500,-500,-500,-500,-500,-500,,,,,,,,,,,,,,,,,,,,,,,,,,,,,,,,,,,
-500,-500,-500,-500,-500,-500,-500,-500,-500,-500,-500,-500,-500,-500,-500,-500,,,,,,,,,,,,,,,,,,,,,,,,,,,,,,,,,,,
-500,-500,-500,-500,-500,-500,-500,-500,-500,-500,-500,-500,-500,-500,-500,-500,,,,,,,,,,,,,,,,,,,,,,,,,,,,,,,,,,,
-500,-500,-500,-500,-500,-500,-500,-500,-500,-500,-500,-500,-500,-500,-500,-500,,,,,,,,,,,,,,,,,,,,,,,,,,,,,,,,,,,
-500,-500,-500,-500,-500,-500,-500,-500,-500,-500,-500,-500,-500,-500,-500,-500,,,,,,,,,,,,,,,,,,,,,,,,,,,,,,,,,,,
-500,-500,-500,-500,-500,-500,-500,-500,-500,-500,-500,-500,-500,-500,-500,-500,,,,,,,,,,,,,,,,,,,,,,,,,,,,,,,,,,,
-500,-500,-500,-500,-500,-500,-500,-500,-500,-500,-500,-500,-500,-500,-500,-500,,,,,,,,,,,,,,,,,,,,,,,,,,,,,,,,,,,
-500,-500,-500,-500,-500,-500,-500,-500,-500,-500,-500,-500,-500,-500,-500,-500,,,,,,,,,,,,,,,,,,,,,,,,,,,,,,,,,,,
-500,-500,-500,-500,-500,-500,-500,-500,-500,-500,-500,-500,-500,-500,-500,-500,,,,,,,,,,,,,,,,,,,,,,,,,,,,,,,,,,,
-500,-500,-500,-500,-500,-500,-500,-500,-500,-500,-500,-500,-500,-500,-500,-500,,,,,,,,,,,,,,,,,,,,,,,,,,,,,,,,,,,
-500,-500,-500,-500,-500,-500,-500,-500,-500,-500,-500,-500,-500,-500,-500,-500,,,,,,,,,,,,,,,,,,,,,,,,,,,,,,,,,,,
-500,-500,-500,-500,-500,-500,-500,-500,-500,-500,-500,-500,-500,-500,-500,-500,,,,,,,,,,,,,,,,,,,,,,,,,,,,,,,,,,,
-500,-500,-500,-500,-500,-500,-500,-500,-500,-500,-500,-500,-500,-500,-500,-500,,,,,,,,,,,,,,,,,,,,,,,,,,,,,,,,,,,
-500,-500,-500,-500,-500,-500,-500,-500,-500,-500,-500,-500,-500,-500,-500,-500,,,,,,,,,,,,,,,,,,,,,,,,,,,,,,,,,,,
-500,-500,-500,-500,-500,-500,-500,-500,-500,-500,-500,-500,-500,-500,-500,-500,,,,,,,,,,,,,,,,,,,,,,,,,,,,,,,,,,,
-500,-500,-500,-500,-500,-500,-500,-500,-500,-500,-500,-500,-500,-500,-500,-500,,,,,,,,,,,,,,,,,,,,,,,,,,,,,,,,,,,
-500,-500,-500,-500,-500,-500,-500,-500,-500,-500,-500,-500,-500,-500,-500,-500,,,,,,,,,,,,,,,,,,,,,,,,,,,,,,,,,,,
-500,-500,-500,-500,-500,-500,-500,-500,-500,-500,-500,-500,-500,-500,-500,-500,,,,,,,,,,,,,,,,,,,,,,,,,,,,,,,,,,,
-500,-500,-500,-500,-500,-500,-500,-500,-500,-500,-500,-500,-500,-500,-500,-500,,,,,,,,,,,,,,,,,,,,,,,,,,,,,,,,,,,
-500,-500,-500,-500,-500,-500,-500,-500,-500,-500,-500,-500,-500,-500,-500,-500,,,,,,,,,,,,,,,,,,,,,,,,,,,,,,,,,,,
-500,-500,-500,-500,-500,-500,-500,-500,-500,-500,-500,-500,-500,-500,-500,-500,,,,,,,,,,,,,,,,,,,,,,,,,,,,,,,,,,,
-500,-500,-500,-500,-500,-500,-500,-500,-500,-500,-500,-500,-500,-500,-500,-500,,,,,,,,,,,,,,,,,,,,,,,,,,,,,,,,,,,
-500,-500,-500,-500,-500,-500,-500,-500,-500,-500,-500,-500,-500,-500,-500,-500,,,,,,,,,,,,,,,,,,,,,,,,,,,,,,,,,,,
-500,-500,-500,-500,-500,-500,-500,-500,-500,-500,-500,-500,-500,-500,-500,-500,,,,,,,,,,,,,,,,,,,,,,,,,,,,,,,,,,,
-500,-500,-500,-500,-500,-500,-500,-500,-500,-500,-500,-500,-500,-500,-500,-500,,,,,,,,,,,,,,,,,,,,,,,,,,,,,,,,,,,
-500,-500,-500,-500,-500,-500,-500,-500,-500,-500,-500,-500,-500,-500,-500,-500,,,,,,,,,,,,,,,,,,,,,,,,,,,,,,,,,,,
-500,-500,-500,-500,-500,-500,-500,-500,-500,-500,-500,-500,-500,-500,-500,-500,,,,,,,,,,,,,,,,,,,,,,,,,,,,,,,,,,,
#,line_max,,,,,,,,,,,,,,,,,,,,,,,,,,,,,,,,,,,,,,,,,,,,,,,,,
17081,20653,21532,21621,21964,22108,22051,22571,22981,22643,22738,22320,22861,22937,22729,22070,18809,18324,21230,22122,22734,23433,23087,22838,23282,23340,22609,22744,23620,23405,23188,23428,23578,24074,23420,23089,23348,23540,23715,23129,23480,23027,23098,23084,22888,22923,23401,23150,23291,23592,23357
#,line_min,,,,,,,,,,,,,,,,,,,,,,,,,,,,,,,,,,,,,,,,,,,,,,,,,
9197,11120,11594,11642,11826,11904,11873,12153,12374,12192,12243,12018,12310,12350,12238,11884,10127,9866,11431,11912,12241,12617,12431,12297,12536,12567,12174,12247,12718,12602,12486,12615,12695,12962,12610,12432,12572,12675,12769,12454,12643,12399,12437,12430,12324,12343,12600,12465,12541,12703,12577
