[
  {
    "name": "custom_mask",
    "type": "MaskImage",
    "path": "decor.png",
    "startDiffX": 0,
    "startDiffY": 0,
    "endDiffX": 0,
    "endDiffY": 0,
    "startScale": 1.0,
    "endScale": 3.5,
    "startAlpha": 1.0,
    "endAlpha": 0.0
  },
  {
    "name": "decor0",
    "type": "Image",
    "path": "motion_decor1.png",
    "startDiffX": -78,
    "startDiffY": -57,
    "endDiffX": -78,
    "endDiffY": 0,
    "startScale": 1.0,
    "endScale": 3,
    "startAlpha": 1,
    "endAlpha": 0
  },
  {
    "name": "decor1",
    "type": "Image",
    "path": "motion_decor2.png",
    "startDiffX": 84,
    "startDiffY": -7,
    "endDiffX": 84,
    "endDiffY": 0,
    "startScale": 1.0,
    "endScale": 3,
    "startAlpha": 1,
    "endAlpha": 0
  }
]


