{
  "support": 1,
  "antennaAngle": [[53,42],[53,42]],
  "batteryValue": {
    "warningValue": 10,
    "unavailableValue": 0
  },
  "satelliteCfg": {
    "searchTimer": 20,
    "acqTimer": 6
  },
  "capabilityParam": {
    "obtainParamChanType": 1,
    "txToRxPolicy": 2,
    "txToRxDelayTime": 800,
	"ppsHoldBaseTime": 3500
  },
  "testConfig": {
    "searchMode": 0,
    "txFreqOffset": 0,
    "maxPwrLevelSend": 0,
    "supportAuth": 0,
    "encrypIndication": 0,
    "periodSendTest": {
    "sendCnt": 0,
    "interval": 2000
    }
  }
}