{
  "config":{
    "hw_platform": ["QRD", "IDP"],
    "soc_id": ["552", "497", "498", "540","515"]
  },
  "mmc56x3x_0_platform":{
    "owner": "sns_mmc56x3x",
    ".orient":{
      "owner": "sns_mmc56x3x",
      "x":{ "type": "str", "ver": "0",
        "data": "-x"
      },
      "y":{ "type": "str", "ver": "0",
        "data": "+y"
      },
      "z":{ "type": "str", "ver": "0",
        "data": "-z"
      }
    },
    ".mag":{
      "owner": "sns_mmc56x3x",
      ".fac_cal":{
        "owner": "sns_mmc56x3x",
        ".corr_mat":{
          "owner": "sns_mmc56x3x",
          "0_0":{ "type": "flt", "ver": "0",
            "data": "1.0296"
          },
          "0_1":{ "type": "flt", "ver": "0",
            "data": "-0.0443"
          },
          "0_2":{ "type": "flt", "ver": "0",
            "data": "0.0018"
          },
          "1_0":{ "type": "flt", "ver": "0",
            "data": "-0.0443"
          },
          "1_1":{ "type": "flt", "ver": "0",
            "data": "0.9515"
          },
          "1_2":{ "type": "flt", "ver": "0",
            "data": "0.0029"
          },
          "2_0":{ "type": "flt", "ver": "0",
            "data": "0.0018"
          },
          "2_1":{ "type": "flt", "ver": "0",
            "data": "0.0029"
          },
          "2_2":{ "type": "flt", "ver": "0",
            "data": "1.0271"
          }
        },
        ".bias":{
          "owner": "sns_mmc56x3x",
          "x":{ "type": "flt", "ver": "0",
            "data": "0.0"
          },
          "y":{ "type": "flt", "ver": "0",
            "data": "0.0"
          },
          "z":{ "type": "flt", "ver": "0",
            "data": "0.0"
          }
        }
      }
    }
  }
}
