{
    "qvalues":[10,18,9,22,8,21,9,22,8,21,9,22,10,23],
    "aecvalues":[11,19,12,25,11,24,11,24,8,21,10,23,10,23],
    "codecDecoderParam":[4,15,13,9,18,16,0,0,0,0,0,0,0,0,0,0,50,22,20,0],
    "aecDecoderParam":[4,15,15,13,18,16,0,0,0,0,0,0,0,0,0,0,50,20,20,13],
    "codecPhonesThrd":[
        [71,44],
        [61,81],
        [125,32],
        [81,-44],
        [93,-63],
        [157,-15],
        [20,26],
        [33,95],
        [129,32],
        [53,-44],
        [101,-65],
        [56,26],
        [49,57],
        [17,-44]
        ],
    "aecPhonesThrd":[
        [71,40],
        [61,80],
        [125,51],
        [81,-54],
        [93,-63],
        [157,-20],
        [20,26],
        [33,95],
        [129,57],
        [53,-44],
        [101,-65],
        [56,26],
        [49,57],
        [17,-44]
        ],
	"normalModel":{
		"layerNum":8,
		"bottleNode":136,
		"layersNodeNum":[200, 272, 272, 408, 272, 272, 4052]
	},
	"codecDealyReport":[0,0],
    "aecDealyReport":[0,0],
	"lpe2ebypass":0,
	"aece2ebypass":0,
	"lpsaveactive":[35,45],
	"aecsaveactive":[0,0],
	"lphiddensize":30,
	"aechiddensize":30
}
