{
    "version": "1.0.0",
    "uid_name": "APP",
    "APP": {
        "Anr": [
                    {
                        "rule_prio":0,
                        "featureid":"070110000",
                        "EventInfoParam":{
                            "PNAME": "BasicParam.s_process",
                            "PTOPCPU": "BasicParam.s_topcpu",
                            "TOTALCPU": "BasicParam.s_totalcpu",
                            "IOWAITCPU": "BasicParam.s_iowait",
                            "APPVERSION": "BasicParam.s_appversion",
                            "SYSVMTYPE": "BasicParam.s_sysvmtype",
                            "APPVMTYPE": "BasicParam.s_appvmtype",
                            "FG": "BasicParam.s_foreground",
                            "LIFETIME": "BasicParam.s_lifetime",
                            "SUBJECT": "BasicParam.s_subject",
                            "TRUSTSTACK": "MainCallTrace.s_trust_stack",
                            "BINDERLIST": "BinderBlock.s_binderlist",
                            "BINDERMAX": "BinderBlock.s_bindermax"
                        },
                        "RelatedInfo":{
                            "FLAG": "BasicParam.s_flag",
                            "PID": "BasicParam.s_pid",
                            "UID": "BasicParam.s_uid",
                            "PACKAGE": "BasicParam.s_package",
                            "TRACEID": "BasicParam.s_traceid",
                            "FAULTCPU": "BasicParam.s_faultcpu"
                        }
                    }
        ],
        "Crash": [
                    {
                        "rule_prio":0,
                        "featureid":"070110010",
                        "EventInfoParam":{
                            "PNAME": "BasicParam.s_process",
                            "APPVERSION": "BasicParam.s_appversion",
                            "SYSVMTYPE": "BasicParam.s_sysvmtype",
                            "APPVMTYPE": "BasicParam.s_appvmtype",
                            "FG": "BasicParam.s_foreground",
                            "LIFETIME": "BasicParam.s_lifetime",
                            "MAINTHREAD": "BasicParam.s_mainthread",
                            "FLAG": "BasicParam.s_flag",
                            "TRUSTSTACK": "BasicParam.s_trace",
                            "REASON": "BasicParam.s_reason"
                        },
                        "RelatedInfo":{
                            "TRACEID": "BasicParam.s_traceid",
                            "PID": "BasicParam.s_pid",
                            "UID": "BasicParam.s_uid",
                            "PACKAGE": "BasicParam.s_package"
                        }
                    }
        ],
        "Tombstone": [
                        {
                            "rule_prio":0,
                            "featureid":"070110020",
                            "EventInfoParam":{
                                "PNAME": "BasicParam.s_process",
                                "FPNAME": "BasicParam.s_process",
                                "SUBNAME": "BasicParam.s_name",
                                "APPVERSION": "BasicParam.s_appversion",
                                "SYSVMTYPE": "BasicParam.s_sysvmtype",
                                "APPVMTYPE": "BasicParam.s_appvmtype",
                                "FG": "BasicParam.s_foreground",
                                "LIFETIME": "BasicParam.s_lifetime",
                                "SIGNALNUM": "SignalParam.s_sigmsg",
                                "SIGMSG": "SignalParam.s_sigmsg+SignalParam.s_sicode",
                                "REASON": "ExceptionReason.s_cause",
                                "TRUSTSTACK": "MainCallTrace.s_trace"
                            },
                            "RelatedInfo":{
                                "PACKAGE": "BasicParam.s_package",
                                "LOGVERSION": "BasicParam.s_androidvision",
                                "FLAG": "BasicParam.s_flag",
                                "UID": "BasicParam.s_uid",
                                "PID": "BasicParam.s_pid",
                                "TRACEID": "BasicParam.s_traceid",
                                "SUBTYPE": "BasicParam.s_abortmsg",
                                "SICODE": "SignalParam.s_sicode"
                            }
                        }
        ],
        "Xcollie": [
                        {
                            "rule_prio":0,
                            "featureid":"070140031",
                            "EventInfoParam":{
                                "TRUSTSTACK":"CallTrace.s_calltrace"
                            }
                        },
                        {
                            "rule_prio":1,
                            "featureid":"070140030",
                            "EventInfoParam":{
                                "PNAME": "BasicParam.s_pname:BasicParam.s_funcname",
                                "TRUSTSTACK":"MainCallTrace.s_maintrace"
                            },
                            "RelatedInfo":{
                                "REASON": "BasicParam.s_reason"
                            }
                        },
                        {
                            "rule_prio":2,
                            "featureid":"070140030",
                            "EventInfoParam":{
                                "TRUSTSTACK":"CallTrace.s_calltrace"
                            }
                        }
        ],
        "JsCrash": [
                        {
                            "rule_prio":0,
                            "featureid":"070110140",
                            "EventInfoParam":{
                                "LIFETIME": "BasicParam.s_lifeTime",
                                "ABILITYNAME":"BasicParam.s_ability",
                                "PAGE":"BasicParam.s_page",
                                "SUBTYPE":"BasicParam.s_error",
                                "JSVMTYPE":"BasicParam.s_vm",
                                "TRUSTSTACK":"BasicParam.s_trace"
                            }
                        }
        ]
    }
}
