{
	"config": {
		"hw_platform": ["QRD"],
		"soc_id": ["356"]
	},
	"sns_motion": {
		"owner": "sns_motion",
		"pickup_flag": { "type": "int", "ver": "0", "data": "1" },
		"angle_gap": { "type": "int", "ver": "0", "data": "30" },
		"unsupported_proximity": { "type": "int", "ver": "0", "data": "1" }
	}
}
