{
    "heycelia":{
		"aec":{
			"keyphrase":[10, -0.5, 0.14, 0.07, 0.185, 1]
		},
		"driveMode":{
			"keyphrase":[10, -0.5, 0, -0.1, 0.26, 1]
		},
		"pcOffice":{
			"keyphrase":[10, -0.5, 0, -0.1, 0.26, 1]
		}
	}
}