{
	"centerX" : 0.5,
	"centerY" : 0.5,
	"angle" : 0,
	"scale" : 1,
	"width" : 165,
	"height" : 86,
	"contents" : [
        {
			"type" : "image",
			"resource" : {
				"type" : "static",
				"path" : "res/altitude_3_background.png"
			},
			"centerX" : 0.5,
			"centerY" : 0.5,
			"width" : 165,
			"height" : 86,
			"zorder" : 1
		},
        {
            "type": "text",
            "centerX": 0.529,
            "centerY": 0.35,
            "width": 45,
            "height": 30,
            "angle": 0,
            "color": "#ffffffff",
            "isVertical": 0,
			"alignment": 0,
			"editable":true,
			"font":"roboto",
            "text": "{ALTITUDE}",
            "zorder": 1
        },
        {
			"type" : "image",
			"resource" : {
				"type" : "static",
				"path" : "res/altitude_3_num_m.png"
			},
			"centerX" : 0.73,
			"centerY" : 0.36,
			"width" : 8,
			"height" : 10,
			"zorder" : 1
        },
        {
            "type": "text",
            "centerX": 0.65,
            "centerY": 0.70,
            "width": 80,
            "height": 15,
            "angle": 0,
            "color": "#ffffffff",
            "isVertical": 0,
			"alignment": 1,
            "text": "{LOCATION}",
			"editable":true,
			"font":"roboto",
            "zorder": 1
        }
	]
}
