{
	"centerX" : 0.5,
	"centerY" : 0.5,
	"angle" : 0,
	"scale" : 1,
	"width" : 174,
	"height" : 40,
	"contents" : [{
			"type" : "image",
			"resource" : {
				"type" : "static",
				"path" : "res/here.png"
			},
			"centerX" : 0.63,
			"centerY" : 0.25,
			"width" : 116,
			"height" : 18,
			"zorder" : 1
		},
		{
            "type": "text",
			"centerX" : 0.5,
            "centerY": 0.7,
            "width": 160,
            "height": 18,
            "color": "#ffffffff",
			"alignment": 2,
			"editable":true,
            "text": "{LOCATION}",
            "zorder": 2
        }
	]
}
