{
    "priority_install": [
        "Framework-common",
        "Framework-manager",
        "Framework-runtime",
        "Framework-ui",
        "Framework-privacy",
        "Framework-kitstore",
        "Framework-webapp"
    ],
    "kits": [
        {
            "version_code": "50001307",
            "kit_type": "app",
            "kit_name": "realname",
            "api_level": "1",
            "pkg_name": "com.huawei.hms.realname",
            "apk_name": "RealName-base.apk",
            "minSdkVersion": "19",
            "kit_lib": "armeabi-v7a,arm64-v8a",
            "dependencies": "kitstore,6;fwcom-util,9;hmscore,1;huawei_module_dynamicloader,8;qoes,1",
            "main_entry": "com.huawei.hms.realname.MainEntry"
        },
        {
            "version_code": "60700300",
            "kit_type": "app",
            "kit_name": "identity",
            "api_level": "3",
            "pkg_name": "com.huawei.hms.identity",
            "apk_name": "Identity.apk",
            "minSdkVersion": "19",
            "kit_lib": "armeabi-v7a,arm64-v8a",
            "dependencies": "huawei_module_networkkit,11:weak;fwcom-grs,1;fwcom-util,1;fwui,1;hmscore,6;huawei_module_dynamicloader,8;kpms,3;runtime,9;hwid,16;kams,3;apptouch,1",
            "main_entry": "com.huawei.hms.identity.MainEntry"
        },
        {
            "version_code": "60700360",
            "kit_type": "app",
            "kit_name": "wireless",
            "api_level": "3",
            "pkg_name": "com.huawei.hms.wireless",
            "apk_name": "Wireless.apk",
            "minSdkVersion": "24",
            "main_entry": "com.huawei.hms.wireless.MainEntry"
        },
        {
            "version_code": "120401303",
            "kit_type": "app",
            "kit_name": "hem",
            "api_level": "1",
            "pkg_name": "com.huawei.hms.hem",
            "apk_name": "hemkit.apk",
            "minSdkVersion": "19",
            "main_entry": "com.huawei.hms.hem.MainEntry"
        },
        {
            "version_code": "10014301",
            "kit_type": "app;sdk",
            "kit_name": "videokit;huawei_module_videoplayer",
            "api_level": "1;14",
            "pkg_name": "com.huawei.hms.videokit.player",
            "apk_name": "videoplayer.apk",
            "minSdkVersion": "21",
            "kit_loader": "huawei_module_videoplayer:huawei_module_dynamicloader",
            "kit_lib": "armeabi-v7a,arm64-v8a",
            "main_entry": ";"
        },
        {
            "version_code": "30700303",
            "kit_type": "sdk",
            "kit_name": "huawei_module_mlkit_scenedetection",
            "api_level": "4",
            "pkg_name": "com.huawei.hms.mlkit.scd",
            "apk_name": "ML-scenedetection.apk",
            "minSdkVersion": "19",
            "kit_lib": "armeabi-v7a,arm64-v8a",
            "dependencies": "huawei_module_dynamicloader,8;hmscore,1",
            "main_entry": ""
        },
        {
            "version_code": "30700302",
            "kit_type": "sdk",
            "kit_name": "huawei_module_mlkit_label",
            "api_level": "3",
            "pkg_name": "com.huawei.hms.mlkit.label",
            "apk_name": "ML-label.apk",
            "minSdkVersion": "19",
            "kit_lib": "armeabi-v7a,arm64-v8a",
            "dependencies": "huawei_module_dynamicloader,8;hmscore,1",
            "main_entry": ""
        },
        {
            "version_code": "30700301",
            "kit_type": "sdk",
            "kit_name": "huawei_module_mlkit_imagesuperresolution",
            "api_level": "4",
            "pkg_name": "com.huawei.hms.mlkit.imagesuperresolution",
            "apk_name": "ML-isr.apk",
            "minSdkVersion": "19",
            "kit_lib": "armeabi-v7a,arm64-v8a",
            "dependencies": "huawei_module_dynamicloader,8;hmscore,1",
            "main_entry": ""
        },
        {
            "version_code": "60900306",
            "kit_type": "app",
            "kit_name": "nearby",
            "api_level": "135",
            "pkg_name": "com.huawei.hms.nearby",
            "apk_name": "Nearby.apk",
            "minSdkVersion": "21",
            "kit_lib": "armeabi-v7a,arm64-v8a",
            "dependencies": "fwcom-util,13;fwcom-grs,1;fwui,7;hmscore,10;runtime,23;kpms,12;measurement,1;kams,11;apptouch,3",
            "main_entry": "com.huawei.hms.nearby.MainEntry"
        },
        {
            "version_code": "30700301",
            "kit_type": "sdk",
            "kit_name": "huawei_module_mlkit_tisr",
            "api_level": "3",
            "pkg_name": "com.huawei.hms.mlkit.textimagesuperresolution",
            "apk_name": "ML-tsr.apk",
            "minSdkVersion": "19",
            "kit_lib": "armeabi-v7a,arm64-v8a",
            "dependencies": "huawei_module_dynamicloader,8;hmscore,1",
            "main_entry": ""
        },
        {
            "version_code": "60900301",
            "kit_type": "app",
            "kit_name": "keyring",
            "api_level": "690",
            "pkg_name": "com.huawei.hms.keyring",
            "apk_name": "keyring.apk",
            "minSdkVersion": "24",
            "dependencies": "huawei_module_networkkit,8:weak;fwcom-grs,2;fwcom-util,10;fwui,7;hmscore,17;huawei_module_dynamicloader,6:weak;safetydetect,60100003;kpms,14;runtime,25;hwid,16;kams,13",
            "main_entry": "com.huawei.hms.keyring.MainEntry"
        },
        {
            "version_code": "340305",
            "kit_type": "app",
            "kit_name": "awareness_kit",
            "api_level": "11",
            "pkg_name": "com.huawei.hms.kit.awareness",
            "apk_name": "Awareness.apk",
            "minSdkVersion": "24",
            "dependencies": "fwcom-util,13;fwcom-grs,2;fwui,7;hmscore,10;runtime,25;kpms,14;location,2;nearby,131;measurement,4;kams,13",
            "main_entry": "com.huawei.hms.kit.awareness.entry.MainEntry"
        },
        {
            "version_code": "10109304",
            "kit_type": "app",
            "kit_name": "hbm",
            "api_level": "110",
            "pkg_name": "com.huawei.hms.hbm",
            "apk_name": "hbm.apk",
            "minSdkVersion": "26",
            "dependencies": "fwcom-grs,1;fwcom-util,6;fwui,7;hmscore,12;kpms,11;runtime,22;kams,11;apptouch,3",
            "main_entry": "com.huawei.hms.hbm.entry.MainEntry"
        },
        {
            "version_code": "60800300",
            "kit_type": "sdk",
            "kit_name": "huawei_module_scene",
            "api_level": "7",
            "pkg_name": "com.huawei.hms.scene",
            "apk_name": "SceneKit.apk",
            "minSdkVersion": "19",
            "kit_lib": "armeabi-v7a,arm64-v8a",
            "dependencies": "huawei_module_dynamicloader,9;hmscore,1;huawei_module_mlkit_face,6",
            "main_entry": ""
        },
        {
            "version_code": "60801300",
            "kit_type": "app;loader;sdk",
            "kit_name": "huawei_route_maps;huawei_module_maps;huawei_module_huaweimaps",
            "api_level": "17;17;17",
            "pkg_name": "com.huawei.hms.maps.provider.huawei",
            "apk_name": "Map-HuaweiProvider.apk",
            "minSdkVersion": "19",
            "kit_lib": "armeabi-v7a,arm64-v8a",
            "dependencies": "fwcom-grs,1;fwcom-util,1;fwui,1;huawei_module_dynamicloader,8;hmscore,9;kpms,11;runtime,20;location,1;kams,11;apptouch,3",
            "main_entry": "com.huawei.hms.maps.maproute.hmsclient.MainEntry;;",
            "pre_pkg_name": "com.huawei.hms.maps.maproute"
        },
        {
            "version_code": "10002301",
            "kit_type": "app",
            "kit_name": "airtouch",
            "api_level": "1",
            "pkg_name": "com.huawei.hms.airtouch",
            "apk_name": "AirTouch.apk",
            "minSdkVersion": "19",
            "kit_lib": "armeabi-v7a,arm64-v8a",
            "dependencies": "hmscore,1",
            "main_entry": "com.huawei.hms.airtouch.MainEntry"
        },
        {
            "version_code": "10003308",
            "kit_type": "sdk",
            "kit_name": "huawei_module_imagevision",
            "api_level": "10003301",
            "pkg_name": "com.huawei.hms.image.visionkit",
            "apk_name": "Image-vision.apk",
            "minSdkVersion": "26",
            "dependencies": "huawei_module_dynamicloader,8",
            "main_entry": ""
        },
        {
            "version_code": "30600301",
            "kit_type": "sdk",
            "kit_name": "huawei_module_mlkit_faceverify",
            "api_level": "3",
            "pkg_name": "com.huawei.hms.mlkit.faceverify",
            "apk_name": "ML-faceverify.apk",
            "minSdkVersion": "19",
            "kit_lib": "armeabi-v7a,arm64-v8a",
            "dependencies": "huawei_module_dynamicloader,8;hmscore,1",
            "main_entry": ""
        },
        {
            "version_code": "40004303",
            "kit_type": "app",
            "kit_name": "walletkit",
            "api_level": "1",
            "pkg_name": "com.huawei.hms.walletkit",
            "apk_name": "WalletKit.apk",
            "minSdkVersion": "19",
            "kit_lib": "armeabi-v7a,arm64-v8a",
            "dependencies": "huawei_module_networkkit,11;fwcom-grs,1;fwcom-util,1;fwui,1;hmscore,5;huawei_module_dynamicloader,8;kpms,3;runtime,7;hwid,16;kams,3;apptouch,1",
            "main_entry": "com.huawei.hms.walletkit.MainEntry"
        },
        {
            "version_code": "60600302",
            "kit_type": "sdk",
            "kit_name": "huawei_module_hwdtm",
            "api_level": "1",
            "pkg_name": "com.huawei.hms.dtm",
            "apk_name": "DTM.apk",
            "minSdkVersion": "19",
            "dependencies": "huawei_module_dynamicloader,4;hmscore,1;push,1",
            "main_entry": ""
        },
        {
            "version_code": "10600300",
            "kit_type": "sdk",
            "kit_name": "huawei_module_audiokit",
            "api_level": "11",
            "pkg_name": "com.huawei.hms.audiokit",
            "apk_name": "Audio.apk",
            "minSdkVersion": "19",
            "kit_loader": "huawei_module_audiokit:huawei_module_dynamicloader",
            "kit_lib": "armeabi,arm64-v8a",
            "dependencies": "huawei_module_dynamicloader,5",
            "main_entry": ""
        },
        {
            "version_code": "50002310",
            "kit_type": "app;sdk",
            "kit_name": "panorama;huawei_module_panorama",
            "api_level": "8;8",
            "pkg_name": "com.huawei.hms.panorama",
            "apk_name": "Panorama.apk",
            "minSdkVersion": "19",
            "dependencies": "fwcom-grs,1;fwcom-util,10;fwui,7;huawei_module_dynamicloader,8;hmscore,14;kpms,14;runtime,25;kams,13",
            "main_entry": "com.huawei.hms.panorama.MainEntry;"
        },
        {
            "version_code": "30800303",
            "kit_type": "sdk",
            "kit_name": "huawei_module_mlkit_ocr",
            "api_level": "6",
            "pkg_name": "com.huawei.hms.mlkit.ocr",
            "apk_name": "ML-ocr.apk",
            "minSdkVersion": "19",
            "kit_lib": "armeabi-v7a,arm64-v8a",
            "dependencies": "huawei_module_dynamicloader,8;hmscore,1",
            "main_entry": ""
        },
        {
            "version_code": "30700301",
            "kit_type": "sdk",
            "kit_name": "huawei_module_mlkit_translate",
            "api_level": "3",
            "pkg_name": "com.huawei.hms.mlkit.translate",
            "apk_name": "ML-Translate.apk",
            "minSdkVersion": "19",
            "kit_lib": "armeabi-v7a,arm64-v8a",
            "dependencies": "huawei_module_dynamicloader,8;hmscore,1",
            "main_entry": ""
        },
        {
            "version_code": "50000300",
            "kit_type": "sdk",
            "kit_name": "huawei_module_quic",
            "api_level": "1",
            "pkg_name": "com.huawei.hms.hquic",
            "apk_name": "hquic.apk",
            "minSdkVersion": "19",
            "kit_lib": "arm64-v8a",
            "main_entry": ""
        },
        {
            "version_code": "60900307",
            "kit_type": "app",
            "kit_name": "findnetwork",
            "api_level": "19",
            "pkg_name": "com.huawei.hms.findnetwork",
            "apk_name": "FindNetwork.apk",
            "minSdkVersion": "23",
            "kit_lib": "armeabi-v7a,arm64-v8a",
            "dependencies": "fwcom-util,13;hmscore,10;runtime,26;hwid,16;nearby,134;keyring,670;measurement,1",
            "main_entry": "com.huawei.hms.findnetwork.MainEntry"
        },
        {
            "version_code": "60400305",
            "kit_type": "app",
            "kit_name": "consent",
            "api_level": "110",
            "pkg_name": "com.huawei.hms.consent",
            "apk_name": "Consent.apk",
            "minSdkVersion": "19",
            "dependencies": "hmscore,10;safetydetect,1;runtime,20;measurement,1;kams,11;huawei_module_networkkit,8;fwcom-grs,1;fwcom-util,1;tss,-1:weak;fwui,1;huawei_module_dynamicloader,6;kpms,11;apptouch,3",
            "main_entry": "com.huawei.hms.consent.MainEntry"
        },
        {
            "version_code": "30700302",
            "kit_type": "sdk",
            "kit_name": "huawei_module_mlkit_imgseg",
            "api_level": "11",
            "pkg_name": "com.huawei.hms.mlkit.imgseg",
            "apk_name": "ML-imgseg.apk",
            "minSdkVersion": "19",
            "kit_lib": "armeabi-v7a,arm64-v8a",
            "dependencies": "huawei_module_dynamicloader,8;hmscore,1",
            "main_entry": ""
        },
        {
            "version_code": "10003309",
            "kit_type": "sdk",
            "kit_name": "huawei_module_imagerender",
            "api_level": "3",
            "pkg_name": "com.huawei.hms.image.render",
            "apk_name": "Image-render.apk",
            "minSdkVersion": "19",
            "dependencies": "fwcom-grs,1;fwcom-util,1;fwui,1;huawei_module_dynamicloader,8;hmscore,6;kpms,3;runtime,9;kams,3;apptouch,1",
            "main_entry": ""
        },
        {
            "version_code": "101000301",
            "kit_type": "app",
            "kit_name": "qoes",
            "api_level": "1",
            "pkg_name": "com.huawei.hms.qoes",
            "apk_name": "QoES.apk",
            "minSdkVersion": "19",
            "dependencies": "fwcom-grs,1;fwcom-util,10;fwui,7;hmscore,14;kpms,14;runtime,25;qoes,1;location,2;kams,13",
            "main_entry": "com.huawei.hms.qoes.MainEntry"
        },
        {
            "version_code": "60100300",
            "kit_type": "app",
            "kit_name": "AGCLink",
            "api_level": "2",
            "pkg_name": "com.huawei.hms.agclink",
            "apk_name": "AGCLink.apk",
            "minSdkVersion": "19",
            "dependencies": "fwcom-grs,1;fwcom-util,1;fwui,1;hmscore,6;kpms,3;runtime,9;kams,3;apptouch,3",
            "main_entry": "com.huawei.hms.agclink.MainEntry"
        }
    ]
}