{
    "version": "1.0.0",
    "delay" : 10,
    "schedule_time" : 10,
    "sensor" : {
        "name": "mtkts_chargerntc",
        "accuracy": 1
    },
    "temp_level" : {
        "comments" : "low_threshold, high_threshold, hysteresis_value, unit is millicentigrade",
        "table" : [
            [37000, 38000, 2000],
            [38000, 39000, 2000],
            [39000, 42000, 2000],
            [42000, 44000, 2000],
            [44000, 46000, 2000],
            [46000, 50000, 2000],
            [50000, 99000, 2000]
        ]
    },
    "current_limit" : {
        "comments" : "scale1, scale2, scale3, scale4, scale5, scale6, scale7",
        "ucurrent" : {
            "channel" : 0,
            "prefix" : "dcp ",
            "limit" : [1200, 900, 500, 500, 500, 100, 100]
        },
        "direct_charger" : {
            "channel" : 1,
            "prefix" : "lvc ",
            "limit": [ 3500, 3000, 2600, 2000, 2000, 1500,1500]
        },
        "direct_charger_sc" : {
            "channel" : 0,
            "prefix" : "sc 0#",
            "limit": [7000, 5500, 4700, 3800, 3000,  2500,1500]
        }
    },
    "su_version": "1.0.0",
    "su_delay" : 1,
    "su_current_limit" : {
        "comments" : "hota, normal",
        "wcurrent_5v" : {
            "channel" : 0,
            "prefix" : "dcp 0#",
            "limit" : [900, 1300]
        },
        "wcurrent_9v" : {
            "channel" : 0,
            "prefix" : "dcp 1#",
            "limit": [900, 1300]
        },
        "direct_charger" : {
            "channel" : 1,
            "prefix" : "lvc ",
            "limit": [1500, 1500]
        },
        "direct_charger_sc" : {
            "channel" : 0,
            "prefix" : "sc 0#",
            "limit": [1500, 1500]
        },
        "direct_charger_duo_sc" : {
            "channel" : 0,
            "prefix" : "sc 1#",
            "limit": [1500, 1500]
        }

    }
}
