{
	"centerX" : 0.5,
	"centerY" : 0.5,
	"angle" : 0,
	"scale" : 1,
	"width" : 150,
	"height" : 72,
	"contents" : [{
		"type" : "image",
		"resource":{
			"type":"dynamic",
			"resKey":"{eee}",
			"resources":[
				{
					"key":"1",
					"path":"res/sun.png"
				},
				{
					"key":"2",
					"path":"res/monday.png"
				},
				{
					"key":"3",
					"path":"res/tue.png"
				},
				{
					"key":"4",
					"path":"res/wed.png"
				},{
					"key":"5",
					"path":"res/thu.png"
				},
				{
					"key":"6",
					"path":"res/fri.png"
				},
				{
					"key":"7",
					"path":"res/sat.png"
				}
			]
		},
		"centerX" : 0.5,
		"centerY" : 0.5,
		"width" : 150,
		"height" : 72,
		"angle" : 0,
		"zorder" : 1
	}
	]
}
