{
    "AsrParams":{
        "Enrollment":[false, 0, 240, 2000, 200, 0, 30000, 3, 0, 1, 20000, 20, 0.3, 0.03, -0.1, 0.38, 0.1, 0],
        "Recognition":[false, 0, 240, 2000, 2000, 0, 30000, 1, 0, 1, 20000, 20, 0.3, 0.03, -0.5, 0.3, 0.03, -0.5]
    },
    "SensibilityParams":{
        "comment":"array element 0:low, 1:middle, 2:high",
        "AsrUnconfidentPhonesNum":[0, 0, 1],
        "DspSentenceThresholds":{
            "Default":[84, 84, 77],
            "UserDefined":[97, 97, 97]
        }
    }
}