{
	"centerX" : 0.5,
	"centerY" : 0.6,
	"angle" : 0,
	"scale" : 1,
	"width" : 170,
	"height" : 57,
	"contents" : [
		{
            "type": "text",
            "centerX": 0.5,
            "centerY": 0.3,
            "width": 120,
            "height": 16,
            "angle": 0,
            "color": "#ffffffff",
            "isVertical": 0,
            "alignment": 0,
            "text": "{yyyy/MM/dd}",
            "zorder": 2
        },
        {
            "type": "text",
            "centerX": 0.5,
            "centerY": 0.75,
            "width": 120,
            "height": 18,
            "angle": 0,
            "color": "#ffffffff",
            "isVertical": 0,
            "editable":true,
			"alignment": 0,
            "text": "{USER_EDIT}",
            "zorder": 2
        }
	]
}
