#,version,,,,,,,,,,,,,,
2021,4,19,2,,,,,,,,,,,,
#,row_col_num,,,,,,,,,,,,,,
36,16,,,,,,,,,,,,,,
#,noise,,,,,,,,,,,,,,
-350,350,,,,,,,,,,,,,,
#,raw_max,,,,,,,,,,,,,,
"			5969","	5966","	5965","	5969","	5966","	5961","	5958","	5966","	5972","	5969","	5962","	5959","	5968","	5969","	5965","	5962"
"			5968","	5968","	5969","	5973","	5969","	5965","	5969","	5968","	5958","	5971","	5973","	5965","	5968","	5966","	5966","	5971"
"			5972","	5968","	5965","	5965","	5971","	5965","	5962","	5964","	5966","	5964","	5964","	5969","	5972","	5961","	5968","	5968"
"			5964","	5968","	5972","	5973","	5962","	5962","	5965","	5962","	5961","	5966","	5966","	5964","	5966","	5971","	5966","	5971"
"			5966","	5968","	5968","	5968","	5969","	5969","	5969","	5961","	5961","	5964","	5962","	5962","	5973","	5969","	5968","	5975"
"			5965","	5962","	5962","	5951","	5978","	5978","	5976","	5962","	5964","	5969","	5968","	5962","	5965","	5964","	5964","	5971"
"			5962","	5975","	5966","	5968","	5971","	5968","	5973","	5969","	5971","	5969","	5968","	5964","	5961","	5972","	5966","	5957"
"			5968","	5968","	5961","	5961","	5971","	5964","	5966","	5971","	5961","	5966","	5964","	5978","	5975","	5962","	5964","	5971"
"			5971","	5973","	5971","	5969","	5957","	5957","	5957","	5976","	5985","	5958","	5957","	5978","	5979","	5961","	5966","	5965"
"			5968","	5962","	5966","	5969","	5969","	5975","	5971","	5962","	5966","	5968","	5968","	5964","	5965","	5975","	5969","	5962"
"			5968","	5959","	5962","	5971","	5961","	5969","	5975","	5972","	5965","	5959","	5966","	5962","	5971","	5964","	5962","	5972"
"			5968","	5966","	5969","	5969","	5964","	5972","	5968","	5962","	5957","	5961","	5965","	5965","	5972","	5966","	5966","	5966"
"			5962","	5976","	5968","	5966","	5964","	5957","	5952","	5971","	5971","	5968","	5964","	5964","	5975","	5971","	5966","	5966"
"			5964","	5966","	5969","	5968","	5968","	5969","	5969","	5962","	5965","	5969","	5969","	5968","	5965","	5964","	5964","	5971"
"			5971","	5969","	5968","	5969","	5961","	5959","	5954","	5961","	5968","	5966","	5965","	5965","	5968","	5968","	5968","	5975"
"			5976","	5972","	5973","	5969","	5968","	5975","	5973","	5971","	5968","	5973","	5976","	5973","	5962","	5966","	5968","	5964"
"			5968","	5968","	5975","	5964","	5971","	5976","	5971","	5975","	5968","	5965","	5962","	5969","	5959","	5968","	5968","	5976"
"			5969","	5965","	5961","	5965","	5972","	5973","	5972","	5962","	5971","	5966","	5959","	5969","	5965","	5969","	5966","	5969"
"			5972","	5966","	5961","	5966","	5965","	5972","	5965","	5961","	5979","	5966","	5969","	5962","	5964","	5976","	5975","	5962"
"			5976","	5969","	5975","	5971","	5972","	5958","	5966","	5972","	5957","	5973","	5976","	5971","	5971","	5971","	5965","	5968"
"			5962","	5959","	5971","	5968","	5959","	5961","	5966","	5962","	5966","	5972","	5968","	5965","	5969","	5966","	5955","	5973"
"			5971","	5969","	5968","	5964","	5972","	5966","	5965","	5965","	5962","	5959","	5961","	5971","	5968","	5968","	5973","	5964"
"			5973","	5976","	5973","	5971","	5968","	5969","	5968","	5966","	5972","	5966","	5971","	5971","	5971","	5971","	5972","	5961"
"			5966","	5965","	5965","	5968","	5969","	5966","	5969","	5968","	5962","	5962","	5968","	5966","	5962","	5962","	5965","	5973"
"			5959","	5985","	5954","	5959","	5971","	5979","	5973","	5962","	5965","	5972","	5965","	5972","	5971","	5968","	5968","	5966"
"			5966","	5968","	5973","	5969","	5969","	5964","	5968","	5969","	5968","	5962","	5976","	5975","	5975","	5973","	5968","	5968"
"			5969","	5972","	5962","	5969","	5964","	5972","	5965","	5969","	5968","	5964","	5966","	5965","	5965","	5969","	5971","	5968"
"			5972","	5966","	5964","	5972","	5969","	5968","	5971","	5973","	5975","	5966","	5978","	5978","	5976","	5980","	5973","	5962"
"			5966","	5958","	5975","	5959","	5978","	5957","	5954","	5955","	5971","	5965","	5969","	5973","	5972","	5971","	5968","	5965"
"			5972","	5962","	5973","	5962","	5971","	5964","	5962","	5965","	5972","	5962","	5973","	5968","	5969","	5971","	5969","	5973"
"			5962","	5976","	5964","	5969","	5972","	5966","	5966","	5973","	5973","	5962","	5961","	5969","	5969","	5965","	5973","	5965"
"			5972","	5969","	5966","	5969","	5969","	5965","	5964","	5962","	5968","	5964","	5964","	5959","	5961","	5964","	5961","	5961"
"			5965","	5969","	5965","	5972","	5964","	5968","	5961","	5979","	5972","	5962","	5973","	5964","	5964","	5962","	5964","	5965"
"			5969","	5969","	5966","	5975","	5971","	5969","	5968","	5966","	5964","	5969","	5969","	5971","	5966","	5972","	5971","	5962"
"			5959","	5966","	5959","	5968","	5971","	5971","	5971","	5966","	5957","	5973","	5964","	5973","	5961","	5980","	5972","	5971"
"			5964","	5958","	5965","	5958","	5952","	5976","	5958","	5975","	5962","	5962","	5968","	5968","	5962","	5965","	5965","	5972"
#,raw_min,,,,,,,,,,,,,,
"			2558","	2557","	2556","	2558","	2557","	2554","	2553","	2557","	2559","	2558","	2555","	2554","	2557","	2558","	2556","	2555"
"			2557","	2557","	2558","	2560","	2558","	2556","	2558","	2557","	2553","	2559","	2560","	2556","	2557","	2557","	2557","	2559"
"			2559","	2557","	2556","	2556","	2559","	2556","	2555","	2556","	2557","	2556","	2556","	2558","	2559","	2554","	2557","	2557"
"			2556","	2557","	2559","	2560","	2555","	2555","	2556","	2555","	2554","	2557","	2557","	2556","	2557","	2559","	2557","	2559"
"			2557","	2557","	2557","	2557","	2558","	2558","	2558","	2554","	2554","	2556","	2555","	2555","	2560","	2558","	2557","	2560"
"			2556","	2555","	2555","	2550","	2562","	2562","	2561","	2555","	2556","	2558","	2557","	2555","	2556","	2556","	2556","	2559"
"			2555","	2560","	2557","	2557","	2559","	2557","	2560","	2558","	2559","	2558","	2557","	2556","	2554","	2559","	2557","	2553"
"			2557","	2557","	2554","	2554","	2559","	2556","	2557","	2559","	2554","	2557","	2556","	2562","	2560","	2555","	2556","	2559"
"			2559","	2560","	2559","	2558","	2553","	2553","	2553","	2561","	2565","	2553","	2553","	2562","	2562","	2554","	2557","	2556"
"			2557","	2555","	2557","	2558","	2558","	2560","	2559","	2555","	2557","	2557","	2557","	2556","	2556","	2560","	2558","	2555"
"			2557","	2554","	2555","	2559","	2554","	2558","	2560","	2559","	2556","	2554","	2557","	2555","	2559","	2556","	2555","	2559"
"			2557","	2557","	2558","	2558","	2556","	2559","	2557","	2555","	2553","	2554","	2556","	2556","	2559","	2557","	2557","	2557"
"			2555","	2561","	2557","	2557","	2556","	2553","	2551","	2559","	2559","	2557","	2556","	2556","	2560","	2559","	2557","	2557"
"			2556","	2557","	2558","	2557","	2557","	2558","	2558","	2555","	2556","	2558","	2558","	2557","	2556","	2556","	2556","	2559"
"			2559","	2558","	2557","	2558","	2554","	2554","	2551","	2554","	2557","	2557","	2556","	2556","	2557","	2557","	2557","	2560"
"			2561","	2559","	2560","	2558","	2557","	2560","	2560","	2559","	2557","	2560","	2561","	2560","	2555","	2557","	2557","	2556"
"			2557","	2557","	2560","	2556","	2559","	2561","	2559","	2560","	2557","	2556","	2555","	2558","	2554","	2557","	2557","	2561"
"			2558","	2556","	2554","	2556","	2559","	2560","	2559","	2555","	2559","	2557","	2554","	2558","	2556","	2558","	2557","	2558"
"			2559","	2557","	2554","	2557","	2556","	2559","	2556","	2554","	2562","	2557","	2558","	2555","	2556","	2561","	2560","	2555"
"			2561","	2558","	2560","	2559","	2559","	2553","	2557","	2559","	2553","	2560","	2561","	2559","	2559","	2559","	2556","	2557"
"			2555","	2554","	2559","	2557","	2554","	2554","	2557","	2555","	2557","	2559","	2557","	2556","	2558","	2557","	2552","	2560"
"			2559","	2558","	2557","	2556","	2559","	2557","	2556","	2556","	2555","	2554","	2554","	2559","	2557","	2557","	2560","	2556"
"			2560","	2561","	2560","	2559","	2557","	2558","	2557","	2557","	2559","	2557","	2559","	2559","	2559","	2559","	2559","	2554"
"			2557","	2556","	2556","	2557","	2558","	2557","	2558","	2557","	2555","	2555","	2557","	2557","	2555","	2555","	2556","	2560"
"			2554","	2565","	2551","	2554","	2559","	2562","	2560","	2555","	2556","	2559","	2556","	2559","	2559","	2557","	2557","	2557"
"			2557","	2557","	2560","	2558","	2558","	2556","	2557","	2558","	2557","	2555","	2561","	2560","	2560","	2560","	2557","	2557"
"			2558","	2559","	2555","	2558","	2556","	2559","	2556","	2558","	2557","	2556","	2557","	2556","	2556","	2558","	2559","	2557"
"			2559","	2557","	2556","	2559","	2558","	2557","	2559","	2560","	2560","	2557","	2562","	2562","	2561","	2563","	2560","	2555"
"			2557","	2553","	2560","	2554","	2562","	2553","	2551","	2552","	2559","	2556","	2558","	2560","	2559","	2559","	2557","	2556"
"			2559","	2555","	2560","	2555","	2559","	2556","	2555","	2556","	2559","	2555","	2560","	2557","	2558","	2559","	2558","	2560"
"			2555","	2561","	2556","	2558","	2559","	2557","	2557","	2560","	2560","	2555","	2554","	2558","	2558","	2556","	2560","	2556"
"			2559","	2558","	2557","	2558","	2558","	2556","	2556","	2555","	2557","	2556","	2556","	2554","	2554","	2556","	2554","	2554"
"			2556","	2558","	2556","	2559","	2556","	2557","	2554","	2562","	2559","	2555","	2560","	2556","	2556","	2555","	2556","	2556"
"			2558","	2558","	2557","	2560","	2559","	2558","	2557","	2557","	2556","	2558","	2558","	2559","	2557","	2559","	2559","	2555"
"			2554","	2557","	2554","	2557","	2559","	2559","	2559","	2557","	2553","	2560","	2556","	2560","	2554","	2563","	2559","	2559"
"			2556","	2553","	2556","	2553","	2551","	2561","	2553","	2560","	2555","	2555","	2557","	2557","	2555","	2556","	2556","	2559"
#,raw_row_delta_max,,,,,,,,,,,,,,
700,700,700,700,700,700,700,700,700,700,700,700,700,700,700,700
700,700,700,700,700,700,700,700,700,700,700,700,700,700,700,700
700,700,700,700,700,700,700,700,700,700,700,700,700,700,700,700
700,700,700,700,700,700,700,700,700,700,700,700,700,700,700,700
700,700,700,700,700,700,700,700,700,700,700,700,700,700,700,700
700,700,700,700,700,700,700,700,700,700,700,700,700,700,700,700
700,700,700,700,700,700,700,700,700,700,700,700,700,700,700,700
700,700,700,700,700,700,700,700,700,700,700,700,700,700,700,700
700,700,700,700,700,700,700,700,700,700,700,700,700,700,700,700
700,700,700,700,700,700,700,700,700,700,700,700,700,700,700,700
700,700,700,700,700,700,700,700,700,700,700,700,700,700,700,700
700,700,700,700,700,700,700,700,700,700,700,700,700,700,700,700
700,700,700,700,700,700,700,700,700,700,700,700,700,700,700,700
700,700,700,700,700,700,700,700,700,700,700,700,700,700,700,700
700,700,700,700,700,700,700,700,700,700,700,700,700,700,700,700
700,700,700,700,700,700,700,700,700,700,700,700,700,700,700,700
700,700,700,700,700,700,700,700,700,700,700,700,700,700,700,700
700,700,700,700,700,700,700,700,700,700,700,700,700,700,700,700
700,700,700,700,700,700,700,700,700,700,700,700,700,700,700,700
700,700,700,700,700,700,700,700,700,700,700,700,700,700,700,700
700,700,700,700,700,700,700,700,700,700,700,700,700,700,700,700
700,700,700,700,700,700,700,700,700,700,700,700,700,700,700,700
700,700,700,700,700,700,700,700,700,700,700,700,700,700,700,700
700,700,700,700,700,700,700,700,700,700,700,700,700,700,700,700
700,700,700,700,700,700,700,700,700,700,700,700,700,700,700,700
700,700,700,700,700,700,700,700,700,700,700,700,700,700,700,700
700,700,700,700,700,700,700,700,700,700,700,700,700,700,700,700
700,700,700,700,700,700,700,700,700,700,700,700,700,700,700,700
700,700,700,700,700,700,700,700,700,700,700,700,700,700,700,700
700,700,700,700,700,700,700,700,700,700,700,700,700,700,700,700
700,700,700,700,700,700,700,700,700,700,700,700,700,700,700,700
700,700,700,700,700,700,700,700,700,700,700,700,700,700,700,700
700,700,700,700,700,700,700,700,700,700,700,700,700,700,700,700
700,700,700,700,700,700,700,700,700,700,700,700,700,700,700,700
700,700,700,700,700,700,700,700,700,700,700,700,700,700,700,700
#,raw_row_delta_min,,,,,,,,,,,,,,
-700,-700,-700,-700,-700,-700,-700,-700,-700,-700,-700,-700,-700,-700,-700,-700
-700,-700,-700,-700,-700,-700,-700,-700,-700,-700,-700,-700,-700,-700,-700,-700
-700,-700,-700,-700,-700,-700,-700,-700,-700,-700,-700,-700,-700,-700,-700,-700
-700,-700,-700,-700,-700,-700,-700,-700,-700,-700,-700,-700,-700,-700,-700,-700
-700,-700,-700,-700,-700,-700,-700,-700,-700,-700,-700,-700,-700,-700,-700,-700
-700,-700,-700,-700,-700,-700,-700,-700,-700,-700,-700,-700,-700,-700,-700,-700
-700,-700,-700,-700,-700,-700,-700,-700,-700,-700,-700,-700,-700,-700,-700,-700
-700,-700,-700,-700,-700,-700,-700,-700,-700,-700,-700,-700,-700,-700,-700,-700
-700,-700,-700,-700,-700,-700,-700,-700,-700,-700,-700,-700,-700,-700,-700,-700
-700,-700,-700,-700,-700,-700,-700,-700,-700,-700,-700,-700,-700,-700,-700,-700
-700,-700,-700,-700,-700,-700,-700,-700,-700,-700,-700,-700,-700,-700,-700,-700
-700,-700,-700,-700,-700,-700,-700,-700,-700,-700,-700,-700,-700,-700,-700,-700
-700,-700,-700,-700,-700,-700,-700,-700,-700,-700,-700,-700,-700,-700,-700,-700
-700,-700,-700,-700,-700,-700,-700,-700,-700,-700,-700,-700,-700,-700,-700,-700
-700,-700,-700,-700,-700,-700,-700,-700,-700,-700,-700,-700,-700,-700,-700,-700
-700,-700,-700,-700,-700,-700,-700,-700,-700,-700,-700,-700,-700,-700,-700,-700
-700,-700,-700,-700,-700,-700,-700,-700,-700,-700,-700,-700,-700,-700,-700,-700
-700,-700,-700,-700,-700,-700,-700,-700,-700,-700,-700,-700,-700,-700,-700,-700
-700,-700,-700,-700,-700,-700,-700,-700,-700,-700,-700,-700,-700,-700,-700,-700
-700,-700,-700,-700,-700,-700,-700,-700,-700,-700,-700,-700,-700,-700,-700,-700
-700,-700,-700,-700,-700,-700,-700,-700,-700,-700,-700,-700,-700,-700,-700,-700
-700,-700,-700,-700,-700,-700,-700,-700,-700,-700,-700,-700,-700,-700,-700,-700
-700,-700,-700,-700,-700,-700,-700,-700,-700,-700,-700,-700,-700,-700,-700,-700
-700,-700,-700,-700,-700,-700,-700,-700,-700,-700,-700,-700,-700,-700,-700,-700
-700,-700,-700,-700,-700,-700,-700,-700,-700,-700,-700,-700,-700,-700,-700,-700
-700,-700,-700,-700,-700,-700,-700,-700,-700,-700,-700,-700,-700,-700,-700,-700
-700,-700,-700,-700,-700,-700,-700,-700,-700,-700,-700,-700,-700,-700,-700,-700
-700,-700,-700,-700,-700,-700,-700,-700,-700,-700,-700,-700,-700,-700,-700,-700
-700,-700,-700,-700,-700,-700,-700,-700,-700,-700,-700,-700,-700,-700,-700,-700
-700,-700,-700,-700,-700,-700,-700,-700,-700,-700,-700,-700,-700,-700,-700,-700
-700,-700,-700,-700,-700,-700,-700,-700,-700,-700,-700,-700,-700,-700,-700,-700
-700,-700,-700,-700,-700,-700,-700,-700,-700,-700,-700,-700,-700,-700,-700,-700
-700,-700,-700,-700,-700,-700,-700,-700,-700,-700,-700,-700,-700,-700,-700,-700
-700,-700,-700,-700,-700,-700,-700,-700,-700,-700,-700,-700,-700,-700,-700,-700
-700,-700,-700,-700,-700,-700,-700,-700,-700,-700,-700,-700,-700,-700,-700,-700
#,raw_col_delta_max,,,,,,,,,,,,,,
700,700,700,700,700,700,700,700,700,700,700,700,700,700,700,
700,700,700,700,700,700,700,700,700,700,700,700,700,700,700,
700,700,700,700,700,700,700,700,700,700,700,700,700,700,700,
700,700,700,700,700,700,700,700,700,700,700,700,700,700,700,
700,700,700,700,700,700,700,700,700,700,700,700,700,700,700,
700,700,700,700,700,700,700,700,700,700,700,700,700,700,700,
700,700,700,700,700,700,700,700,700,700,700,700,700,700,700,
700,700,700,700,700,700,700,700,700,700,700,700,700,700,700,
700,700,700,700,700,700,700,700,700,700,700,700,700,700,700,
700,700,700,700,700,700,700,700,700,700,700,700,700,700,700,
700,700,700,700,700,700,700,700,700,700,700,700,700,700,700,
700,700,700,700,700,700,700,700,700,700,700,700,700,700,700,
700,700,700,700,700,700,700,700,700,700,700,700,700,700,700,
700,700,700,700,700,700,700,700,700,700,700,700,700,700,700,
700,700,700,700,700,700,700,700,700,700,700,700,700,700,700,
700,700,700,700,700,700,700,700,700,700,700,700,700,700,700,
700,700,700,700,700,700,700,700,700,700,700,700,700,700,700,
700,700,700,700,700,700,700,700,700,700,700,700,700,700,700,
700,700,700,700,700,700,700,700,700,700,700,700,700,700,700,
700,700,700,700,700,700,700,700,700,700,700,700,700,700,700,
700,700,700,700,700,700,700,700,700,700,700,700,700,700,700,
700,700,700,700,700,700,700,700,700,700,700,700,700,700,700,
700,700,700,700,700,700,700,700,700,700,700,700,700,700,700,
700,700,700,700,700,700,700,700,700,700,700,700,700,700,700,
700,700,700,700,700,700,700,700,700,700,700,700,700,700,700,
700,700,700,700,700,700,700,700,700,700,700,700,700,700,700,
700,700,700,700,700,700,700,700,700,700,700,700,700,700,700,
700,700,700,700,700,700,700,700,700,700,700,700,700,700,700,
700,700,700,700,700,700,700,700,700,700,700,700,700,700,700,
700,700,700,700,700,700,700,700,700,700,700,700,700,700,700,
700,700,700,700,700,700,700,700,700,700,700,700,700,700,700,
700,700,700,700,700,700,700,700,700,700,700,700,700,700,700,
700,700,700,700,700,700,700,700,700,700,700,700,700,700,700,
700,700,700,700,700,700,700,700,700,700,700,700,700,700,700,
700,700,700,700,700,700,700,700,700,700,700,700,700,700,700,
700,700,700,700,700,700,700,700,700,700,700,700,700,700,700,
#,raw_col_delta_min,,,,,,,,,,,,,,
-700,-700,-700,-700,-700,-700,-700,-700,-700,-700,-700,-700,-700,-700,-700,
-700,-700,-700,-700,-700,-700,-700,-700,-700,-700,-700,-700,-700,-700,-700,
-700,-700,-700,-700,-700,-700,-700,-700,-700,-700,-700,-700,-700,-700,-700,
-700,-700,-700,-700,-700,-700,-700,-700,-700,-700,-700,-700,-700,-700,-700,
-700,-700,-700,-700,-700,-700,-700,-700,-700,-700,-700,-700,-700,-700,-700,
-700,-700,-700,-700,-700,-700,-700,-700,-700,-700,-700,-700,-700,-700,-700,
-700,-700,-700,-700,-700,-700,-700,-700,-700,-700,-700,-700,-700,-700,-700,
-700,-700,-700,-700,-700,-700,-700,-700,-700,-700,-700,-700,-700,-700,-700,
-700,-700,-700,-700,-700,-700,-700,-700,-700,-700,-700,-700,-700,-700,-700,
-700,-700,-700,-700,-700,-700,-700,-700,-700,-700,-700,-700,-700,-700,-700,
-700,-700,-700,-700,-700,-700,-700,-700,-700,-700,-700,-700,-700,-700,-700,
-700,-700,-700,-700,-700,-700,-700,-700,-700,-700,-700,-700,-700,-700,-700,
-700,-700,-700,-700,-700,-700,-700,-700,-700,-700,-700,-700,-700,-700,-700,
-700,-700,-700,-700,-700,-700,-700,-700,-700,-700,-700,-700,-700,-700,-700,
-700,-700,-700,-700,-700,-700,-700,-700,-700,-700,-700,-700,-700,-700,-700,
-700,-700,-700,-700,-700,-700,-700,-700,-700,-700,-700,-700,-700,-700,-700,
-700,-700,-700,-700,-700,-700,-700,-700,-700,-700,-700,-700,-700,-700,-700,
-700,-700,-700,-700,-700,-700,-700,-700,-700,-700,-700,-700,-700,-700,-700,
-700,-700,-700,-700,-700,-700,-700,-700,-700,-700,-700,-700,-700,-700,-700,
-700,-700,-700,-700,-700,-700,-700,-700,-700,-700,-700,-700,-700,-700,-700,
-700,-700,-700,-700,-700,-700,-700,-700,-700,-700,-700,-700,-700,-700,-700,
-700,-700,-700,-700,-700,-700,-700,-700,-700,-700,-700,-700,-700,-700,-700,
-700,-700,-700,-700,-700,-700,-700,-700,-700,-700,-700,-700,-700,-700,-700,
-700,-700,-700,-700,-700,-700,-700,-700,-700,-700,-700,-700,-700,-700,-700,
-700,-700,-700,-700,-700,-700,-700,-700,-700,-700,-700,-700,-700,-700,-700,
-700,-700,-700,-700,-700,-700,-700,-700,-700,-700,-700,-700,-700,-700,-700,
-700,-700,-700,-700,-700,-700,-700,-700,-700,-700,-700,-700,-700,-700,-700,
-700,-700,-700,-700,-700,-700,-700,-700,-700,-700,-700,-700,-700,-700,-700,
-700,-700,-700,-700,-700,-700,-700,-700,-700,-700,-700,-700,-700,-700,-700,
-700,-700,-700,-700,-700,-700,-700,-700,-700,-700,-700,-700,-700,-700,-700,
-700,-700,-700,-700,-700,-700,-700,-700,-700,-700,-700,-700,-700,-700,-700,
-700,-700,-700,-700,-700,-700,-700,-700,-700,-700,-700,-700,-700,-700,-700,
-700,-700,-700,-700,-700,-700,-700,-700,-700,-700,-700,-700,-700,-700,-700,
-700,-700,-700,-700,-700,-700,-700,-700,-700,-700,-700,-700,-700,-700,-700,
-700,-700,-700,-700,-700,-700,-700,-700,-700,-700,-700,-700,-700,-700,-700,
-700,-700,-700,-700,-700,-700,-700,-700,-700,-700,-700,-700,-700,-700,-700,
