{
    "resId":"nlu_synccr_SYNCHRONIZE_CONTACT_group_comp",
    "domain":"nlu",
    "district":"china",
    "deviceType":"common",
    "productName":"common",
    "romVersion":"common",
    "osVersion":"common",
    "version":"0x01010000",
    "releaseNotes":"",
    "digest":"",
    "fileName":"",
    "ResMetaData":[
        {
            "origin_id":"0x0000000002001110",
            "res_value":"",
            "res_path":"nlu/model/local/fst/zh/synccr/SYNCHRONIZE_CONTACT.far",
            "domain":"nlu",
            "data_version":"0x01010000",
            "encrypt_mode":"0"
        }
    ]
}