#,version,,,,,,,,,,,,,,,,,,,,,,,,,,,,,,,,,,,,,,,,,,,,,,,,,,,,,,,,
2022,5,14,10,,,,,,,,,,,,,,,,,,,,,,,,,,,,,,,,,,,,,,,,,,,,,,,,,,,,,,
#,row_col_num,,,,,,,,,,,,,,,,,,,,,,,,,,,,,,,,,,,,,,,,,,,,,,,,,,,,,,,,
40,18,,,,,,,,,,,,,,,,,,,,,,,,,,,,,,,,,,,,,,,,,,,,,,,,,,,,,,,,
#,noise,,,,,,,,,,,,,,,,,,,,,,,,,,,,,,,,,,,,,,,,,,,,,,,,,,,,,,,,
-500,500,,,,,,,,,,,,,,,,,,,,,,,,,,,,,,,,,,,,,,,,,,,,,,,,,,,,,,,,
#,raw_max,,,,,,,,,,,,,,,,,,,,,,,,,,,,,,,,,,,,,,,,,,,,,,,,,,,,,,,,
25000,22189,22209,22200,22159,22133,22097,22080,25000,25000,22088,22031,22036,22003,21972,21960,21947,25000,,,,,,,,,,,,,,,,,,,,,,,,,,,,,,,,,,,,,,,,
22340,22253,22219,22233,22220,22213,22202,22222,25000,25000,22252,22228,22261,22252,22244,22257,22250,22204,,,,,,,,,,,,,,,,,,,,,,,,,,,,,,,,,,,,,,,,
22480,19246,19227,19245,19241,19233,19220,19220,19300,19310,19252,19248,19272,19265,19250,19266,19254,22366,,,,,,,,,,,,,,,,,,,,,,,,,,,,,,,,,,,,,,,,
22425,19244,19233,19259,19256,19254,19243,19267,19243,19262,19213,19205,19235,19228,19215,19233,19211,22318,,,,,,,,,,,,,,,,,,,,,,,,,,,,,,,,,,,,,,,,
22487,19301,19284,19311,19313,19310,19300,19318,19308,19322,19269,19271,19298,19300,19278,19288,19272,22383,,,,,,,,,,,,,,,,,,,,,,,,,,,,,,,,,,,,,,,,
22483,19304,19285,19314,19319,19317,19309,19323,19311,19328,19276,19274,19306,19296,19296,19291,19279,22386,,,,,,,,,,,,,,,,,,,,,,,,,,,,,,,,,,,,,,,,
22512,19343,19327,19350,19356,19360,19350,19365,19353,19374,19319,19315,19345,19332,19323,19335,19331,22430,,,,,,,,,,,,,,,,,,,,,,,,,,,,,,,,,,,,,,,,
22456,19300,19288,19308,19318,19317,19310,19326,19318,19334,19276,19276,19305,19293,19283,19298,19285,22395,,,,,,,,,,,,,,,,,,,,,,,,,,,,,,,,,,,,,,,,
22432,19288,19275,19301,19306,19305,19304,19319,19305,19323,19267,19262,19291,19282,19274,19287,19276,22387,,,,,,,,,,,,,,,,,,,,,,,,,,,,,,,,,,,,,,,,
22350,19224,19215,19239,19248,19245,19244,19258,19298,19266,19402,19282,19232,19223,19217,19227,19215,22314,,,,,,,,,,,,,,,,,,,,,,,,,,,,,,,,,,,,,,,,
22393,19274,19269,19289,19297,19297,19291,19308,19296,19313,19262,19254,19280,19270,19262,19278,19263,22367,,,,,,,,,,,,,,,,,,,,,,,,,,,,,,,,,,,,,,,,
22367,19257,19243,19269,19276,19279,19275,19288,19323,19297,19332,19249,19259,19248,19245,19256,19243,22345,,,,,,,,,,,,,,,,,,,,,,,,,,,,,,,,,,,,,,,,
22348,19248,19236,19263,19270,19270,19270,19279,19265,19285,19233,19232,19254,19244,19232,19245,19235,22339,,,,,,,,,,,,,,,,,,,,,,,,,,,,,,,,,,,,,,,,
22350,19252,19243,19266,19272,19271,19271,19288,19422,19295,19305,19309,19305,19336,19352,19253,19235,22447,,,,,,,,,,,,,,,,,,,,,,,,,,,,,,,,,,,,,,,,
22311,19219,19215,19237,19243,19245,19245,19258,19243,19267,19211,19201,19220,19219,19209,19220,19207,22309,,,,,,,,,,,,,,,,,,,,,,,,,,,,,,,,,,,,,,,,
22263,19178,19167,19194,19197,19196,19198,19204,19278,19211,19302,19250,19175,19172,19165,19171,19161,22263,,,,,,,,,,,,,,,,,,,,,,,,,,,,,,,,,,,,,,,,
22245,19170,19162,19189,19187,19181,19188,19192,19183,19200,19172,19149,19167,19161,19155,19166,19155,22252,,,,,,,,,,,,,,,,,,,,,,,,,,,,,,,,,,,,,,,,
22206,19139,19135,19158,19158,19149,19150,19162,19153,19172,19119,19118,19139,19131,19131,19131,19122,22226,,,,,,,,,,,,,,,,,,,,,,,,,,,,,,,,,,,,,,,,
22162,19101,19094,19114,19114,19103,19110,19120,19116,19135,19081,19079,19109,19090,19088,19090,19077,22193,,,,,,,,,,,,,,,,,,,,,,,,,,,,,,,,,,,,,,,,
22133,19071,19062,19075,19077,19064,19075,19087,19088,19107,19044,19051,19064,19055,19055,19055,19045,22168,,,,,,,,,,,,,,,,,,,,,,,,,,,,,,,,,,,,,,,,
22176,19071,19057,19072,19074,19067,19076,19084,19087,19101,19041,19053,19063,19053,19051,19046,19040,22153,,,,,,,,,,,,,,,,,,,,,,,,,,,,,,,,,,,,,,,,
22122,19211,19064,19080,19094,19282,19101,19102,19087,19103,19048,19049,19063,19059,19046,19049,19048,22159,,,,,,,,,,,,,,,,,,,,,,,,,,,,,,,,,,,,,,,,
22110,19050,19084,19079,19074,19235,19079,19087,19090,19094,19035,19036,19050,19049,19042,19033,19036,22154,,,,,,,,,,,,,,,,,,,,,,,,,,,,,,,,,,,,,,,,
22054,18971,18966,18983,18986,18980,18994,18986,19064,19079,19018,19016,19036,19031,19027,19023,19019,22133,,,,,,,,,,,,,,,,,,,,,,,,,,,,,,,,,,,,,,,,
21988,18945,18941,18957,18964,18955,18968,18964,19038,19058,18994,18999,19007,19005,19003,18998,18997,22106,,,,,,,,,,,,,,,,,,,,,,,,,,,,,,,,,,,,,,,,
21953,18825,18859,18837,18837,18833,18851,18842,18923,18936,18867,18875,18881,18882,18888,18877,18879,21997,,,,,,,,,,,,,,,,,,,,,,,,,,,,,,,,,,,,,,,,
21888,18849,18851,18864,18862,18853,18880,18871,18946,18955,18892,18899,18907,18911,18911,18905,18908,22025,,,,,,,,,,,,,,,,,,,,,,,,,,,,,,,,,,,,,,,,
21868,18833,18838,18843,18837,18834,18860,18849,18925,18938,18871,18877,18882,18886,18882,18873,18882,21999,,,,,,,,,,,,,,,,,,,,,,,,,,,,,,,,,,,,,,,,
21984,18931,19139,18841,18873,18827,18929,18846,18916,18936,18869,18879,18881,18881,18882,18875,18884,21997,,,,,,,,,,,,,,,,,,,,,,,,,,,,,,,,,,,,,,,,
21799,18775,18772,18781,18784,18772,18793,18781,18863,18876,18810,18819,18819,18823,18833,18821,18830,21950,,,,,,,,,,,,,,,,,,,,,,,,,,,,,,,,,,,,,,,,
21784,18763,18755,18771,18776,18755,18778,18762,18847,18858,18786,18803,18803,18812,18817,18806,18819,21931,,,,,,,,,,,,,,,,,,,,,,,,,,,,,,,,,,,,,,,,
21745,18715,18742,18730,18721,18702,18726,18715,18797,18806,18737,18752,18759,18762,18767,18756,18771,21881,,,,,,,,,,,,,,,,,,,,,,,,,,,,,,,,,,,,,,,,
21686,18663,18652,18671,18669,18641,18669,18658,18737,18749,18673,18690,18695,18702,18713,18703,18719,21830,,,,,,,,,,,,,,,,,,,,,,,,,,,,,,,,,,,,,,,,
21632,18611,18609,18620,18620,18593,18625,18600,18685,18699,18624,18641,18643,18651,18668,18650,18665,21786,,,,,,,,,,,,,,,,,,,,,,,,,,,,,,,,,,,,,,,,
21622,18595,18590,18595,18595,18578,18595,18587,18661,18673,18602,18620,18619,18626,18637,18624,18639,21759,,,,,,,,,,,,,,,,,,,,,,,,,,,,,,,,,,,,,,,,
21637,18595,18587,18593,18590,18574,18594,18572,18655,18667,18598,18622,18612,18624,18630,18617,18635,21754,,,,,,,,,,,,,,,,,,,,,,,,,,,,,,,,,,,,,,,,
21660,18621,18612,18617,18613,18587,18616,18585,18676,18689,18620,18641,18637,18641,18650,18633,18650,21769,,,,,,,,,,,,,,,,,,,,,,,,,,,,,,,,,,,,,,,,
21785,18685,18625,18620,18616,18591,18622,18600,18684,18700,18628,18648,18642,18646,18648,18638,18656,21776,,,,,,,,,,,,,,,,,,,,,,,,,,,,,,,,,,,,,,,,
21541,18589,18557,18542,18538,18525,18550,18533,18612,18620,18548,18569,18557,18564,18565,18555,18574,21604,,,,,,,,,,,,,,,,,,,,,,,,,,,,,,,,,,,,,,,,
25000,23129,23097,23007,23003,22954,22968,22923,22972,22957,22906,22948,22940,22955,22950,22950,22923,25000,,,,,,,,,,,,,,,,,,,,,,,,,,,,,,,,,,,,,,,,
#,raw_min,,,,,,,,,,,,,,,,,,,,,,,,,,,,,,,,,,,,,,,,,,,,,,,,,,,,,,,,
5000,11948,11958,11953,11932,11918,11898,11889,5000,5000,11893,11862,11865,11848,11831,11825,11818,5000,,,,,,,,,,,,,,,,,,,,,,,,,,,,,,,,,,,,,,,,
12029,11982,11964,11972,11965,11960,11955,11965,5000,5000,11981,11969,11986,11981,11977,11984,11981,11956,,,,,,,,,,,,,,,,,,,,,,,,,,,,,,,,,,,,,,,,
12105,14979,14968,14978,14976,14972,14965,14965,15007,15013,14981,14979,14993,14988,14981,14989,14983,12043,,,,,,,,,,,,,,,,,,,,,,,,,,,,,,,,,,,,,,,,
12075,14977,14972,14986,14984,14983,14977,14990,14977,14987,14960,14956,14972,14969,14962,14972,14960,12017,,,,,,,,,,,,,,,,,,,,,,,,,,,,,,,,,,,,,,,,
12108,15008,14999,15014,15014,15013,15007,15017,15012,15019,14991,14992,15007,15007,14995,15001,14993,12052,,,,,,,,,,,,,,,,,,,,,,,,,,,,,,,,,,,,,,,,
12106,15009,15000,15015,15018,15016,15012,15020,15014,15023,14995,14993,15011,15005,15005,15002,14996,12054,,,,,,,,,,,,,,,,,,,,,,,,,,,,,,,,,,,,,,,,
12121,15030,15022,15035,15037,15040,15035,15042,15036,15047,15018,15016,15032,15025,15020,15026,15024,12077,,,,,,,,,,,,,,,,,,,,,,,,,,,,,,,,,,,,,,,,
12091,15007,15001,15012,15017,15016,15013,15021,15017,15026,14995,14995,15010,15004,14998,15007,15000,12058,,,,,,,,,,,,,,,,,,,,,,,,,,,,,,,,,,,,,,,,
12079,15001,14994,15008,15011,15010,15009,15018,15010,15020,14990,14987,15002,14998,14993,15000,14995,12054,,,,,,,,,,,,,,,,,,,,,,,,,,,,,,,,,,,,,,,,
12035,14967,14962,14974,14979,14978,14977,14985,15007,14989,15063,14998,14971,14966,14963,14968,14962,12015,,,,,,,,,,,,,,,,,,,,,,,,,,,,,,,,,,,,,,,,
12058,14993,14991,15002,15006,15006,15002,15012,15005,15014,14987,14983,14997,14991,14987,14995,14988,12044,,,,,,,,,,,,,,,,,,,,,,,,,,,,,,,,,,,,,,,,
12044,14984,14977,14991,14995,14996,14994,15001,15020,15006,15025,14980,14986,14979,14978,14984,14977,12032,,,,,,,,,,,,,,,,,,,,,,,,,,,,,,,,,,,,,,,,
12033,14979,14973,14988,14991,14991,14991,14996,14988,15000,14972,14971,14983,14977,14971,14978,14972,12028,,,,,,,,,,,,,,,,,,,,,,,,,,,,,,,,,,,,,,,,
12035,14981,14977,14989,14993,14992,14992,15001,15073,15005,15010,15012,15010,15027,15035,14982,14972,12086,,,,,,,,,,,,,,,,,,,,,,,,,,,,,,,,,,,,,,,,
12014,14964,14962,14974,14977,14978,14978,14985,14977,14990,14960,14954,14965,14964,14958,14965,14958,12012,,,,,,,,,,,,,,,,,,,,,,,,,,,,,,,,,,,,,,,,
11988,14942,14936,14951,14952,14951,14953,14956,14995,14960,15009,14981,14940,14939,14935,14938,14932,11988,,,,,,,,,,,,,,,,,,,,,,,,,,,,,,,,,,,,,,,,
11978,14937,14933,14948,14946,14944,14947,14949,14944,14953,14939,14926,14936,14932,14930,14935,14930,11981,,,,,,,,,,,,,,,,,,,,,,,,,,,,,,,,,,,,,,,,
11957,14921,14918,14931,14931,14926,14927,14933,14928,14939,14910,14909,14921,14916,14916,14916,14911,11967,,,,,,,,,,,,,,,,,,,,,,,,,,,,,,,,,,,,,,,,
11933,14900,14897,14907,14907,14902,14905,14911,14909,14918,14890,14888,14904,14895,14893,14895,14888,11950,,,,,,,,,,,,,,,,,,,,,,,,,,,,,,,,,,,,,,,,
11918,14884,14879,14886,14888,14881,14886,14893,14893,14904,14869,14874,14881,14876,14876,14876,14870,11937,,,,,,,,,,,,,,,,,,,,,,,,,,,,,,,,,,,,,,,,
11941,14884,14876,14885,14886,14882,14887,14891,14893,14900,14868,14874,14880,14874,14874,14871,14867,11928,,,,,,,,,,,,,,,,,,,,,,,,,,,,,,,,,,,,,,,,
11911,14960,14881,14889,14897,14998,14900,14901,14893,14902,14872,14872,14880,14878,14871,14872,14872,11932,,,,,,,,,,,,,,,,,,,,,,,,,,,,,,,,,,,,,,,,
11905,14873,14891,14888,14886,14972,14888,14893,14895,14897,14865,14865,14873,14872,14869,14864,14865,11929,,,,,,,,,,,,,,,,,,,,,,,,,,,,,,,,,,,,,,,,
11875,14830,14827,14837,14839,14835,14843,14839,14881,14888,14855,14855,14865,14862,14860,14858,14856,11918,,,,,,,,,,,,,,,,,,,,,,,,,,,,,,,,,,,,,,,,
11839,14816,14814,14823,14827,14822,14829,14827,14867,14877,14843,14846,14850,14848,14848,14845,14844,11903,,,,,,,,,,,,,,,,,,,,,,,,,,,,,,,,,,,,,,,,
11820,14752,14770,14758,14758,14756,14766,14761,14804,14811,14774,14778,14782,14783,14785,14780,14781,11844,,,,,,,,,,,,,,,,,,,,,,,,,,,,,,,,,,,,,,,,
11785,14764,14766,14773,14771,14767,14781,14776,14817,14822,14788,14792,14796,14798,14798,14795,14797,11860,,,,,,,,,,,,,,,,,,,,,,,,,,,,,,,,,,,,,,,,
11775,14756,14759,14762,14758,14757,14771,14764,14806,14813,14776,14780,14783,14785,14783,14778,14783,11846,,,,,,,,,,,,,,,,,,,,,,,,,,,,,,,,,,,,,,,,
11837,14809,14921,14760,14778,14753,14808,14763,14801,14811,14776,14781,14782,14782,14783,14778,14783,11844,,,,,,,,,,,,,,,,,,,,,,,,,,,,,,,,,,,,,,,,
11738,14725,14723,14728,14729,14723,14734,14728,14772,14779,14743,14748,14748,14750,14756,14750,14755,11819,,,,,,,,,,,,,,,,,,,,,,,,,,,,,,,,,,,,,,,,
11729,14718,14714,14722,14725,14714,14727,14718,14764,14769,14731,14740,14740,14745,14748,14741,14748,11809,,,,,,,,,,,,,,,,,,,,,,,,,,,,,,,,,,,,,,,,
11708,14692,14707,14701,14696,14685,14699,14692,14736,14741,14704,14713,14716,14718,14720,14715,14722,11782,,,,,,,,,,,,,,,,,,,,,,,,,,,,,,,,,,,,,,,,
11677,14664,14659,14669,14668,14652,14668,14662,14704,14711,14670,14679,14682,14685,14692,14686,14694,11755,,,,,,,,,,,,,,,,,,,,,,,,,,,,,,,,,,,,,,,,
11648,14636,14636,14641,14641,14627,14644,14631,14676,14684,14643,14652,14654,14658,14667,14657,14666,11731,,,,,,,,,,,,,,,,,,,,,,,,,,,,,,,,,,,,,,,,
11643,14628,14625,14628,14628,14619,14628,14624,14664,14670,14631,14641,14641,14645,14650,14643,14652,11716,,,,,,,,,,,,,,,,,,,,,,,,,,,,,,,,,,,,,,,,
11650,14628,14624,14627,14625,14617,14627,14615,14660,14666,14629,14643,14637,14643,14647,14640,14650,11713,,,,,,,,,,,,,,,,,,,,,,,,,,,,,,,,,,,,,,,,
11663,14642,14637,14640,14638,14624,14639,14622,14671,14678,14641,14652,14650,14652,14657,14648,14657,11722,,,,,,,,,,,,,,,,,,,,,,,,,,,,,,,,,,,,,,,,
11730,14676,14644,14641,14639,14626,14643,14631,14676,14685,14645,14657,14653,14655,14657,14651,14661,11725,,,,,,,,,,,,,,,,,,,,,,,,,,,,,,,,,,,,,,,,
11599,14624,14608,14599,14597,14590,14603,14594,14637,14641,14603,14614,14608,14611,14612,14606,14617,11633,,,,,,,,,,,,,,,,,,,,,,,,,,,,,,,,,,,,,,,,
5000,11564,11548,11503,11501,11477,11484,11461,11486,11478,11453,11474,11470,11477,11475,11475,11461,5000,,,,,,,,,,,,,,,,,,,,,,,,,,,,,,,,,,,,,,,,
#,raw_row_delta_max,,,,,,,,,,,,,,,,,,,,,,,,,,,,,,,,,,,,,,,,,,,,,,,,,,,,,,,,
7232,1654,1571,1579,1593,1603,1620,1648,1274,1274,1682,1686,1716,1724,1738,1785,1947,7447,,,,,,,,,,,,,,,,,,,,,,,,,,,,,,,,,,,,,,,,
1228,922,931,916,917,915,911,902,3005,3005,919,935,922,919,917,916,932,1378,,,,,,,,,,,,,,,,,,,,,,,,,,,,,,,,,,,,,,,,
1116,1128,1122,1111,1113,1112,1107,1105,1099,1091,1102,1118,1117,1115,1113,1138,1114,1150,,,,,,,,,,,,,,,,,,,,,,,,,,,,,,,,,,,,,,,,
1096,799,795,791,796,801,798,782,780,782,791,791,795,791,799,825,805,1130,,,,,,,,,,,,,,,,,,,,,,,,,,,,,,,,,,,,,,,,
1068,763,767,768,771,772,765,761,763,755,760,762,761,764,763,772,767,1081,,,,,,,,,,,,,,,,,,,,,,,,,,,,,,,,,,,,,,,,
1065,766,767,764,767,764,767,772,766,765,756,763,762,765,763,763,770,1105,,,,,,,,,,,,,,,,,,,,,,,,,,,,,,,,,,,,,,,,
1063,759,754,759,751,755,752,754,754,758,751,748,752,749,749,751,754,1053,,,,,,,,,,,,,,,,,,,,,,,,,,,,,,,,,,,,,,,,
1027,729,726,716,726,737,736,739,731,732,733,728,724,731,728,727,728,1025,,,,,,,,,,,,,,,,,,,,,,,,,,,,,,,,,,,,,,,,
1074,775,773,769,776,771,774,783,785,775,777,783,772,778,778,776,779,1081,,,,,,,,,,,,,,,,,,,,,,,,,,,,,,,,,,,,,,,,
1060,752,748,746,752,758,758,754,748,760,754,751,754,753,754,756,755,1071,,,,,,,,,,,,,,,,,,,,,,,,,,,,,,,,,,,,,,,,
1042,744,751,744,744,741,739,739,743,732,743,744,744,744,746,741,741,1065,,,,,,,,,,,,,,,,,,,,,,,,,,,,,,,,,,,,,,,,
1024,711,715,719,720,715,715,718,720,719,726,721,715,715,710,716,716,1020,,,,,,,,,,,,,,,,,,,,,,,,,,,,,,,,,,,,,,,,
1052,737,737,741,737,731,734,734,734,737,735,733,736,744,736,736,725,1031,,,,,,,,,,,,,,,,,,,,,,,,,,,,,,,,,,,,,,,,
1044,734,733,730,732,729,727,725,729,729,728,725,731,725,729,728,728,1029,,,,,,,,,,,,,,,,,,,,,,,,,,,,,,,,,,,,,,,,
1047,750,741,742,741,746,749,752,747,756,749,748,744,752,754,748,745,1057,,,,,,,,,,,,,,,,,,,,,,,,,,,,,,,,,,,,,,,,
1049,740,746,753,746,749,750,750,750,747,752,749,748,753,752,749,744,1051,,,,,,,,,,,,,,,,,,,,,,,,,,,,,,,,,,,,,,,,
1064,758,759,756,755,758,754,754,752,749,758,753,753,752,755,751,757,1067,,,,,,,,,,,,,,,,,,,,,,,,,,,,,,,,,,,,,,,,
1021,715,715,717,718,722,713,715,711,711,711,713,715,716,714,724,716,1022,,,,,,,,,,,,,,,,,,,,,,,,,,,,,,,,,,,,,,,,
1123,823,834,829,828,831,833,833,826,828,830,826,823,823,821,823,819,1128,,,,,,,,,,,,,,,,,,,,,,,,,,,,,,,,,,,,,,,,
1032,735,726,729,735,733,740,736,733,724,733,738,732,721,722,724,734,1041,,,,,,,,,,,,,,,,,,,,,,,,,,,,,,,,,,,,,,,,
1102,800,798,803,800,801,792,805,794,794,793,795,796,801,810,799,802,1106,,,,,,,,,,,,,,,,,,,,,,,,,,,,,,,,,,,,,,,,
1075,782,782,777,778,774,776,774,779,776,784,777,779,776,773,784,780,1090,,,,,,,,,,,,,,,,,,,,,,,,,,,,,,,,,,,,,,,,
1053,750,748,742,743,746,747,749,743,739,735,745,747,745,750,749,752,1060,,,,,,,,,,,,,,,,,,,,,,,,,,,,,,,,,,,,,,,,
982,677,678,682,685,697,750,680,680,681,685,685,677,679,675,680,679,997,,,,,,,,,,,,,,,,,,,,,,,,,,,,,,,,,,,,,,,,
1062,765,764,758,763,756,698,758,757,758,759,758,766,762,765,764,762,1057,,,,,,,,,,,,,,,,,,,,,,,,,,,,,,,,,,,,,,,,
1055,753,751,752,750,756,763,759,755,759,761,759,761,758,759,758,753,1047,,,,,,,,,,,,,,,,,,,,,,,,,,,,,,,,,,,,,,,,
1026,728,729,723,723,719,719,723,726,718,722,726,727,726,722,721,731,1030,,,,,,,,,,,,,,,,,,,,,,,,,,,,,,,,,,,,,,,,
1128,835,831,826,830,826,828,828,827,825,823,822,827,836,834,826,826,1139,,,,,,,,,,,,,,,,,,,,,,,,,,,,,,,,,,,,,,,,
1085,764,761,756,757,755,761,768,758,755,755,763,762,756,757,757,763,1083,,,,,,,,,,,,,,,,,,,,,,,,,,,,,,,,,,,,,,,,
1100,749,752,753,748,756,755,826,772,753,745,746,753,758,753,755,748,1214,,,,,,,,,,,,,,,,,,,,,,,,,,,,,,,,,,,,,,,,
1149,752,782,757,819,825,798,672,724,738,742,738,740,742,736,743,838,878,,,,,,,,,,,,,,,,,,,,,,,,,,,,,,,,,,,,,,,,
980,758,724,752,681,684,708,748,747,750,751,757,753,755,760,761,675,1065,,,,,,,,,,,,,,,,,,,,,,,,,,,,,,,,,,,,,,,,
1046,741,745,741,746,730,727,729,732,733,735,737,733,730,732,732,734,1045,,,,,,,,,,,,,,,,,,,,,,,,,,,,,,,,,,,,,,,,
1102,814,815,810,812,814,815,821,807,804,805,800,801,802,808,813,807,1111,,,,,,,,,,,,,,,,,,,,,,,,,,,,,,,,,,,,,,,,
1066,776,771,767,767,765,758,827,770,746,846,762,846,765,771,765,763,1161,,,,,,,,,,,,,,,,,,,,,,,,,,,,,,,,,,,,,,,,
1098,856,798,803,812,804,794,810,893,797,743,906,911,786,885,799,797,1070,,,,,,,,,,,,,,,,,,,,,,,,,,,,,,,,,,,,,,,,
1205,795,865,867,868,888,909,785,800,871,861,766,861,857,764,849,857,1080,,,,,,,,,,,,,,,,,,,,,,,,,,,,,,,,,,,,,,,,
1093,895,893,902,913,945,888,1029,1109,912,1034,907,906,911,898,898,903,1104,,,,,,,,,,,,,,,,,,,,,,,,,,,,,,,,,,,,,,,,
1093,1634,1631,1555,1637,1626,1623,1539,1437,1552,1472,1511,1552,1524,1503,1528,1538,1538,,,,,,,,,,,,,,,,,,,,,,,,,,,,,,,,,,,,,,,,
#,raw_row_delta_min,,,,,,,,,,,,,,,,,,,,,,,,,,,,,,,,,,,,,,,,,,,,,,,,,,,,,,,,
-926,-1200,-1206,-1198,-1185,-1159,-1135,-1136,-1245,-1245,-1052,-1036,-1024,-1008,-979,-947,-867,-788,,,,,,,,,,,,,,,,,,,,,,,,,,,,,,,,,,,,,,,,
-926,-1183,-1189,-1182,-1185,-1185,-1187,-1196,-1245,-1245,-1213,-1198,-1194,-1186,-1181,-1179,-1182,-788,,,,,,,,,,,,,,,,,,,,,,,,,,,,,,,,,,,,,,,,
-1085,-787,-786,-777,-780,-777,-782,-794,-838,-825,-790,-773,-784,-782,-780,-805,-784,-1080,,,,,,,,,,,,,,,,,,,,,,,,,,,,,,,,,,,,,,,,
-1100,-784,-783,-783,-787,-790,-791,-789,-794,-795,-798,-801,-787,-782,-789,-813,-794,-1107,,,,,,,,,,,,,,,,,,,,,,,,,,,,,,,,,,,,,,,,
-1092,-775,-780,-782,-787,-788,-782,-785,-790,-784,-787,-787,-778,-782,-784,-792,-785,-1093,,,,,,,,,,,,,,,,,,,,,,,,,,,,,,,,,,,,,,,,
-1063,-757,-756,-752,-755,-753,-754,-760,-758,-757,-750,-755,-752,-754,-756,-756,-763,-1084,,,,,,,,,,,,,,,,,,,,,,,,,,,,,,,,,,,,,,,,
-1063,-750,-741,-731,-734,-735,-733,-736,-735,-741,-731,-732,-736,-733,-735,-739,-743,-1036,,,,,,,,,,,,,,,,,,,,,,,,,,,,,,,,,,,,,,,,
-1076,-763,-760,-761,-753,-751,-762,-766,-757,-759,-761,-756,-753,-761,-758,-759,-761,-1051,,,,,,,,,,,,,,,,,,,,,,,,,,,,,,,,,,,,,,,,
-1124,-808,-805,-799,-804,-809,-798,-805,-797,-800,-803,-810,-800,-804,-806,-804,-810,-1114,,,,,,,,,,,,,,,,,,,,,,,,,,,,,,,,,,,,,,,,
-1089,-764,-759,-753,-760,-765,-764,-760,-765,-752,-762,-757,-761,-760,-760,-766,-768,-1082,,,,,,,,,,,,,,,,,,,,,,,,,,,,,,,,,,,,,,,,
-1157,-844,-849,-842,-838,-837,-837,-836,-839,-842,-837,-840,-840,-840,-845,-843,-846,-1176,,,,,,,,,,,,,,,,,,,,,,,,,,,,,,,,,,,,,,,,
-1066,-754,-756,-760,-759,-757,-758,-761,-763,-760,-766,-760,-752,-753,-752,-761,-764,-1076,,,,,,,,,,,,,,,,,,,,,,,,,,,,,,,,,,,,,,,,
-1045,-729,-729,-733,-728,-722,-726,-727,-725,-729,-727,-722,-727,-726,-731,-729,-727,-1039,,,,,,,,,,,,,,,,,,,,,,,,,,,,,,,,,,,,,,,,
-1093,-772,-772,-771,-764,-774,-772,-770,-773,-773,-771,-766,-772,-780,-774,-773,-775,-1077,,,,,,,,,,,,,,,,,,,,,,,,,,,,,,,,,,,,,,,,
-1139,-816,-818,-823,-833,-828,-832,-834,-829,-838,-831,-828,-830,-835,-833,-830,-828,-1138,,,,,,,,,,,,,,,,,,,,,,,,,,,,,,,,,,,,,,,,
-1112,-807,-802,-807,-802,-806,-804,-806,-809,-803,-808,-807,-807,-812,-810,-796,-804,-1103,,,,,,,,,,,,,,,,,,,,,,,,,,,,,,,,,,,,,,,,
-1139,-817,-819,-816,-813,-818,-815,-816,-815,-812,-820,-821,-818,-816,-820,-827,-819,-1126,,,,,,,,,,,,,,,,,,,,,,,,,,,,,,,,,,,,,,,,
-1118,-804,-802,-802,-804,-808,-801,-805,-802,-803,-805,-807,-807,-807,-806,-816,-805,-1110,,,,,,,,,,,,,,,,,,,,,,,,,,,,,,,,,,,,,,,,
-1068,-761,-760,-767,-766,-769,-770,-771,-767,-769,-773,-768,-768,-766,-765,-765,-756,-1061,,,,,,,,,,,,,,,,,,,,,,,,,,,,,,,,,,,,,,,,
-1051,-742,-742,-737,-743,-743,-738,-746,-743,-737,-744,-750,-743,-732,-734,-735,-744,-1047,,,,,,,,,,,,,,,,,,,,,,,,,,,,,,,,,,,,,,,,
-1090,-777,-776,-780,-778,-780,-785,-787,-775,-774,-773,-772,-777,-783,-775,-778,-782,-1081,,,,,,,,,,,,,,,,,,,,,,,,,,,,,,,,,,,,,,,,
-1097,-795,-796,-793,-795,-791,-792,-793,-797,-795,-792,-797,-798,-797,-802,-800,-798,-1101,,,,,,,,,,,,,,,,,,,,,,,,,,,,,,,,,,,,,,,,
-1130,-812,-810,-805,-806,-811,-813,-814,-809,-805,-812,-812,-813,-810,-817,-813,-815,-1121,,,,,,,,,,,,,,,,,,,,,,,,,,,,,,,,,,,,,,,,
-1089,-781,-777,-782,-784,-777,-716,-785,-785,-783,-787,-787,-782,-784,-779,-781,-779,-1107,,,,,,,,,,,,,,,,,,,,,,,,,,,,,,,,,,,,,,,,
-1053,-744,-742,-737,-743,-759,-813,-739,-738,-739,-739,-741,-747,-743,-745,-746,-743,-1042,,,,,,,,,,,,,,,,,,,,,,,,,,,,,,,,,,,,,,,,
-1087,-774,-771,-773,-772,-776,-787,-780,-777,-780,-780,-780,-784,-779,-781,-781,-774,-1062,,,,,,,,,,,,,,,,,,,,,,,,,,,,,,,,,,,,,,,,
-1104,-795,-798,-793,-790,-788,-787,-792,-794,-785,-789,-793,-796,-796,-790,-787,-797,-1092,,,,,,,,,,,,,,,,,,,,,,,,,,,,,,,,,,,,,,,,
-1131,-830,-827,-821,-826,-823,-824,-824,-822,-820,-817,-818,-823,-834,-832,-822,-819,-1130,,,,,,,,,,,,,,,,,,,,,,,,,,,,,,,,,,,,,,,,
-1164,-831,-825,-828,-828,-828,-832,-834,-827,-825,-824,-833,-833,-830,-831,-831,-834,-1131,,,,,,,,,,,,,,,,,,,,,,,,,,,,,,,,,,,,,,,,
-1098,-754,-756,-760,-754,-761,-762,-683,-745,-758,-751,-751,-762,-769,-765,-765,-755,-920,,,,,,,,,,,,,,,,,,,,,,,,,,,,,,,,,,,,,,,,
-1006,-788,-744,-774,-719,-704,-723,-862,-794,-778,-785,-781,-782,-782,-779,-785,-701,-1243,,,,,,,,,,,,,,,,,,,,,,,,,,,,,,,,,,,,,,,,
-1127,-730,-772,-735,-801,-807,-778,-727,-726,-728,-730,-737,-731,-737,-738,-740,-830,-1040,,,,,,,,,,,,,,,,,,,,,,,,,,,,,,,,,,,,,,,,
-1065,-772,-778,-777,-775,-786,-790,-773,-775,-774,-777,-776,-772,-769,-770,-771,-772,-1077,,,,,,,,,,,,,,,,,,,,,,,,,,,,,,,,,,,,,,,,
-1130,-830,-833,-828,-824,-834,-836,-820,-833,-833,-829,-824,-825,-824,-829,-833,-830,-1129,,,,,,,,,,,,,,,,,,,,,,,,,,,,,,,,,,,,,,,,
-1091,-796,-795,-793,-790,-787,-791,-748,-799,-787,-743,-795,-886,-796,-802,-799,-797,-1015,,,,,,,,,,,,,,,,,,,,,,,,,,,,,,,,,,,,,,,,
-1104,-740,-800,-800,-810,-800,-795,-774,-701,-805,-871,-707,-912,-796,-716,-809,-810,-1139,,,,,,,,,,,,,,,,,,,,,,,,,,,,,,,,,,,,,,,,
-1138,-845,-787,-787,-786,-800,-745,-868,-867,-769,-783,-888,-785,-783,-872,-780,-793,-1182,,,,,,,,,,,,,,,,,,,,,,,,,,,,,,,,,,,,,,,,
-4692,-840,-906,-923,-866,-881,-895,-984,-1129,-955,-1062,-999,-967,-977,-997,-1006,-940,-4555,,,,,,,,,,,,,,,,,,,,,,,,,,,,,,,,,,,,,,,,
-4692,-1140,-1206,-1223,-1166,-1181,-1195,-1284,-1429,-1255,-1362,-1299,-1267,-1277,-1297,-1306,-1240,-4555,,,,,,,,,,,,,,,,,,,,,,,,,,,,,,,,,,,,,,,,
#,raw_col_delta_max,,,,,,,,,,,,,,,,,,,,,,,,,,,,,,,,,,,,,,,,,,,,,,,,,,,,,,,,
6941,1041,976,925,923,947,982,893,3000,3000,920,938,927,917,917,883,797,,,,,,,,,,,,,,,,,,,,,,,,,,,,,,,,,,,,,,,,,
1058,953,951,928,930,960,987,1047,3000,3000,926,945,934,929,946,979,797,,,,,,,,,,,,,,,,,,,,,,,,,,,,,,,,,,,,,,,,,
734,633,640,621,633,645,669,758,659,546,630,645,631,628,648,661,1202,,,,,,,,,,,,,,,,,,,,,,,,,,,,,,,,,,,,,,,,,
733,626,626,611,628,636,652,721,646,548,647,644,630,627,697,705,1220,,,,,,,,,,,,,,,,,,,,,,,,,,,,,,,,,,,,,,,,,
726,617,624,606,632,633,645,716,643,539,640,640,624,627,637,651,1232,,,,,,,,,,,,,,,,,,,,,,,,,,,,,,,,,,,,,,,,,
712,620,621,605,636,633,628,716,638,537,629,629,624,620,634,644,1221,,,,,,,,,,,,,,,,,,,,,,,,,,,,,,,,,,,,,,,,,
715,631,626,606,630,628,634,710,639,541,629,630,638,616,632,638,1214,,,,,,,,,,,,,,,,,,,,,,,,,,,,,,,,,,,,,,,,,
717,619,637,603,631,626,648,715,641,538,629,641,630,619,639,649,1217,,,,,,,,,,,,,,,,,,,,,,,,,,,,,,,,,,,,,,,,,
723,622,628,612,637,620,643,717,651,535,642,634,624,620,627,643,1222,,,,,,,,,,,,,,,,,,,,,,,,,,,,,,,,,,,,,,,,,
729,619,631,604,625,627,632,716,639,539,633,639,626,620,621,633,1224,,,,,,,,,,,,,,,,,,,,,,,,,,,,,,,,,,,,,,,,,
735,628,631,610,626,626,637,698,643,528,635,641,625,611,619,632,1232,,,,,,,,,,,,,,,,,,,,,,,,,,,,,,,,,,,,,,,,,
732,621,622,611,629,624,632,701,633,535,635,630,626,611,619,633,1217,,,,,,,,,,,,,,,,,,,,,,,,,,,,,,,,,,,,,,,,,
732,620,620,613,626,625,638,706,634,538,629,629,624,610,624,630,1201,,,,,,,,,,,,,,,,,,,,,,,,,,,,,,,,,,,,,,,,,
723,626,627,613,623,621,643,717,637,544,627,631,632,606,623,631,1189,,,,,,,,,,,,,,,,,,,,,,,,,,,,,,,,,,,,,,,,,
725,616,627,616,621,618,643,714,631,545,627,637,619,615,613,634,1184,,,,,,,,,,,,,,,,,,,,,,,,,,,,,,,,,,,,,,,,,
738,613,621,608,624,618,633,713,626,543,631,631,619,621,622,635,1185,,,,,,,,,,,,,,,,,,,,,,,,,,,,,,,,,,,,,,,,,
734,623,623,609,620,618,628,706,634,546,634,629,618,614,628,619,1192,,,,,,,,,,,,,,,,,,,,,,,,,,,,,,,,,,,,,,,,,
741,615,621,613,613,624,631,705,635,548,630,624,611,620,619,633,1201,,,,,,,,,,,,,,,,,,,,,,,,,,,,,,,,,,,,,,,,,
750,621,625,621,621,623,629,712,630,543,639,631,624,618,620,632,1204,,,,,,,,,,,,,,,,,,,,,,,,,,,,,,,,,,,,,,,,,
748,639,619,618,618,624,627,717,635,541,637,634,627,611,618,642,1211,,,,,,,,,,,,,,,,,,,,,,,,,,,,,,,,,,,,,,,,,
745,628,624,614,627,632,631,712,641,542,633,641,629,615,611,638,1197,,,,,,,,,,,,,,,,,,,,,,,,,,,,,,,,,,,,,,,,,
758,622,624,610,621,619,639,708,631,537,641,635,625,618,610,624,1200,,,,,,,,,,,,,,,,,,,,,,,,,,,,,,,,,,,,,,,,,
766,622,623,610,618,622,630,704,631,542,629,635,620,616,615,623,1205,,,,,,,,,,,,,,,,,,,,,,,,,,,,,,,,,,,,,,,,,
780,629,622,604,617,617,632,706,632,533,635,628,619,614,620,632,1216,,,,,,,,,,,,,,,,,,,,,,,,,,,,,,,,,,,,,,,,,
784,639,622,607,628,681,563,716,635,531,635,627,622,618,620,649,1212,,,,,,,,,,,,,,,,,,,,,,,,,,,,,,,,,,,,,,,,,
791,627,624,603,625,624,626,717,634,537,616,627,623,615,624,645,1214,,,,,,,,,,,,,,,,,,,,,,,,,,,,,,,,,,,,,,,,,
807,628,624,600,626,619,630,718,630,541,622,634,625,618,637,642,1205,,,,,,,,,,,,,,,,,,,,,,,,,,,,,,,,,,,,,,,,,
820,622,624,606,618,620,628,709,623,545,631,622,624,621,633,631,1206,,,,,,,,,,,,,,,,,,,,,,,,,,,,,,,,,,,,,,,,,
836,630,625,606,615,623,626,709,636,548,630,633,622,626,624,634,1205,,,,,,,,,,,,,,,,,,,,,,,,,,,,,,,,,,,,,,,,,
835,626,618,606,617,617,629,709,637,553,624,637,622,622,628,636,1220,,,,,,,,,,,,,,,,,,,,,,,,,,,,,,,,,,,,,,,,,
832,626,621,610,616,617,713,649,623,539,634,640,625,612,636,634,1377,,,,,,,,,,,,,,,,,,,,,,,,,,,,,,,,,,,,,,,,,
753,674,594,679,640,607,575,711,639,542,640,645,628,615,638,741,1147,,,,,,,,,,,,,,,,,,,,,,,,,,,,,,,,,,,,,,,,,
838,638,630,608,635,629,620,708,640,542,645,646,619,621,631,653,1249,,,,,,,,,,,,,,,,,,,,,,,,,,,,,,,,,,,,,,,,,
835,639,625,608,624,630,630,717,643,544,646,641,621,625,633,650,1258,,,,,,,,,,,,,,,,,,,,,,,,,,,,,,,,,,,,,,,,,
855,635,629,613,618,632,645,713,645,552,650,640,625,627,634,647,1267,,,,,,,,,,,,,,,,,,,,,,,,,,,,,,,,,,,,,,,,,
864,640,635,619,627,629,717,669,643,668,605,794,816,641,639,655,1364,,,,,,,,,,,,,,,,,,,,,,,,,,,,,,,,,,,,,,,,,
947,590,648,629,639,629,738,732,557,575,747,549,644,740,560,655,1330,,,,,,,,,,,,,,,,,,,,,,,,,,,,,,,,,,,,,,,,,
915,669,651,631,721,748,612,764,652,567,653,646,639,650,646,665,1248,,,,,,,,,,,,,,,,,,,,,,,,,,,,,,,,,,,,,,,,,
1021,692,673,645,644,656,782,1029,568,710,643,652,646,645,652,690,1070,,,,,,,,,,,,,,,,,,,,,,,,,,,,,,,,,,,,,,,,,
4686,1013,981,1016,926,940,939,1034,918,834,926,984,920,923,1003,1082,1082,,,,,,,,,,,,,,,,,,,,,,,,,,,,,,,,,,,,,,,,,
#,raw_col_delta_min,,,,,,,,,,,,,,,,,,,,,,,,,,,,,,,,,,,,,,,,,,,,,,,,,,,,,,,,
-1125,-962,-974,-966,-957,-971,-948,-2679,-2679,-2679,-988,-969,-954,-961,-989,-1111,-7070,,,,,,,,,,,,,,,,,,,,,,,,,,,,,,,,,,,,,,,,,
-1125,-962,-933,-942,-927,-942,-926,-3006,-3006,-3006,-974,-934,-937,-929,-939,-965,-1275,,,,,,,,,,,,,,,,,,,,,,,,,,,,,,,,,,,,,,,,,
-1364,-640,-629,-638,-632,-634,-625,-541,-641,-766,-647,-643,-629,-625,-640,-634,-840,,,,,,,,,,,,,,,,,,,,,,,,,,,,,,,,,,,,,,,,,
-1354,-637,-617,-629,-625,-633,-625,-554,-623,-722,-631,-652,-629,-623,-689,-680,-819,,,,,,,,,,,,,,,,,,,,,,,,,,,,,,,,,,,,,,,,,
-1328,-632,-618,-623,-627,-635,-630,-557,-619,-708,-625,-632,-622,-622,-627,-629,-819,,,,,,,,,,,,,,,,,,,,,,,,,,,,,,,,,,,,,,,,,
-1301,-636,-617,-623,-630,-636,-621,-560,-615,-704,-613,-613,-623,-619,-624,-619,-802,,,,,,,,,,,,,,,,,,,,,,,,,,,,,,,,,,,,,,,,,
-1298,-644,-622,-625,-625,-631,-628,-558,-616,-710,-612,-612,-636,-618,-622,-612,-781,,,,,,,,,,,,,,,,,,,,,,,,,,,,,,,,,,,,,,,,,
-1291,-629,-618,-632,-622,-629,-644,-561,-619,-705,-614,-623,-628,-623,-632,-624,-779,,,,,,,,,,,,,,,,,,,,,,,,,,,,,,,,,,,,,,,,,
-1283,-631,-620,-623,-615,-635,-639,-562,-629,-704,-627,-618,-622,-625,-621,-619,-777,,,,,,,,,,,,,,,,,,,,,,,,,,,,,,,,,,,,,,,,,
-1273,-627,-621,-614,-612,-629,-627,-551,-632,-708,-619,-624,-622,-626,-614,-612,-781,,,,,,,,,,,,,,,,,,,,,,,,,,,,,,,,,,,,,,,,,
-1262,-634,-616,-621,-612,-628,-631,-545,-610,-712,-620,-628,-621,-616,-617,-614,-787,,,,,,,,,,,,,,,,,,,,,,,,,,,,,,,,,,,,,,,,,
-1245,-624,-607,-619,-615,-628,-625,-547,-614,-704,-622,-616,-622,-619,-619,-620,-777,,,,,,,,,,,,,,,,,,,,,,,,,,,,,,,,,,,,,,,,,
-1246,-621,-606,-619,-615,-630,-631,-553,-613,-706,-614,-613,-621,-623,-627,-619,-769,,,,,,,,,,,,,,,,,,,,,,,,,,,,,,,,,,,,,,,,,
-1236,-627,-612,-619,-612,-627,-637,-562,-617,-712,-610,-616,-621,-631,-624,-628,-764,,,,,,,,,,,,,,,,,,,,,,,,,,,,,,,,,,,,,,,,,
-1226,-619,-613,-613,-623,-625,-637,-558,-611,-712,-607,-622,-622,-630,-615,-633,-760,,,,,,,,,,,,,,,,,,,,,,,,,,,,,,,,,,,,,,,,,
-1213,-626,-611,-616,-617,-626,-625,-557,-606,-711,-609,-621,-619,-633,-626,-635,-760,,,,,,,,,,,,,,,,,,,,,,,,,,,,,,,,,,,,,,,,,
-1215,-624,-612,-620,-612,-623,-621,-554,-611,-714,-614,-621,-618,-624,-621,-633,-759,,,,,,,,,,,,,,,,,,,,,,,,,,,,,,,,,,,,,,,,,
-1206,-616,-609,-623,-607,-631,-625,-553,-611,-715,-616,-613,-611,-631,-622,-633,-765,,,,,,,,,,,,,,,,,,,,,,,,,,,,,,,,,,,,,,,,,
-1207,-620,-613,-631,-614,-632,-625,-562,-607,-711,-626,-617,-623,-629,-624,-628,-767,,,,,,,,,,,,,,,,,,,,,,,,,,,,,,,,,,,,,,,,,
-1198,-625,-619,-629,-611,-633,-626,-569,-613,-711,-623,-623,-624,-623,-619,-633,-770,,,,,,,,,,,,,,,,,,,,,,,,,,,,,,,,,,,,,,,,,
-1183,-623,-615,-626,-621,-629,-641,-564,-622,-711,-620,-628,-627,-628,-610,-628,-753,,,,,,,,,,,,,,,,,,,,,,,,,,,,,,,,,,,,,,,,,
-1186,-618,-614,-622,-617,-630,-637,-559,-611,-705,-626,-626,-625,-614,-623,-616,-751,,,,,,,,,,,,,,,,,,,,,,,,,,,,,,,,,,,,,,,,,
-1185,-619,-615,-625,-614,-631,-631,-553,-612,-700,-626,-625,-621,-621,-614,-616,-751,,,,,,,,,,,,,,,,,,,,,,,,,,,,,,,,,,,,,,,,,
-1183,-626,-614,-619,-614,-628,-633,-556,-613,-702,-621,-618,-617,-621,-616,-625,-760,,,,,,,,,,,,,,,,,,,,,,,,,,,,,,,,,,,,,,,,,
-1184,-632,-615,-621,-606,-579,-702,-565,-613,-700,-621,-620,-621,-624,-613,-640,-767,,,,,,,,,,,,,,,,,,,,,,,,,,,,,,,,,,,,,,,,,
-1180,-619,-617,-618,-627,-633,-631,-566,-612,-706,-605,-618,-622,-620,-619,-636,-773,,,,,,,,,,,,,,,,,,,,,,,,,,,,,,,,,,,,,,,,,
-1185,-619,-618,-617,-626,-631,-633,-569,-607,-708,-613,-627,-622,-624,-633,-633,-757,,,,,,,,,,,,,,,,,,,,,,,,,,,,,,,,,,,,,,,,,
-1187,-615,-618,-619,-621,-632,-631,-560,-598,-713,-622,-616,-621,-625,-628,-621,-754,,,,,,,,,,,,,,,,,,,,,,,,,,,,,,,,,,,,,,,,,
-1196,-624,-618,-620,-618,-634,-628,-559,-610,-715,-622,-627,-621,-630,-617,-620,-750,,,,,,,,,,,,,,,,,,,,,,,,,,,,,,,,,,,,,,,,,
-1182,-618,-618,-620,-621,-627,-627,-561,-614,-719,-618,-633,-623,-626,-620,-621,-741,,,,,,,,,,,,,,,,,,,,,,,,,,,,,,,,,,,,,,,,,
-1186,-617,-624,-622,-619,-628,-561,-618,-631,-707,-626,-640,-629,-617,-625,-616,-596,,,,,,,,,,,,,,,,,,,,,,,,,,,,,,,,,,,,,,,,,
-1285,-591,-653,-574,-623,-664,-688,-559,-617,-711,-632,-645,-630,-623,-626,-544,-870,,,,,,,,,,,,,,,,,,,,,,,,,,,,,,,,,,,,,,,,,
-1193,-631,-626,-639,-621,-634,-642,-556,-618,-711,-638,-645,-625,-624,-620,-633,-791,,,,,,,,,,,,,,,,,,,,,,,,,,,,,,,,,,,,,,,,,
-1202,-635,-622,-634,-637,-642,-632,-562,-620,-714,-636,-639,-627,-627,-623,-630,-794,,,,,,,,,,,,,,,,,,,,,,,,,,,,,,,,,,,,,,,,,
-1209,-634,-627,-632,-639,-645,-625,-585,-624,-718,-639,-639,-629,-628,-623,-630,-798,,,,,,,,,,,,,,,,,,,,,,,,,,,,,,,,,,,,,,,,,
-1213,-642,-634,-636,-646,-653,-585,-650,-634,-690,-731,-801,-811,-642,-630,-638,-715,,,,,,,,,,,,,,,,,,,,,,,,,,,,,,,,,,,,,,,,,
-1173,-710,-642,-647,-655,-659,-569,-558,-747,-718,-547,-755,-648,-562,-731,-641,-737,,,,,,,,,,,,,,,,,,,,,,,,,,,,,,,,,,,,,,,,,
-1259,-662,-644,-645,-731,-703,-690,-575,-673,-734,-653,-653,-646,-654,-640,-655,-822,,,,,,,,,,,,,,,,,,,,,,,,,,,,,,,,,,,,,,,,,
-1117,-681,-657,-652,-654,-671,-636,-660,-920,-732,-799,-664,-654,-659,-658,-692,-963,,,,,,,,,,,,,,,,,,,,,,,,,,,,,,,,,,,,,,,,,
-1117,-1071,-1056,-885,-960,-972,-966,-914,-980,-1043,-978,-924,-966,-977,-993,-1008,-4463,,,,,,,,,,,,,,,,,,,,,,,,,,,,,,,,,,,,,,,,,
#,line_max,,,,,,,,,,,,,,,,,,,,,,,,,,,,,,,,,,,,,,,,,,,,,,,,,,,,,,,,
42547,41007,40978,41001,41175,41652,42112,41875,42409,43611,42736,42256,42757,42859,42634,42201,42947,43417,43063,41375,40856,41117,41605,42196,42385,42277,42696,43029,42885,43705,43492,43207,43830,43809,43116,43506,43786,43585,43214,43528,43686,43258,43903,43012,42983,43085,43678,43102,43268,44091,44136,43361,43192,42654,42612,42781,42564,42960
#,line_min,,,,,,,,,,,,,,,,,,,,,,,,,,,,,,,,,,,,,,,,,,,,,,,,,,,,,,,,
12265,14673,14534,14244,13941,13668,13018,13186,12354,11622,12182,12544,12149,12200,12151,12527,11982,10948,10955,14170,15015,14317,13822,12990,12827,13007,12177,12044,12134,11629,11716,11783,11400,10970,11910,11513,11159,11669,11711,11159,11095,11402,11315,11585,11436,11441,11100,11622,11427,10976,10817,10817,11112,11815,11863,11418,11274,10337
#,full_max,,,,,,,,,,,,,,,,,,,,,,,,,,,,,,,,,,,,,,,,,,,,,,,,,,,,,,,,
3000,1345,1339,1338,1339,1348,1331,1337,3000,3000,1324,1317,1296,1296,1282,1272,1275,3000,,,,,,,,,,,,,,,,,,,,,,,,,,,,,,,,,,,,,,,,
1394,1381,1363,1366,1372,1381,1369,1388,3000,3000,1380,1379,1360,1362,1353,1351,1359,1306,,,,,,,,,,,,,,,,,,,,,,,,,,,,,,,,,,,,,,,,
1428,1380,1362,1362,1369,1381,1370,1381,1369,1365,1373,1376,1359,1363,1355,1351,1356,1341,,,,,,,,,,,,,,,,,,,,,,,,,,,,,,,,,,,,,,,,
1439,1398,1383,1383,1394,1401,1390,1407,1374,1370,1383,1387,1372,1373,1365,1363,1366,1355,,,,,,,,,,,,,,,,,,,,,,,,,,,,,,,,,,,,,,,,
1429,1393,1374,1377,1381,1391,1383,1394,1365,1362,1372,1380,1360,1366,1356,1355,1358,1348,,,,,,,,,,,,,,,,,,,,,,,,,,,,,,,,,,,,,,,,
1437,1402,1384,1387,1391,1402,1395,1407,1377,1373,1381,1390,1374,1376,1367,1362,1367,1355,,,,,,,,,,,,,,,,,,,,,,,,,,,,,,,,,,,,,,,,
1429,1395,1379,1381,1387,1400,1390,1401,1369,1366,1376,1384,1367,1370,1362,1358,1365,1351,,,,,,,,,,,,,,,,,,,,,,,,,,,,,,,,,,,,,,,,
1419,1386,1366,1370,1377,1388,1379,1387,1358,1353,1365,1373,1358,1360,1348,1346,1352,1338,,,,,,,,,,,,,,,,,,,,,,,,,,,,,,,,,,,,,,,,
1409,1376,1360,1365,1372,1384,1373,1381,1352,1351,1360,1367,1352,1355,1346,1344,1344,1332,,,,,,,,,,,,,,,,,,,,,,,,,,,,,,,,,,,,,,,,
1393,1365,1351,1355,1360,1372,1362,1370,1353,1339,1394,1374,1339,1341,1334,1328,1331,1318,,,,,,,,,,,,,,,,,,,,,,,,,,,,,,,,,,,,,,,,
1383,1360,1344,1346,1353,1366,1353,1360,1335,1332,1342,1348,1332,1334,1324,1321,1323,1310,,,,,,,,,,,,,,,,,,,,,,,,,,,,,,,,,,,,,,,,
1395,1370,1353,1356,1365,1374,1363,1372,1356,1342,1373,1362,1342,1344,1334,1331,1332,1320,,,,,,,,,,,,,,,,,,,,,,,,,,,,,,,,,,,,,,,,
1381,1358,1344,1346,1353,1365,1352,1359,1335,1334,1342,1349,1332,1334,1324,1323,1321,1309,,,,,,,,,,,,,,,,,,,,,,,,,,,,,,,,,,,,,,,,
1373,1351,1335,1337,1345,1355,1346,1353,1360,1328,1348,1355,1335,1345,1341,1317,1316,1325,,,,,,,,,,,,,,,,,,,,,,,,,,,,,,,,,,,,,,,,
1373,1352,1335,1339,1349,1359,1349,1356,1330,1328,1335,1341,1325,1325,1320,1313,1316,1302,,,,,,,,,,,,,,,,,,,,,,,,,,,,,,,,,,,,,,,,
1359,1335,1320,1325,1332,1345,1335,1339,1337,1311,1356,1349,1311,1313,1304,1299,1302,1286,,,,,,,,,,,,,,,,,,,,,,,,,,,,,,,,,,,,,,,,
1346,1327,1310,1314,1324,1335,1324,1331,1306,1306,1320,1321,1304,1303,1296,1288,1295,1278,,,,,,,,,,,,,,,,,,,,,,,,,,,,,,,,,,,,,,,,
1352,1335,1317,1321,1328,1339,1331,1338,1314,1310,1318,1325,1310,1309,1302,1296,1300,1285,,,,,,,,,,,,,,,,,,,,,,,,,,,,,,,,,,,,,,,,
1337,1318,1302,1304,1316,1327,1317,1325,1299,1295,1303,1310,1297,1296,1286,1282,1286,1274,,,,,,,,,,,,,,,,,,,,,,,,,,,,,,,,,,,,,,,,
1338,1320,1303,1307,1314,1328,1317,1323,1299,1293,1300,1309,1297,1296,1286,1282,1286,1276,,,,,,,,,,,,,,,,,,,,,,,,,,,,,,,,,,,,,,,,
1344,1316,1299,1302,1309,1321,1310,1318,1292,1289,1297,1306,1290,1290,1279,1276,1282,1267,,,,,,,,,,,,,,,,,,,,,,,,,,,,,,,,,,,,,,,,
1327,1339,1296,1299,1307,1360,1311,1317,1286,1286,1296,1300,1288,1286,1276,1275,1278,1265,,,,,,,,,,,,,,,,,,,,,,,,,,,,,,,,,,,,,,,,
1324,1310,1299,1295,1300,1349,1303,1311,1283,1281,1289,1296,1283,1283,1274,1271,1276,1264,,,,,,,,,,,,,,,,,,,,,,,,,,,,,,,,,,,,,,,,
1293,1271,1257,1260,1262,1276,1265,1271,1260,1257,1264,1271,1257,1255,1248,1247,1251,1241,,,,,,,,,,,,,,,,,,,,,,,,,,,,,,,,,,,,,,,,
1260,1248,1233,1236,1244,1255,1243,1250,1237,1236,1241,1250,1237,1236,1227,1226,1230,1222,,,,,,,,,,,,,,,,,,,,,,,,,,,,,,,,,,,,,,,,
1275,1241,1237,1229,1239,1248,1237,1241,1232,1229,1234,1244,1232,1232,1223,1220,1226,1216,,,,,,,,,,,,,,,,,,,,,,,,,,,,,,,,,,,,,,,,
1247,1233,1219,1219,1225,1237,1229,1233,1223,1219,1226,1234,1222,1222,1213,1211,1213,1205,,,,,,,,,,,,,,,,,,,,,,,,,,,,,,,,,,,,,,,,
1254,1239,1229,1232,1233,1247,1237,1240,1232,1230,1233,1243,1229,1227,1222,1219,1222,1213,,,,,,,,,,,,,,,,,,,,,,,,,,,,,,,,,,,,,,,,
1257,1240,1271,1218,1225,1230,1240,1225,1216,1215,1219,1227,1213,1215,1206,1205,1205,1201,,,,,,,,,,,,,,,,,,,,,,,,,,,,,,,,,,,,,,,,
1233,1223,1216,1219,1222,1233,1226,1229,1219,1215,1219,1229,1218,1218,1209,1206,1209,1204,,,,,,,,,,,,,,,,,,,,,,,,,,,,,,,,,,,,,,,,
1232,1220,1211,1216,1218,1227,1218,1222,1212,1212,1216,1225,1211,1212,1205,1204,1205,1199,,,,,,,,,,,,,,,,,,,,,,,,,,,,,,,,,,,,,,,,
1220,1208,1205,1204,1204,1215,1205,1209,1201,1198,1204,1209,1199,1201,1194,1188,1191,1187,,,,,,,,,,,,,,,,,,,,,,,,,,,,,,,,,,,,,,,,
1218,1205,1195,1201,1199,1209,1201,1205,1197,1192,1198,1204,1195,1197,1187,1184,1184,1184,,,,,,,,,,,,,,,,,,,,,,,,,,,,,,,,,,,,,,,,
1232,1218,1206,1211,1211,1219,1212,1212,1206,1204,1206,1215,1205,1206,1198,1195,1195,1195,,,,,,,,,,,,,,,,,,,,,,,,,,,,,,,,,,,,,,,,
1226,1208,1195,1197,1199,1211,1199,1202,1194,1190,1195,1204,1191,1190,1185,1184,1185,1184,,,,,,,,,,,,,,,,,,,,,,,,,,,,,,,,,,,,,,,,
1225,1205,1191,1195,1195,1208,1197,1198,1190,1188,1192,1199,1187,1188,1181,1180,1181,1180,,,,,,,,,,,,,,,,,,,,,,,,,,,,,,,,,,,,,,,,
1220,1202,1188,1192,1194,1204,1192,1191,1185,1183,1188,1194,1184,1181,1177,1174,1177,1176,,,,,,,,,,,,,,,,,,,,,,,,,,,,,,,,,,,,,,,,
1237,1202,1185,1187,1188,1199,1190,1190,1181,1181,1185,1191,1180,1178,1173,1169,1170,1167,,,,,,,,,,,,,,,,,,,,,,,,,,,,,,,,,,,,,,,,
1218,1215,1202,1201,1202,1216,1205,1206,1197,1197,1199,1206,1195,1195,1185,1181,1184,1169,,,,,,,,,,,,,,,,,,,,,,,,,,,,,,,,,,,,,,,,
3000,1209,1198,1185,1185,1192,1178,1174,1160,1159,1163,1174,1163,1164,1153,1150,1148,3000,,,,,,,,,,,,,,,,,,,,,,,,,,,,,,,,,,,,,,,,
#,full_min,,,,,,,,,,,,,,,,,,,,,,,,,,,,,,,,,,,,,,,,,,,,,,,,,,,,,,,,
0,576,574,573,574,577,570,573,0,0,567,564,555,555,549,545,546,0,,,,,,,,,,,,,,,,,,,,,,,,,,,,,,,,,,,,,,,,
597,592,584,585,588,592,586,595,0,0,591,591,583,583,580,579,582,559,,,,,,,,,,,,,,,,,,,,,,,,,,,,,,,,,,,,,,,,
612,591,583,583,586,592,587,592,586,585,588,589,582,584,580,579,581,574,,,,,,,,,,,,,,,,,,,,,,,,,,,,,,,,,,,,,,,,
616,599,592,592,597,600,595,603,589,587,592,594,588,588,585,584,585,580,,,,,,,,,,,,,,,,,,,,,,,,,,,,,,,,,,,,,,,,
612,597,589,590,592,596,592,597,585,583,588,591,583,585,581,580,582,577,,,,,,,,,,,,,,,,,,,,,,,,,,,,,,,,,,,,,,,,
616,601,593,594,596,601,598,603,590,588,592,595,589,589,586,583,586,580,,,,,,,,,,,,,,,,,,,,,,,,,,,,,,,,,,,,,,,,
612,598,591,592,594,600,595,600,586,585,589,593,586,587,583,582,585,579,,,,,,,,,,,,,,,,,,,,,,,,,,,,,,,,,,,,,,,,
608,594,585,587,590,595,591,594,582,580,585,588,582,583,577,577,579,573,,,,,,,,,,,,,,,,,,,,,,,,,,,,,,,,,,,,,,,,
604,589,583,585,588,593,588,592,579,579,583,586,579,580,577,576,576,571,,,,,,,,,,,,,,,,,,,,,,,,,,,,,,,,,,,,,,,,
597,585,579,580,583,588,583,587,580,574,597,589,574,574,571,569,570,565,,,,,,,,,,,,,,,,,,,,,,,,,,,,,,,,,,,,,,,,
592,583,576,577,580,585,580,583,572,571,575,577,571,571,567,566,567,561,,,,,,,,,,,,,,,,,,,,,,,,,,,,,,,,,,,,,,,,
598,587,580,581,585,589,584,588,581,575,588,583,575,576,571,570,571,565,,,,,,,,,,,,,,,,,,,,,,,,,,,,,,,,,,,,,,,,
592,582,576,577,580,585,579,582,572,571,575,578,571,571,567,567,566,561,,,,,,,,,,,,,,,,,,,,,,,,,,,,,,,,,,,,,,,,
588,579,572,573,576,580,577,580,583,569,577,580,572,576,574,564,564,568,,,,,,,,,,,,,,,,,,,,,,,,,,,,,,,,,,,,,,,,
588,579,572,574,578,582,578,581,570,569,572,574,568,568,565,562,564,558,,,,,,,,,,,,,,,,,,,,,,,,,,,,,,,,,,,,,,,,
582,572,565,568,571,576,572,574,573,562,581,578,562,562,559,556,558,551,,,,,,,,,,,,,,,,,,,,,,,,,,,,,,,,,,,,,,,,
577,568,561,563,567,572,567,570,559,559,565,566,559,558,555,552,555,547,,,,,,,,,,,,,,,,,,,,,,,,,,,,,,,,,,,,,,,,
579,572,564,566,569,574,570,573,563,561,565,568,561,561,558,555,557,550,,,,,,,,,,,,,,,,,,,,,,,,,,,,,,,,,,,,,,,,
573,565,558,559,564,568,564,568,556,555,558,561,556,555,551,549,551,546,,,,,,,,,,,,,,,,,,,,,,,,,,,,,,,,,,,,,,,,
573,565,558,560,563,569,564,567,556,554,557,561,556,555,551,549,551,547,,,,,,,,,,,,,,,,,,,,,,,,,,,,,,,,,,,,,,,,
576,564,556,558,561,566,561,565,553,552,556,559,553,553,548,547,549,543,,,,,,,,,,,,,,,,,,,,,,,,,,,,,,,,,,,,,,,,
568,574,555,556,560,583,562,564,551,551,555,557,552,551,547,546,547,542,,,,,,,,,,,,,,,,,,,,,,,,,,,,,,,,,,,,,,,,
567,561,556,555,557,578,558,562,550,549,552,555,550,550,546,544,547,541,,,,,,,,,,,,,,,,,,,,,,,,,,,,,,,,,,,,,,,,
554,544,538,540,541,547,542,544,540,538,541,544,538,538,535,534,536,532,,,,,,,,,,,,,,,,,,,,,,,,,,,,,,,,,,,,,,,,
540,535,528,529,533,538,532,535,530,529,532,535,530,529,526,525,527,523,,,,,,,,,,,,,,,,,,,,,,,,,,,,,,,,,,,,,,,,
546,532,530,526,531,535,530,532,528,526,529,533,528,528,524,523,525,521,,,,,,,,,,,,,,,,,,,,,,,,,,,,,,,,,,,,,,,,
534,528,522,522,525,530,526,528,524,522,525,529,523,523,520,519,520,516,,,,,,,,,,,,,,,,,,,,,,,,,,,,,,,,,,,,,,,,
537,531,526,528,528,534,530,531,528,527,528,532,526,526,523,522,523,520,,,,,,,,,,,,,,,,,,,,,,,,,,,,,,,,,,,,,,,,
538,531,544,522,525,527,531,525,521,520,522,526,520,520,517,516,516,514,,,,,,,,,,,,,,,,,,,,,,,,,,,,,,,,,,,,,,,,
528,524,521,522,523,528,525,526,522,520,522,526,522,522,518,517,518,516,,,,,,,,,,,,,,,,,,,,,,,,,,,,,,,,,,,,,,,,
528,523,519,521,522,526,522,523,519,519,521,525,519,519,516,516,516,514,,,,,,,,,,,,,,,,,,,,,,,,,,,,,,,,,,,,,,,,
523,517,516,516,516,520,516,518,514,513,516,518,514,514,511,509,510,508,,,,,,,,,,,,,,,,,,,,,,,,,,,,,,,,,,,,,,,,
522,516,512,514,514,518,514,516,513,511,513,516,512,513,508,507,507,507,,,,,,,,,,,,,,,,,,,,,,,,,,,,,,,,,,,,,,,,
528,522,517,519,519,522,519,519,517,516,517,520,516,517,513,512,512,512,,,,,,,,,,,,,,,,,,,,,,,,,,,,,,,,,,,,,,,,
525,517,512,513,514,519,514,515,511,510,512,516,510,510,508,507,508,507,,,,,,,,,,,,,,,,,,,,,,,,,,,,,,,,,,,,,,,,
525,516,510,512,512,517,513,513,510,509,511,514,508,509,506,505,506,505,,,,,,,,,,,,,,,,,,,,,,,,,,,,,,,,,,,,,,,,
523,515,509,511,511,516,511,510,508,507,509,511,507,506,504,503,504,504,,,,,,,,,,,,,,,,,,,,,,,,,,,,,,,,,,,,,,,,
530,515,508,508,509,514,510,510,506,506,508,510,505,505,502,501,501,500,,,,,,,,,,,,,,,,,,,,,,,,,,,,,,,,,,,,,,,,
522,520,515,514,515,521,516,517,513,513,514,517,512,512,508,506,507,501,,,,,,,,,,,,,,,,,,,,,,,,,,,,,,,,,,,,,,,,
0,518,513,508,508,511,505,503,497,496,498,503,498,499,494,493,492,0,,,,,,,,,,,,,,,,,,,,,,,,,,,,,,,,,,,,,,,,
#,full_row_delta_max,,,,,,,,,,,,,,,,,,,,,,,,,,,,,,,,,,,,,,,,,,,,,,,,,,,,,,,,
15000,8000,8000,8000,8000,8000,8000,8000,8000,8000,8000,8000,8000,8000,8000,8000,8000,8000,8000,8000,8000,8000,8000,8000,8000,8000,8000,8000,8000,8000,8000,8000,8000,8000,8000,8000,8000,8000,15000,,,,,,,,,,,,,,,,,,,
#,full_row_delta_min,,,,,,,,,,,,,,,,,,,,,,,,,,,,,,,,,,,,,,,,,,,,,,,,,,,,,,,,
-15000,-10000,-10000,-10000,-10000,-10000,-10000,-10000,-10000,-10000,-10000,-10000,-10000,-10000,-10000,-10000,-10000,-10000,-10000,-10000,-10000,-10000,-10000,-10000,-10000,-10000,-10000,-10000,-10000,-10000,-10000,-10000,-10000,-10000,-10000,-10000,-10000,-10000,-15000,,,,,,,,,,,,,,,,,,,
#,full_col_delta_max,,,,,,,,,,,,,,,,,,,,,,,,,,,,,,,,,,,,,,,,,,,,,,,,,,,,,,,,
15000,8000,8000,8000,8000,8000,8000,8000,8000,8000,8000,8000,8000,8000,8000,8000,15000,,,,,,,,,,,,,,,,,,,,,,,,,,,,,,,,,,,,,,,,,
#,full_col_delta_min,,,,,,,,,,,,,,,,,,,,,,,,,,,,,,,,,,,,,,,,,,,,,,,,,,,,,,,,
-15000,-10000,-10000,-10000,-10000,-10000,-10000,-10000,-10000,-10000,-10000,-10000,-10000,-10000,-10000,-10000,-15000,,,,,,,,,,,,,,,,,,,,,,,,,,,,,,,,,,,,,,,,,
