{
  "config":{
    "hw_platform": ["MTP", "Surf", "RCM", "QRD", "HDK", "IDP"],
    "soc_id": ["415", "439", "456", "502", "501","552", "497", "498", "540","515"]
  },
  "sns_hw_gyro_cal_0":{
    "owner": "sns_hw_gyro_cal",
    ".bias":{
        "owner": "sns_hw_gyro_cal",
        "x":{ "type": "flt", "ver": "0",
          "data": "0.0"
        },
        "y":{ "type": "flt", "ver": "0",
          "data": "0.0"
        },
        "z":{ "type": "flt", "ver": "0",
          "data": "0.0"
        }
    },
    ".config":{
        "owner": "sns_hw_gyro_cal",
        "still_threshold_mod": {"type": "flt","ver": "0","data": "0.090"
        },
        "still_threshold_axis": {"type": "flt","ver": "0","data": "0.087"
        },
        "still_number_end": {"type": "int","ver": "0","data": "250"
        }
    }
  }
}
