{
    "resId":"nlu_reminder_MODIFY_ALARM_ANALYZE_group",
    "domain":"nlu",
    "district":"china",
    "deviceType":"common",
    "productName":"common",
    "romVersion":"common",
    "osVersion":"common",
    "version":"0x01010000",
    "releaseNotes":"",
    "digest":"",
    "fileName":"",
    "ResMetaData":[
        {
            "origin_id":"0x000000000200112a",
            "res_value":"",
            "res_path":"nlu/model/local/fst/zh/reminder/MODIFY_ALARM_ANALYZE.far",
            "domain":"nlu",
            "data_version":"0x01010000",
            "encrypt_mode":"0"
        }
    ]
}