{
	"centerX" : 0.5,
	"centerY" : 0.5,
	"angle" : 0,
	"scale" : 1,
	"width" : 166,
	"height" : 100,
	"contents" : [
		{
			"type" : "image",
			"resource" : {
				"type" : "static",
				"path" : "res/on_my_way.png"
			},
			"centerX" : 0.5,
			"centerY" : 0.45,
			"width" : 166,
			"height" : 100,
			"angle" : 0,
			"zorder" : 1
		},
		{
            "type": "text",
            "centerX": 0.5,
            "centerY": 0.83,
            "width": 120,
            "height": 15,
            "angle": 0,
            "color": "#ffffffff",
            "isVertical": 0,
			"alignment": 0,
            "text": "{yyyy-MM-dd}",
            "zorder": 2
        }
	]
}
