{
	"IQOFFSET": [32,32],
	"OBW": [94,94],
	"UPC_cal_delta_128bit": [1,1],
	"UPC_cal_delta_256bit": [1,1],
	"UPC_cal_delta_512bit": [1,1],
	"thermalTag": "/sys/class/thermal/thermal_zone65/temp",
	"T_fact": 35,
	"UPC_temp_Lf1": [-7,-6,-6,-5,-4,-4,-4,-3,-3,-2,-1,0,1,1,1,2,2,3,3,4,4,4,4],
	"UPC_temp_Lf2": [-7,-6,-6,-5,-4,-4,-4,-3,-3,-2,-1,0,1,1,1,2,2,3,3,4,4,4,4],
	"UPC_boost_128bit": [0,0],
	"UPC_boost_256bit": [1,1],
	"UPC_boost_512bit": [1,1],
	"UPC_max": [24,24],
	"batteryTypeTag": "/sys/class/hw_power/battery/battery_model/bat_cathode_type",
	"batteryCapacityTag": "/sys/class/power_supply/battery/capacity",
	"batteryThreshold": 25,
	"batteryStep": 5,
	"UPC_backoff_graphite_Lf1": [0,0,0,-4,-8],
	"UPC_backoff_graphite_Lf2": [0,0,0,-4,-8],
	"UPC_backoff_silicon_Lf1": [-2,-4,-8,-12,-14],
	"UPC_backoff_silicon_Lf2": [-2,-4,-8,-12,-14],
	"TxPreOn": 1,
	"TxAftOn": 1,
	"PowerUnloadPercentage": 25
}
