{
    "enableDedup": true,
    "enableCompress": true,
    "fgCompressTimeout": 0,
    "compressScanMaxTime": 120,
    "decompressStartThreshold": 15,
    "bgDecompressMaxRunTime": 15,
    "decompressMinInterval": 1,
    "compressMinFileSizeKb": 32,
    "appUnuseTimeThresholdLow": 7,
    "appUnuseTimeThresholdMedium": 14,
    "appUnuseTimeThresholdHigh": 30,
    "lowCompressAlgorithm": "LZ4",
    "mediumCompressAlgorithm": "LZ4",
    "highCompressAlgorithm": "LZ4",
    "compressFileDefaultGains": 20,
    "dedupMinFileSize": 1048576,
    "fgDedupTimeout": 0,
    "bgDedupScanMaxTime": 15,
    "dedupFlushMaxTime": 5,
    "compressFileTypesInfo": {
        "so": 42,
        "vdex": 31,
        "odex": 53,
        "dex": 60,
        "log": 73,
        "xml": 43,
        "js": 54,
        "txt": 42,
        "dat": 23,
        "css": 60,
        "ttf": 22
    },
    "dedupScanPathWhiteList": {
        "/data/media/${userID}": "HSO_PATH_C",
        "/data/user/${userID}": "HSO_PATH_C",
        "/data/app": "HSO_PATH_D"
    }
}
