{
    "id":"journey",
    "title_id":"story_template_title_journey",
    "music":"Resource/music/out.aac",
    "template_desc_id": "journey_template_desc",
    "segments":[
        {
            "camera_id":0,
            "duration":4.2,
            "demo_offset":[0,3.2],
            "audio_offset":0,
            "clip_desc_id": "auto_shoot_video",
            "algo_scripts":{
                "operation_mode":"panning",
                "operation_param":"0,50,100,50"
            },
            "holder_scripts":{
                "delay_before_shoot_pos":0.5,
                "gimbal_before_shoot_pos":[0,0.2,0,0,-25,1],
                "gimbal_start_pos":[0,0.2,0,0,0,1],
                "gimbal_move":[
                    [0.5,4.2,0,0,25,1]
                ]
            }
        },
        {
            "camera_id":0,
            "duration":4.2,
            "demo_offset":[4.2,7],
            "audio_offset":3.2,
            "clip_desc_id": "auto_shoot_video",
            "algo_scripts":{
                "operation_mode":"panning",
                "operation_param":"0,50,100,50"
            },
            "holder_scripts":{
                "delay_before_shoot_pos":0.5,
                "gimbal_before_shoot_pos":[0,0.2,0,0,-25,1],
                "gimbal_start_pos":[0,0.2,0,0,0,1],
                "gimbal_move":[
                    [0.5,4.2,0,0,25,1]
                ]
            }
        },
        {
            "camera_id":0,
            "duration":2.1,
            "demo_offset":[7.6,9.1],
            "audio_offset":7.4,
            "clip_desc_id": "auto_shoot_video",
            "algo_scripts":{
                "operation_mode":"panning",
                "operation_param":"80,50,20,50"
            },
            "holder_scripts":{
                "delay_before_shoot_pos":0.5,
                "gimbal_before_shoot_pos":[0,0.2,0,0,15,1],
                "gimbal_start_pos":[0,0.2,0,0,0,1],
                "gimbal_move":[
                    [0.5,2.1,0,0,-15,1]
                ]
            }
        },
        {
            "camera_id":0,
            "duration":2.1,
            "demo_offset":[9.5,11],
            "audio_offset":9.1,
            "clip_desc_id": "auto_shoot_video",
            "algo_scripts":{
                "operation_mode":"zoom",
                "operation_param":"1.2,1.5"
            }
        },
        {
            "camera_id":0,
            "duration":3.8,
            "demo_offset":[11.6,14.9],
            "audio_offset":11.2,
            "clip_desc_id": "auto_shoot_video",
            "algo_scripts":{
                "operation_mode":"zoom",
                "operation_param":"1.2,1"
            }
        }
    ]
}