#,version,,,,,,,,,,,,,,,,,,,,,,,,,,,,,,,,,,,,,,,,,,,,,,,,,,
2019,1,24,1,,,,,,,,,,,,,,,,,,,,,,,,,,,,,,,,,,,,,,,,,,,,,,,,
#,row_col_num,,,,,,,,,,,,,,,,,,,,,,,,,,,,,,,,,,,,,,,,,,,,,,,,,,
36,18,,,,,,,,,,,,,,,,,,,,,,,,,,,,,,,,,,,,,,,,,,,,,,,,,,
#,noise,,,,,,,,,,,,,,,,,,,,,,,,,,,,,,,,,,,,,,,,,,,,,,,,,,
-150,150,,,,,,,,,,,,,,,,,,,,,,,,,,,,,,,,,,,,,,,,,,,,,,,,,,
#,raw_max,,,,,,,,,,,,,,,,,,,,,,,,,,,,,,,,,,,,,,,,,,,,,,,,,,
11061,11071,11078,11074,11073,11066,11061,11068,11065,11064,11066,11076,11071,11070,11063,11063,11060,11065,,,,,,,,,,,,,,,,,,,,,,,,,,,,,,,,,,,,
11073,11074,11075,11079,11071,11068,11066,11070,11068,11061,11068,11079,11076,11074,11068,11069,11066,11070,,,,,,,,,,,,,,,,,,,,,,,,,,,,,,,,,,,,
11070,11073,11071,11065,11069,11076,11066,11075,11063,11048,11068,11071,11065,11059,11068,11053,11069,11064,,,,,,,,,,,,,,,,,,,,,,,,,,,,,,,,,,,,
11064,11080,11080,11078,11080,11080,11059,11066,11059,11065,11069,11070,11073,11073,11073,11071,11070,11069,,,,,,,,,,,,,,,,,,,,,,,,,,,,,,,,,,,,
11063,11074,11064,11068,11068,11066,11078,11055,11060,11060,11063,11066,11068,11075,11075,11075,11069,11069,,,,,,,,,,,,,,,,,,,,,,,,,,,,,,,,,,,,
11065,11071,11073,11073,11070,11071,11080,11066,11059,11069,11064,11064,11071,11076,11073,11071,11064,11073,,,,,,,,,,,,,,,,,,,,,,,,,,,,,,,,,,,,
11070,11075,11075,11078,11083,11081,11071,11068,11068,11058,11063,11080,11073,11066,11069,11070,11065,11069,,,,,,,,,,,,,,,,,,,,,,,,,,,,,,,,,,,,
11064,11074,11070,11060,11074,11055,11079,11083,11053,11061,11065,11079,11069,11073,11074,11065,11078,11070,,,,,,,,,,,,,,,,,,,,,,,,,,,,,,,,,,,,
11065,11063,11065,11063,11064,11060,11071,11065,11071,11073,11069,11073,11069,11068,11078,11079,11075,11064,,,,,,,,,,,,,,,,,,,,,,,,,,,,,,,,,,,,
11068,11071,11071,11074,11075,11063,11074,11071,11061,11075,11059,11078,11069,11070,11069,11063,11078,11071,,,,,,,,,,,,,,,,,,,,,,,,,,,,,,,,,,,,
11064,11073,11064,11053,11070,11071,11078,11073,11069,11059,11079,11059,11060,11078,11071,11066,11064,11064,,,,,,,,,,,,,,,,,,,,,,,,,,,,,,,,,,,,
11071,11069,11073,11075,11070,11079,11078,11078,11055,11070,11055,11080,11078,11055,11060,11058,11071,11070,,,,,,,,,,,,,,,,,,,,,,,,,,,,,,,,,,,,
11071,11068,11074,11074,11079,11076,11085,11068,11065,11059,11069,11064,11071,11068,11065,11056,11066,11071,,,,,,,,,,,,,,,,,,,,,,,,,,,,,,,,,,,,
11064,11069,11085,11081,11076,11078,11080,11060,11058,11054,11073,11065,11069,11080,11073,11073,11066,11079,,,,,,,,,,,,,,,,,,,,,,,,,,,,,,,,,,,,
11065,11065,11073,11073,11066,11059,11068,11069,11066,11061,11075,11066,11065,11073,11068,11071,11063,11084,,,,,,,,,,,,,,,,,,,,,,,,,,,,,,,,,,,,
11068,11065,11074,11073,11074,11073,11070,11070,11058,11064,11068,11073,11063,11071,11065,11068,11069,11075,,,,,,,,,,,,,,,,,,,,,,,,,,,,,,,,,,,,
11069,11068,11071,11069,11074,11079,11079,11073,11060,11066,11078,11079,11069,11074,11069,11071,11058,11074,,,,,,,,,,,,,,,,,,,,,,,,,,,,,,,,,,,,
11063,11079,11073,11076,11075,11071,11080,11070,11068,11059,11079,11070,11070,11069,11075,11069,11076,11075,,,,,,,,,,,,,,,,,,,,,,,,,,,,,,,,,,,,
11075,11065,11074,11059,11060,11055,11080,11054,11059,11065,11060,11073,11073,11065,11064,11064,11070,11075,,,,,,,,,,,,,,,,,,,,,,,,,,,,,,,,,,,,
11069,11071,11065,11079,11078,11058,11074,11068,11064,11058,11069,11064,11066,11064,11066,11061,11074,11068,,,,,,,,,,,,,,,,,,,,,,,,,,,,,,,,,,,,
11069,11075,11084,11076,11065,11083,11073,11071,11073,11054,11074,11078,11063,11070,11061,11063,11081,11080,,,,,,,,,,,,,,,,,,,,,,,,,,,,,,,,,,,,
11061,11073,11073,11069,11064,11064,11074,11069,11068,11066,11056,11060,11054,11071,11071,11070,11056,11076,,,,,,,,,,,,,,,,,,,,,,,,,,,,,,,,,,,,
11078,11066,11070,11073,11071,11069,11063,11078,11064,11061,11058,11060,11064,11060,11076,11081,11065,11076,,,,,,,,,,,,,,,,,,,,,,,,,,,,,,,,,,,,
11066,11066,11063,11068,11064,11075,11074,11064,11066,11069,11068,11073,11064,11059,11060,11063,11070,11073,,,,,,,,,,,,,,,,,,,,,,,,,,,,,,,,,,,,
11065,11065,11070,11073,11074,11069,11065,11081,11066,11056,11074,11080,11075,11075,11063,11066,11073,11074,,,,,,,,,,,,,,,,,,,,,,,,,,,,,,,,,,,,
11068,11068,11074,11061,11069,11070,11074,11064,11066,11066,11068,11071,11064,11064,11071,11063,11071,11071,,,,,,,,,,,,,,,,,,,,,,,,,,,,,,,,,,,,
11069,11068,11061,11068,11064,11061,11066,11073,11063,11059,11053,11055,11063,11063,11078,11069,11065,11079,,,,,,,,,,,,,,,,,,,,,,,,,,,,,,,,,,,,
11063,11071,11073,11074,11083,11068,11063,11074,11066,11060,11060,11065,11063,11065,11064,11074,11065,11074,,,,,,,,,,,,,,,,,,,,,,,,,,,,,,,,,,,,
11073,11069,11068,11069,11069,11068,11073,11075,11055,11060,11064,11064,11076,11074,11069,11069,11065,11070,,,,,,,,,,,,,,,,,,,,,,,,,,,,,,,,,,,,
11069,11070,11074,11066,11069,11071,11071,11068,11069,11060,11068,11063,11064,11074,11060,11070,11073,11074,,,,,,,,,,,,,,,,,,,,,,,,,,,,,,,,,,,,
11070,11066,11066,11068,11069,11074,11064,11065,11068,11065,11075,11064,11061,11061,11073,11074,11075,11069,,,,,,,,,,,,,,,,,,,,,,,,,,,,,,,,,,,,
11085,11064,11064,11063,11063,11080,11083,11083,11068,11060,11075,11070,11080,11075,11080,11080,11076,11056,,,,,,,,,,,,,,,,,,,,,,,,,,,,,,,,,,,,
11064,11075,11071,11074,11075,11059,11064,11060,11063,11065,11068,11070,11068,11069,11065,11070,11066,11073,,,,,,,,,,,,,,,,,,,,,,,,,,,,,,,,,,,,
11075,11063,11064,11063,11066,11069,11066,11071,11069,11061,11069,11071,11069,11073,11068,11070,11071,11064,,,,,,,,,,,,,,,,,,,,,,,,,,,,,,,,,,,,
11074,11071,11070,11073,11075,11075,11080,11073,11073,11055,11055,11071,11085,11075,11075,11076,11075,11074,,,,,,,,,,,,,,,,,,,,,,,,,,,,,,,,,,,,
11066,11075,11075,11076,11070,11079,11079,11058,11070,11060,11078,11070,11069,11066,11065,11068,11066,11066,,,,,,,,,,,,,,,,,,,,,,,,,,,,,,,,,,,,
#,raw_min,,,,,,,,,,,,,,,,,,,,,,,,,,,,,,,,,,,,,,,,,,,,,,,,,,
6637,6643,6647,6644,6644,6640,6637,6641,6639,6638,6640,6646,6643,6642,6638,6638,6636,6639,,,,,,,,,,,,,,,,,,,,,,,,,,,,,,,,,,,,
6644,6644,6645,6647,6643,6641,6640,6642,6641,6637,6641,6647,6646,6644,6641,6641,6640,6642,,,,,,,,,,,,,,,,,,,,,,,,,,,,,,,,,,,,
6642,6644,6643,6639,6641,6646,6640,6645,6638,6629,6641,6643,6639,6635,6641,6632,6641,6638,,,,,,,,,,,,,,,,,,,,,,,,,,,,,,,,,,,,
6638,6648,6648,6647,6648,6648,6635,6640,6635,6639,6641,6642,6644,6644,6644,6643,6642,6641,,,,,,,,,,,,,,,,,,,,,,,,,,,,,,,,,,,,
6638,6644,6638,6641,6641,6640,6647,6633,6636,6636,6638,6640,6641,6645,6645,6645,6641,6641,,,,,,,,,,,,,,,,,,,,,,,,,,,,,,,,,,,,
6639,6643,6644,6644,6642,6643,6648,6640,6635,6641,6638,6638,6643,6646,6644,6643,6638,6644,,,,,,,,,,,,,,,,,,,,,,,,,,,,,,,,,,,,
6642,6645,6645,6647,6650,6649,6643,6641,6641,6635,6638,6648,6644,6640,6641,6642,6639,6641,,,,,,,,,,,,,,,,,,,,,,,,,,,,,,,,,,,,
6638,6644,6642,6636,6644,6633,6647,6650,6632,6637,6639,6647,6641,6644,6644,6639,6647,6642,,,,,,,,,,,,,,,,,,,,,,,,,,,,,,,,,,,,
6639,6638,6639,6638,6638,6636,6643,6639,6643,6644,6641,6644,6641,6641,6647,6647,6645,6638,,,,,,,,,,,,,,,,,,,,,,,,,,,,,,,,,,,,
6641,6643,6643,6644,6645,6638,6644,6643,6637,6645,6635,6647,6641,6642,6641,6638,6647,6643,,,,,,,,,,,,,,,,,,,,,,,,,,,,,,,,,,,,
6638,6644,6638,6632,6642,6643,6647,6644,6641,6635,6647,6635,6636,6647,6643,6640,6638,6638,,,,,,,,,,,,,,,,,,,,,,,,,,,,,,,,,,,,
6643,6641,6644,6645,6642,6647,6647,6647,6633,6642,6633,6648,6647,6633,6636,6635,6643,6642,,,,,,,,,,,,,,,,,,,,,,,,,,,,,,,,,,,,
6643,6641,6644,6644,6647,6646,6651,6641,6639,6635,6641,6638,6643,6641,6639,6634,6640,6643,,,,,,,,,,,,,,,,,,,,,,,,,,,,,,,,,,,,
6638,6641,6651,6649,6646,6647,6648,6636,6635,6632,6644,6639,6641,6648,6644,6644,6640,6647,,,,,,,,,,,,,,,,,,,,,,,,,,,,,,,,,,,,
6639,6639,6644,6644,6640,6635,6641,6641,6640,6637,6645,6640,6639,6644,6641,6643,6638,6650,,,,,,,,,,,,,,,,,,,,,,,,,,,,,,,,,,,,
6641,6639,6644,6644,6644,6644,6642,6642,6635,6638,6641,6644,6638,6643,6639,6641,6641,6645,,,,,,,,,,,,,,,,,,,,,,,,,,,,,,,,,,,,
6641,6641,6643,6641,6644,6647,6647,6644,6636,6640,6647,6647,6641,6644,6641,6643,6635,6644,,,,,,,,,,,,,,,,,,,,,,,,,,,,,,,,,,,,
6638,6647,6644,6646,6645,6643,6648,6642,6641,6635,6647,6642,6642,6641,6645,6641,6646,6645,,,,,,,,,,,,,,,,,,,,,,,,,,,,,,,,,,,,
6645,6639,6644,6635,6636,6633,6648,6632,6635,6639,6636,6644,6644,6639,6638,6638,6642,6645,,,,,,,,,,,,,,,,,,,,,,,,,,,,,,,,,,,,
6641,6643,6639,6647,6647,6635,6644,6641,6638,6635,6641,6638,6640,6638,6640,6637,6644,6641,,,,,,,,,,,,,,,,,,,,,,,,,,,,,,,,,,,,
6641,6645,6650,6646,6639,6650,6644,6643,6644,6632,6644,6647,6638,6642,6637,6638,6649,6648,,,,,,,,,,,,,,,,,,,,,,,,,,,,,,,,,,,,
6637,6644,6644,6641,6638,6638,6644,6641,6641,6640,6634,6636,6632,6643,6643,6642,6634,6646,,,,,,,,,,,,,,,,,,,,,,,,,,,,,,,,,,,,
6647,6640,6642,6644,6643,6641,6638,6647,6638,6637,6635,6636,6638,6636,6646,6649,6639,6646,,,,,,,,,,,,,,,,,,,,,,,,,,,,,,,,,,,,
6640,6640,6638,6641,6638,6645,6644,6638,6640,6641,6641,6644,6638,6635,6636,6638,6642,6644,,,,,,,,,,,,,,,,,,,,,,,,,,,,,,,,,,,,
6639,6639,6642,6644,6644,6641,6639,6649,6640,6634,6644,6648,6645,6645,6638,6640,6644,6644,,,,,,,,,,,,,,,,,,,,,,,,,,,,,,,,,,,,
6641,6641,6644,6637,6641,6642,6644,6638,6640,6640,6641,6643,6638,6638,6643,6638,6643,6643,,,,,,,,,,,,,,,,,,,,,,,,,,,,,,,,,,,,
6641,6641,6637,6641,6638,6637,6640,6644,6638,6635,6632,6633,6638,6638,6647,6641,6639,6647,,,,,,,,,,,,,,,,,,,,,,,,,,,,,,,,,,,,
6638,6643,6644,6644,6650,6641,6638,6644,6640,6636,6636,6639,6638,6639,6638,6644,6639,6644,,,,,,,,,,,,,,,,,,,,,,,,,,,,,,,,,,,,
6644,6641,6641,6641,6641,6641,6644,6645,6633,6636,6638,6638,6646,6644,6641,6641,6639,6642,,,,,,,,,,,,,,,,,,,,,,,,,,,,,,,,,,,,
6641,6642,6644,6640,6641,6643,6643,6641,6641,6636,6641,6638,6638,6644,6636,6642,6644,6644,,,,,,,,,,,,,,,,,,,,,,,,,,,,,,,,,,,,
6642,6640,6640,6641,6641,6644,6638,6639,6641,6639,6645,6638,6637,6637,6644,6644,6645,6641,,,,,,,,,,,,,,,,,,,,,,,,,,,,,,,,,,,,
6651,6638,6638,6638,6638,6648,6650,6650,6641,6636,6645,6642,6648,6645,6648,6648,6646,6634,,,,,,,,,,,,,,,,,,,,,,,,,,,,,,,,,,,,
6638,6645,6643,6644,6645,6635,6638,6636,6638,6639,6641,6642,6641,6641,6639,6642,6640,6644,,,,,,,,,,,,,,,,,,,,,,,,,,,,,,,,,,,,
6645,6638,6638,6638,6640,6641,6640,6643,6641,6637,6641,6643,6641,6644,6641,6642,6643,6638,,,,,,,,,,,,,,,,,,,,,,,,,,,,,,,,,,,,
6644,6643,6642,6644,6645,6645,6648,6644,6644,6633,6633,6643,6651,6645,6645,6646,6645,6644,,,,,,,,,,,,,,,,,,,,,,,,,,,,,,,,,,,,
6640,6645,6645,6646,6642,6647,6647,6635,6642,6636,6647,6642,6641,6640,6639,6641,6640,6640,,,,,,,,,,,,,,,,,,,,,,,,,,,,,,,,,,,,
#,raw_row_delta_max,,,,,,,,,,,,,,,,,,,,,,,,,,,,,,,,,,,,,,,,,,,,,,,,,,
450,450,450,450,450,450,450,450,450,450,450,450,450,450,450,450,450,450,,,,,,,,,,,,,,,,,,,,,,,,,,,,,,,,,,,
450,450,450,450,450,450,450,450,450,450,450,450,450,450,450,450,450,450,,,,,,,,,,,,,,,,,,,,,,,,,,,,,,,,,,,
450,450,450,450,450,450,450,450,450,450,450,450,450,450,450,450,450,450,,,,,,,,,,,,,,,,,,,,,,,,,,,,,,,,,,,
450,450,450,450,450,450,450,450,450,450,450,450,450,450,450,450,450,450,,,,,,,,,,,,,,,,,,,,,,,,,,,,,,,,,,,
450,450,450,450,450,450,450,450,450,450,450,450,450,450,450,450,450,450,,,,,,,,,,,,,,,,,,,,,,,,,,,,,,,,,,,
450,450,450,450,450,450,450,450,450,450,450,450,450,450,450,450,450,450,,,,,,,,,,,,,,,,,,,,,,,,,,,,,,,,,,,
450,450,450,450,450,450,450,450,450,450,450,450,450,450,450,450,450,450,,,,,,,,,,,,,,,,,,,,,,,,,,,,,,,,,,,
450,450,450,450,450,450,450,450,450,450,450,450,450,450,450,450,450,450,,,,,,,,,,,,,,,,,,,,,,,,,,,,,,,,,,,
450,450,450,450,450,450,450,450,450,450,450,450,450,450,450,450,450,450,,,,,,,,,,,,,,,,,,,,,,,,,,,,,,,,,,,
450,450,450,450,450,450,450,450,450,450,450,450,450,450,450,450,450,450,,,,,,,,,,,,,,,,,,,,,,,,,,,,,,,,,,,
450,450,450,450,450,450,450,450,450,450,450,450,450,450,450,450,450,450,,,,,,,,,,,,,,,,,,,,,,,,,,,,,,,,,,,
450,450,450,450,450,450,450,450,450,450,450,450,450,450,450,450,450,450,,,,,,,,,,,,,,,,,,,,,,,,,,,,,,,,,,,
450,450,450,450,450,450,450,450,450,450,450,450,450,450,450,450,450,450,,,,,,,,,,,,,,,,,,,,,,,,,,,,,,,,,,,
450,450,450,450,450,450,450,450,450,450,450,450,450,450,450,450,450,450,,,,,,,,,,,,,,,,,,,,,,,,,,,,,,,,,,,
450,450,450,450,450,450,450,450,450,450,450,450,450,450,450,450,450,450,,,,,,,,,,,,,,,,,,,,,,,,,,,,,,,,,,,
450,450,450,450,450,450,450,450,450,450,450,450,450,450,450,450,450,450,,,,,,,,,,,,,,,,,,,,,,,,,,,,,,,,,,,
450,450,450,450,450,450,450,450,450,450,450,450,450,450,450,450,450,450,,,,,,,,,,,,,,,,,,,,,,,,,,,,,,,,,,,
450,450,450,450,450,450,450,450,450,450,450,450,450,450,450,450,450,450,,,,,,,,,,,,,,,,,,,,,,,,,,,,,,,,,,,
450,450,450,450,450,450,450,450,450,450,450,450,450,450,450,450,450,450,,,,,,,,,,,,,,,,,,,,,,,,,,,,,,,,,,,
450,450,450,450,450,450,450,450,450,450,450,450,450,450,450,450,450,450,,,,,,,,,,,,,,,,,,,,,,,,,,,,,,,,,,,
450,450,450,450,450,450,450,450,450,450,450,450,450,450,450,450,450,450,,,,,,,,,,,,,,,,,,,,,,,,,,,,,,,,,,,
450,450,450,450,450,450,450,450,450,450,450,450,450,450,450,450,450,450,,,,,,,,,,,,,,,,,,,,,,,,,,,,,,,,,,,
450,450,450,450,450,450,450,450,450,450,450,450,450,450,450,450,450,450,,,,,,,,,,,,,,,,,,,,,,,,,,,,,,,,,,,
450,450,450,450,450,450,450,450,450,450,450,450,450,450,450,450,450,450,,,,,,,,,,,,,,,,,,,,,,,,,,,,,,,,,,,
450,450,450,450,450,450,450,450,450,450,450,450,450,450,450,450,450,450,,,,,,,,,,,,,,,,,,,,,,,,,,,,,,,,,,,
450,450,450,450,450,450,450,450,450,450,450,450,450,450,450,450,450,450,,,,,,,,,,,,,,,,,,,,,,,,,,,,,,,,,,,
450,450,450,450,450,450,450,450,450,450,450,450,450,450,450,450,450,450,,,,,,,,,,,,,,,,,,,,,,,,,,,,,,,,,,,
450,450,450,450,450,450,450,450,450,450,450,450,450,450,450,450,450,450,,,,,,,,,,,,,,,,,,,,,,,,,,,,,,,,,,,
450,450,450,450,450,450,450,450,450,450,450,450,450,450,450,450,450,450,,,,,,,,,,,,,,,,,,,,,,,,,,,,,,,,,,,
450,450,450,450,450,450,450,450,450,450,450,450,450,450,450,450,450,450,,,,,,,,,,,,,,,,,,,,,,,,,,,,,,,,,,,
450,450,450,450,450,450,450,450,450,450,450,450,450,450,450,450,450,450,,,,,,,,,,,,,,,,,,,,,,,,,,,,,,,,,,,
450,450,450,450,450,450,450,450,450,450,450,450,450,450,450,450,450,450,,,,,,,,,,,,,,,,,,,,,,,,,,,,,,,,,,,
450,450,450,450,450,450,450,450,450,450,450,450,450,450,450,450,450,450,,,,,,,,,,,,,,,,,,,,,,,,,,,,,,,,,,,
450,450,450,450,450,450,450,450,450,450,450,450,450,450,450,450,450,450,,,,,,,,,,,,,,,,,,,,,,,,,,,,,,,,,,,
450,450,450,450,450,450,450,450,450,450,450,450,450,450,450,450,450,450,,,,,,,,,,,,,,,,,,,,,,,,,,,,,,,,,,,
450,450,450,450,450,450,450,450,450,450,450,450,450,450,450,450,450,450,,,,,,,,,,,,,,,,,,,,,,,,,,,,,,,,,,,
#,raw_row_delta_min,,,,,,,,,,,,,,,,,,,,,,,,,,,,,,,,,,,,,,,,,,,,,,,,,,
-450,-450,-450,-450,-450,-450,-450,-450,-450,-450,-450,-450,-450,-450,-450,-450,-450,-450,,,,,,,,,,,,,,,,,,,,,,,,,,,,,,,,,,,
-450,-450,-450,-450,-450,-450,-450,-450,-450,-450,-450,-450,-450,-450,-450,-450,-450,-450,,,,,,,,,,,,,,,,,,,,,,,,,,,,,,,,,,,
-450,-450,-450,-450,-450,-450,-450,-450,-450,-450,-450,-450,-450,-450,-450,-450,-450,-450,,,,,,,,,,,,,,,,,,,,,,,,,,,,,,,,,,,
-450,-450,-450,-450,-450,-450,-450,-450,-450,-450,-450,-450,-450,-450,-450,-450,-450,-450,,,,,,,,,,,,,,,,,,,,,,,,,,,,,,,,,,,
-450,-450,-450,-450,-450,-450,-450,-450,-450,-450,-450,-450,-450,-450,-450,-450,-450,-450,,,,,,,,,,,,,,,,,,,,,,,,,,,,,,,,,,,
-450,-450,-450,-450,-450,-450,-450,-450,-450,-450,-450,-450,-450,-450,-450,-450,-450,-450,,,,,,,,,,,,,,,,,,,,,,,,,,,,,,,,,,,
-450,-450,-450,-450,-450,-450,-450,-450,-450,-450,-450,-450,-450,-450,-450,-450,-450,-450,,,,,,,,,,,,,,,,,,,,,,,,,,,,,,,,,,,
-450,-450,-450,-450,-450,-450,-450,-450,-450,-450,-450,-450,-450,-450,-450,-450,-450,-450,,,,,,,,,,,,,,,,,,,,,,,,,,,,,,,,,,,
-450,-450,-450,-450,-450,-450,-450,-450,-450,-450,-450,-450,-450,-450,-450,-450,-450,-450,,,,,,,,,,,,,,,,,,,,,,,,,,,,,,,,,,,
-450,-450,-450,-450,-450,-450,-450,-450,-450,-450,-450,-450,-450,-450,-450,-450,-450,-450,,,,,,,,,,,,,,,,,,,,,,,,,,,,,,,,,,,
-450,-450,-450,-450,-450,-450,-450,-450,-450,-450,-450,-450,-450,-450,-450,-450,-450,-450,,,,,,,,,,,,,,,,,,,,,,,,,,,,,,,,,,,
-450,-450,-450,-450,-450,-450,-450,-450,-450,-450,-450,-450,-450,-450,-450,-450,-450,-450,,,,,,,,,,,,,,,,,,,,,,,,,,,,,,,,,,,
-450,-450,-450,-450,-450,-450,-450,-450,-450,-450,-450,-450,-450,-450,-450,-450,-450,-450,,,,,,,,,,,,,,,,,,,,,,,,,,,,,,,,,,,
-450,-450,-450,-450,-450,-450,-450,-450,-450,-450,-450,-450,-450,-450,-450,-450,-450,-450,,,,,,,,,,,,,,,,,,,,,,,,,,,,,,,,,,,
-450,-450,-450,-450,-450,-450,-450,-450,-450,-450,-450,-450,-450,-450,-450,-450,-450,-450,,,,,,,,,,,,,,,,,,,,,,,,,,,,,,,,,,,
-450,-450,-450,-450,-450,-450,-450,-450,-450,-450,-450,-450,-450,-450,-450,-450,-450,-450,,,,,,,,,,,,,,,,,,,,,,,,,,,,,,,,,,,
-450,-450,-450,-450,-450,-450,-450,-450,-450,-450,-450,-450,-450,-450,-450,-450,-450,-450,,,,,,,,,,,,,,,,,,,,,,,,,,,,,,,,,,,
-450,-450,-450,-450,-450,-450,-450,-450,-450,-450,-450,-450,-450,-450,-450,-450,-450,-450,,,,,,,,,,,,,,,,,,,,,,,,,,,,,,,,,,,
-450,-450,-450,-450,-450,-450,-450,-450,-450,-450,-450,-450,-450,-450,-450,-450,-450,-450,,,,,,,,,,,,,,,,,,,,,,,,,,,,,,,,,,,
-450,-450,-450,-450,-450,-450,-450,-450,-450,-450,-450,-450,-450,-450,-450,-450,-450,-450,,,,,,,,,,,,,,,,,,,,,,,,,,,,,,,,,,,
-450,-450,-450,-450,-450,-450,-450,-450,-450,-450,-450,-450,-450,-450,-450,-450,-450,-450,,,,,,,,,,,,,,,,,,,,,,,,,,,,,,,,,,,
-450,-450,-450,-450,-450,-450,-450,-450,-450,-450,-450,-450,-450,-450,-450,-450,-450,-450,,,,,,,,,,,,,,,,,,,,,,,,,,,,,,,,,,,
-450,-450,-450,-450,-450,-450,-450,-450,-450,-450,-450,-450,-450,-450,-450,-450,-450,-450,,,,,,,,,,,,,,,,,,,,,,,,,,,,,,,,,,,
-450,-450,-450,-450,-450,-450,-450,-450,-450,-450,-450,-450,-450,-450,-450,-450,-450,-450,,,,,,,,,,,,,,,,,,,,,,,,,,,,,,,,,,,
-450,-450,-450,-450,-450,-450,-450,-450,-450,-450,-450,-450,-450,-450,-450,-450,-450,-450,,,,,,,,,,,,,,,,,,,,,,,,,,,,,,,,,,,
-450,-450,-450,-450,-450,-450,-450,-450,-450,-450,-450,-450,-450,-450,-450,-450,-450,-450,,,,,,,,,,,,,,,,,,,,,,,,,,,,,,,,,,,
-450,-450,-450,-450,-450,-450,-450,-450,-450,-450,-450,-450,-450,-450,-450,-450,-450,-450,,,,,,,,,,,,,,,,,,,,,,,,,,,,,,,,,,,
-450,-450,-450,-450,-450,-450,-450,-450,-450,-450,-450,-450,-450,-450,-450,-450,-450,-450,,,,,,,,,,,,,,,,,,,,,,,,,,,,,,,,,,,
-450,-450,-450,-450,-450,-450,-450,-450,-450,-450,-450,-450,-450,-450,-450,-450,-450,-450,,,,,,,,,,,,,,,,,,,,,,,,,,,,,,,,,,,
-450,-450,-450,-450,-450,-450,-450,-450,-450,-450,-450,-450,-450,-450,-450,-450,-450,-450,,,,,,,,,,,,,,,,,,,,,,,,,,,,,,,,,,,
-450,-450,-450,-450,-450,-450,-450,-450,-450,-450,-450,-450,-450,-450,-450,-450,-450,-450,,,,,,,,,,,,,,,,,,,,,,,,,,,,,,,,,,,
-450,-450,-450,-450,-450,-450,-450,-450,-450,-450,-450,-450,-450,-450,-450,-450,-450,-450,,,,,,,,,,,,,,,,,,,,,,,,,,,,,,,,,,,
-450,-450,-450,-450,-450,-450,-450,-450,-450,-450,-450,-450,-450,-450,-450,-450,-450,-450,,,,,,,,,,,,,,,,,,,,,,,,,,,,,,,,,,,
-450,-450,-450,-450,-450,-450,-450,-450,-450,-450,-450,-450,-450,-450,-450,-450,-450,-450,,,,,,,,,,,,,,,,,,,,,,,,,,,,,,,,,,,
-450,-450,-450,-450,-450,-450,-450,-450,-450,-450,-450,-450,-450,-450,-450,-450,-450,-450,,,,,,,,,,,,,,,,,,,,,,,,,,,,,,,,,,,
-450,-450,-450,-450,-450,-450,-450,-450,-450,-450,-450,-450,-450,-450,-450,-450,-450,-450,,,,,,,,,,,,,,,,,,,,,,,,,,,,,,,,,,,
#,raw_col_delta_max,,,,,,,,,,,,,,,,,,,,,,,,,,,,,,,,,,,,,,,,,,,,,,,,,,
450,450,450,450,450,450,450,450,450,450,450,450,450,450,450,450,450,450,,,,,,,,,,,,,,,,,,,,,,,,,,,,,,,,,,,
450,450,450,450,450,450,450,450,450,450,450,450,450,450,450,450,450,450,,,,,,,,,,,,,,,,,,,,,,,,,,,,,,,,,,,
450,450,450,450,450,450,450,450,450,450,450,450,450,450,450,450,450,450,,,,,,,,,,,,,,,,,,,,,,,,,,,,,,,,,,,
450,450,450,450,450,450,450,450,450,450,450,450,450,450,450,450,450,450,,,,,,,,,,,,,,,,,,,,,,,,,,,,,,,,,,,
450,450,450,450,450,450,450,450,450,450,450,450,450,450,450,450,450,450,,,,,,,,,,,,,,,,,,,,,,,,,,,,,,,,,,,
450,450,450,450,450,450,450,450,450,450,450,450,450,450,450,450,450,450,,,,,,,,,,,,,,,,,,,,,,,,,,,,,,,,,,,
450,450,450,450,450,450,450,450,450,450,450,450,450,450,450,450,450,450,,,,,,,,,,,,,,,,,,,,,,,,,,,,,,,,,,,
450,450,450,450,450,450,450,450,450,450,450,450,450,450,450,450,450,450,,,,,,,,,,,,,,,,,,,,,,,,,,,,,,,,,,,
450,450,450,450,450,450,450,450,450,450,450,450,450,450,450,450,450,450,,,,,,,,,,,,,,,,,,,,,,,,,,,,,,,,,,,
450,450,450,450,450,450,450,450,450,450,450,450,450,450,450,450,450,450,,,,,,,,,,,,,,,,,,,,,,,,,,,,,,,,,,,
450,450,450,450,450,450,450,450,450,450,450,450,450,450,450,450,450,450,,,,,,,,,,,,,,,,,,,,,,,,,,,,,,,,,,,
450,450,450,450,450,450,450,450,450,450,450,450,450,450,450,450,450,450,,,,,,,,,,,,,,,,,,,,,,,,,,,,,,,,,,,
450,450,450,450,450,450,450,450,450,450,450,450,450,450,450,450,450,450,,,,,,,,,,,,,,,,,,,,,,,,,,,,,,,,,,,
450,450,450,450,450,450,450,450,450,450,450,450,450,450,450,450,450,450,,,,,,,,,,,,,,,,,,,,,,,,,,,,,,,,,,,
450,450,450,450,450,450,450,450,450,450,450,450,450,450,450,450,450,450,,,,,,,,,,,,,,,,,,,,,,,,,,,,,,,,,,,
450,450,450,450,450,450,450,450,450,450,450,450,450,450,450,450,450,450,,,,,,,,,,,,,,,,,,,,,,,,,,,,,,,,,,,
450,450,450,450,450,450,450,450,450,450,450,450,450,450,450,450,450,450,,,,,,,,,,,,,,,,,,,,,,,,,,,,,,,,,,,
450,450,450,450,450,450,450,450,450,450,450,450,450,450,450,450,450,450,,,,,,,,,,,,,,,,,,,,,,,,,,,,,,,,,,,
450,450,450,450,450,450,450,450,450,450,450,450,450,450,450,450,450,450,,,,,,,,,,,,,,,,,,,,,,,,,,,,,,,,,,,
450,450,450,450,450,450,450,450,450,450,450,450,450,450,450,450,450,450,,,,,,,,,,,,,,,,,,,,,,,,,,,,,,,,,,,
450,450,450,450,450,450,450,450,450,450,450,450,450,450,450,450,450,450,,,,,,,,,,,,,,,,,,,,,,,,,,,,,,,,,,,
450,450,450,450,450,450,450,450,450,450,450,450,450,450,450,450,450,450,,,,,,,,,,,,,,,,,,,,,,,,,,,,,,,,,,,
450,450,450,450,450,450,450,450,450,450,450,450,450,450,450,450,450,450,,,,,,,,,,,,,,,,,,,,,,,,,,,,,,,,,,,
450,450,450,450,450,450,450,450,450,450,450,450,450,450,450,450,450,450,,,,,,,,,,,,,,,,,,,,,,,,,,,,,,,,,,,
450,450,450,450,450,450,450,450,450,450,450,450,450,450,450,450,450,450,,,,,,,,,,,,,,,,,,,,,,,,,,,,,,,,,,,
450,450,450,450,450,450,450,450,450,450,450,450,450,450,450,450,450,450,,,,,,,,,,,,,,,,,,,,,,,,,,,,,,,,,,,
450,450,450,450,450,450,450,450,450,450,450,450,450,450,450,450,450,450,,,,,,,,,,,,,,,,,,,,,,,,,,,,,,,,,,,
450,450,450,450,450,450,450,450,450,450,450,450,450,450,450,450,450,450,,,,,,,,,,,,,,,,,,,,,,,,,,,,,,,,,,,
450,450,450,450,450,450,450,450,450,450,450,450,450,450,450,450,450,450,,,,,,,,,,,,,,,,,,,,,,,,,,,,,,,,,,,
450,450,450,450,450,450,450,450,450,450,450,450,450,450,450,450,450,450,,,,,,,,,,,,,,,,,,,,,,,,,,,,,,,,,,,
450,450,450,450,450,450,450,450,450,450,450,450,450,450,450,450,450,450,,,,,,,,,,,,,,,,,,,,,,,,,,,,,,,,,,,
450,450,450,450,450,450,450,450,450,450,450,450,450,450,450,450,450,450,,,,,,,,,,,,,,,,,,,,,,,,,,,,,,,,,,,
450,450,450,450,450,450,450,450,450,450,450,450,450,450,450,450,450,450,,,,,,,,,,,,,,,,,,,,,,,,,,,,,,,,,,,
450,450,450,450,450,450,450,450,450,450,450,450,450,450,450,450,450,450,,,,,,,,,,,,,,,,,,,,,,,,,,,,,,,,,,,
450,450,450,450,450,450,450,450,450,450,450,450,450,450,450,450,450,450,,,,,,,,,,,,,,,,,,,,,,,,,,,,,,,,,,,
450,450,450,450,450,450,450,450,450,450,450,450,450,450,450,450,450,450,,,,,,,,,,,,,,,,,,,,,,,,,,,,,,,,,,,
#,raw_col_delta_min,,,,,,,,,,,,,,,,,,,,,,,,,,,,,,,,,,,,,,,,,,,,,,,,,,
-450,-450,-450,-450,-450,-450,-450,-450,-450,-450,-450,-450,-450,-450,-450,-450,-450,-450,,,,,,,,,,,,,,,,,,,,,,,,,,,,,,,,,,,
-450,-450,-450,-450,-450,-450,-450,-450,-450,-450,-450,-450,-450,-450,-450,-450,-450,-450,,,,,,,,,,,,,,,,,,,,,,,,,,,,,,,,,,,
-450,-450,-450,-450,-450,-450,-450,-450,-450,-450,-450,-450,-450,-450,-450,-450,-450,-450,,,,,,,,,,,,,,,,,,,,,,,,,,,,,,,,,,,
-450,-450,-450,-450,-450,-450,-450,-450,-450,-450,-450,-450,-450,-450,-450,-450,-450,-450,,,,,,,,,,,,,,,,,,,,,,,,,,,,,,,,,,,
-450,-450,-450,-450,-450,-450,-450,-450,-450,-450,-450,-450,-450,-450,-450,-450,-450,-450,,,,,,,,,,,,,,,,,,,,,,,,,,,,,,,,,,,
-450,-450,-450,-450,-450,-450,-450,-450,-450,-450,-450,-450,-450,-450,-450,-450,-450,-450,,,,,,,,,,,,,,,,,,,,,,,,,,,,,,,,,,,
-450,-450,-450,-450,-450,-450,-450,-450,-450,-450,-450,-450,-450,-450,-450,-450,-450,-450,,,,,,,,,,,,,,,,,,,,,,,,,,,,,,,,,,,
-450,-450,-450,-450,-450,-450,-450,-450,-450,-450,-450,-450,-450,-450,-450,-450,-450,-450,,,,,,,,,,,,,,,,,,,,,,,,,,,,,,,,,,,
-450,-450,-450,-450,-450,-450,-450,-450,-450,-450,-450,-450,-450,-450,-450,-450,-450,-450,,,,,,,,,,,,,,,,,,,,,,,,,,,,,,,,,,,
-450,-450,-450,-450,-450,-450,-450,-450,-450,-450,-450,-450,-450,-450,-450,-450,-450,-450,,,,,,,,,,,,,,,,,,,,,,,,,,,,,,,,,,,
-450,-450,-450,-450,-450,-450,-450,-450,-450,-450,-450,-450,-450,-450,-450,-450,-450,-450,,,,,,,,,,,,,,,,,,,,,,,,,,,,,,,,,,,
-450,-450,-450,-450,-450,-450,-450,-450,-450,-450,-450,-450,-450,-450,-450,-450,-450,-450,,,,,,,,,,,,,,,,,,,,,,,,,,,,,,,,,,,
-450,-450,-450,-450,-450,-450,-450,-450,-450,-450,-450,-450,-450,-450,-450,-450,-450,-450,,,,,,,,,,,,,,,,,,,,,,,,,,,,,,,,,,,
-450,-450,-450,-450,-450,-450,-450,-450,-450,-450,-450,-450,-450,-450,-450,-450,-450,-450,,,,,,,,,,,,,,,,,,,,,,,,,,,,,,,,,,,
-450,-450,-450,-450,-450,-450,-450,-450,-450,-450,-450,-450,-450,-450,-450,-450,-450,-450,,,,,,,,,,,,,,,,,,,,,,,,,,,,,,,,,,,
-450,-450,-450,-450,-450,-450,-450,-450,-450,-450,-450,-450,-450,-450,-450,-450,-450,-450,,,,,,,,,,,,,,,,,,,,,,,,,,,,,,,,,,,
-450,-450,-450,-450,-450,-450,-450,-450,-450,-450,-450,-450,-450,-450,-450,-450,-450,-450,,,,,,,,,,,,,,,,,,,,,,,,,,,,,,,,,,,
-450,-450,-450,-450,-450,-450,-450,-450,-450,-450,-450,-450,-450,-450,-450,-450,-450,-450,,,,,,,,,,,,,,,,,,,,,,,,,,,,,,,,,,,
-450,-450,-450,-450,-450,-450,-450,-450,-450,-450,-450,-450,-450,-450,-450,-450,-450,-450,,,,,,,,,,,,,,,,,,,,,,,,,,,,,,,,,,,
-450,-450,-450,-450,-450,-450,-450,-450,-450,-450,-450,-450,-450,-450,-450,-450,-450,-450,,,,,,,,,,,,,,,,,,,,,,,,,,,,,,,,,,,
-450,-450,-450,-450,-450,-450,-450,-450,-450,-450,-450,-450,-450,-450,-450,-450,-450,-450,,,,,,,,,,,,,,,,,,,,,,,,,,,,,,,,,,,
-450,-450,-450,-450,-450,-450,-450,-450,-450,-450,-450,-450,-450,-450,-450,-450,-450,-450,,,,,,,,,,,,,,,,,,,,,,,,,,,,,,,,,,,
-450,-450,-450,-450,-450,-450,-450,-450,-450,-450,-450,-450,-450,-450,-450,-450,-450,-450,,,,,,,,,,,,,,,,,,,,,,,,,,,,,,,,,,,
-450,-450,-450,-450,-450,-450,-450,-450,-450,-450,-450,-450,-450,-450,-450,-450,-450,-450,,,,,,,,,,,,,,,,,,,,,,,,,,,,,,,,,,,
-450,-450,-450,-450,-450,-450,-450,-450,-450,-450,-450,-450,-450,-450,-450,-450,-450,-450,,,,,,,,,,,,,,,,,,,,,,,,,,,,,,,,,,,
-450,-450,-450,-450,-450,-450,-450,-450,-450,-450,-450,-450,-450,-450,-450,-450,-450,-450,,,,,,,,,,,,,,,,,,,,,,,,,,,,,,,,,,,
-450,-450,-450,-450,-450,-450,-450,-450,-450,-450,-450,-450,-450,-450,-450,-450,-450,-450,,,,,,,,,,,,,,,,,,,,,,,,,,,,,,,,,,,
-450,-450,-450,-450,-450,-450,-450,-450,-450,-450,-450,-450,-450,-450,-450,-450,-450,-450,,,,,,,,,,,,,,,,,,,,,,,,,,,,,,,,,,,
-450,-450,-450,-450,-450,-450,-450,-450,-450,-450,-450,-450,-450,-450,-450,-450,-450,-450,,,,,,,,,,,,,,,,,,,,,,,,,,,,,,,,,,,
-450,-450,-450,-450,-450,-450,-450,-450,-450,-450,-450,-450,-450,-450,-450,-450,-450,-450,,,,,,,,,,,,,,,,,,,,,,,,,,,,,,,,,,,
-450,-450,-450,-450,-450,-450,-450,-450,-450,-450,-450,-450,-450,-450,-450,-450,-450,-450,,,,,,,,,,,,,,,,,,,,,,,,,,,,,,,,,,,
-450,-450,-450,-450,-450,-450,-450,-450,-450,-450,-450,-450,-450,-450,-450,-450,-450,-450,,,,,,,,,,,,,,,,,,,,,,,,,,,,,,,,,,,
-450,-450,-450,-450,-450,-450,-450,-450,-450,-450,-450,-450,-450,-450,-450,-450,-450,-450,,,,,,,,,,,,,,,,,,,,,,,,,,,,,,,,,,,
-450,-450,-450,-450,-450,-450,-450,-450,-450,-450,-450,-450,-450,-450,-450,-450,-450,-450,,,,,,,,,,,,,,,,,,,,,,,,,,,,,,,,,,,
-450,-450,-450,-450,-450,-450,-450,-450,-450,-450,-450,-450,-450,-450,-450,-450,-450,-450,,,,,,,,,,,,,,,,,,,,,,,,,,,,,,,,,,,
-450,-450,-450,-450,-450,-450,-450,-450,-450,-450,-450,-450,-450,-450,-450,-450,-450,-450,,,,,,,,,,,,,,,,,,,,,,,,,,,,,,,,,,,
