{
"rollie/sa_dynamic_switch.xml":"20220609224500",
"rollie/net_predict.xml":"20220314105000",
"collie/CallRecoveryConfig.json":"20230701215501",
"collie/vonr_dynamic_switch.xml":"20230822110000",
"simollie/uicc_config.xml":"20230311152701"
}
