{
	"centerX" : 0.5,
	"centerY" : 0.5,
	"angle" : 0,
	"scale" : 1,
	"width" : 170,
	"height" : 57,
	"contents" : [{
			"type" : "image",
			"resource" : {
				"type" : "static",
				"path" : "res/i_love.png"
			},
			"centerX" : 0.237,
			"centerY" : 0.5,
			"width" : 90,
			"height" : 57,
			"angle" : 0,
			"scale" : 0.4455,
			"zorder" : 1
		},
		{
            "type": "text",
            "centerX": 0.707,
            "centerY": 0.5,
            "width": 60,
            "height": 40,
            "angle": 0,
            "color": "#ffffffff",
            "isVertical": 0,
			"alignment": 0,
			"editable":true,
            "text": "{LOCATION1}",
            "zorder": 2
        }
	]
}
