{
	"centerX" : 0.5,
	"centerY" : 0.5,
	"angle" : 0,
	"scale" : 1,
	"width" : 120,
	"height" : 160,
	"contents" : [
        {
			"type" : "image",
			"resource" : {
				"type" : "static",
				"path" : "res/altitude_2_logo.png"
			},
			"centerX" : 0.5,
			"centerY" : 0.34,
			"width" : 100,
			"height" : 95,
			"zorder" : 1
        },
        {
			"type" : "image",
			"resource" : {
				"type" : "static",
				"path" : "res/altitude_2_ic_location.png"
			},
			"centerX" : 0.10,
			"centerY" : 0.7,
			"width" : 10,
			"height" : 15,
			"zorder" : 1
        },
        {
            "type": "text",
            "centerX": 0.55,
            "centerY": 0.72,
            "width": 90,
            "height": 18,
            "angle": 0,
            "color": "#ffffffff",
            "isVertical": 0,
			"alignment": 1,
			"editable":true,
            "text": "{LOCATION}",
            "zorder": 2
        },
        {
            "type": "text",
            "centerX": 0.3,
            "centerY": 0.85,
            "width": 30,
            "height": 17,
            "angle": 0,
            "color": "#ffffffff",
            "isVertical": 0,
            "alignment": 0,
            "editable":true,
            "text": "{ALTITUDE}",
            "zorder": 2
        },
        {
            "type": "text",
            "centerX": 0.5,
            "centerY": 0.85,
            "width": 10,
            "height": 17,
            "angle": 0,
            "color": "#ffffffff",
            "isVertical": 0,
			"alignment": 0,
            "text": "m",
            "zorder": 2
        }
	]
}
