{
  "color": [
    {
      "name": "txt_today_number",
      "value": "#E5000000"
    },
	{
		"name":"container_background",
		"value":"#FFFFFF"
	},
	{
		"name":"car_container_background",
		"value":"#B21A1A1A"
	}
  ]
}