{
  "CAP_PARA_AntiTouchCallback": {
    "value": {
      "AntiTouchFlat": "AntiTouchNone",
      "AntiTouchFold": "AntiTouchNone"
    }
  },
  "FP_IsSupportEarlyReturnOnError": {
    "value": false
  },
  "FP_IsSupportImageDump": {
    "value": false
  },
  "FP_IsSupportSensorhub": {
    "value": false
  },
  "UD_IsSupportCheckCalibrationData": {
    "value": false
  },
  "UD_IsSupportDumpDataSilead": {
    "value": false
  },
  "UD_IsSupportTaDynamicLib": {
    "value": false
  },
  "UD_IsSupportUserCalibration": {
    "value": false
  },
  "UD_IsSupportedFactoryStorage": {
    "value": false
  },
  "UD_PARA_AodDbv": {
    "value": -1
  },
  "UD_PARA_BeforeCaptureDelay": {
    "value": {
      "LowTemp": [
        120,
        5,
        120,
        0
      ],
      "NormalTemp": [
        50,
        5,
        50,
        0
      ]
    }
  },
  "UD_PARA_CalibrationType": {
    "value": "RESERVED_CALIBRATION"
  },
  "UD_PARA_DelayBeforeCaptureMmi": {
    "value": 0
  },
  "UD_PARA_FirstEnrollDelay": {
    "value": 0
  },
  "UD_PARA_HighlightDbv": {
    "value": -1
  },
  "UD_PARA_HighlightSizeRatio": {
    "value": 1.0
  },
  "UD_PARA_LogoSize": {
    "value": -1
  },
  "UD_PARA_MmiBrightness": {
    "value": [
      0,
      0
    ]
  },
  "UD_PARA_MmiDbv": {
    "value": -1
  },
  "UD_PARA_ScreenHiddenInfoMapper": {
    "value": []
  },
  "UD_PARA_SensorConfig": {
    "value": []
  },
  "cap_cali_data_is_ok": {
    "value": true
  },
  "cap_need_remap_identify_result_4_6": {
    "value": true
  },
  "cap_need_return_low_quality": {
    "value": false
  },
  "cap_para_is_bad_image": {
    "value": [
      30,
      20
    ]
  },
  "cap_rm_templates_support": {
    "value": true
  },
  "cap_support_apns": {
    "value": false
  },
  "cap_support_dynamiclib": {
    "value": false
  },
  "cap_support_slide_enroll": {
    "value": false
  },
  "fp_face_recognization_support": {
    "value": false
  },
  "fp_face_support_angle_judge": {
    "value": false
  },
  "fp_sensor_frequency": {
    "value": 0
  },
  "fp_type": {
    "value": "FP_UD_OPTICAL"
  },
  "ud_mmie_para_name_use_id": {
    "value": true
  },
  "ud_need_low_power_deep_sleep": {
    "value": true
  },
  "ud_need_wait_tp_stable": {
    "value": false
  },
  "ud_para_ai_spoof": {
    "value": []
  },
  "ud_para_enroll_fake_press_times": {
    "value": 10
  },
  "ud_para_highlight_color": {
    "value": 16777215
  },
  "ud_para_logo_position": {
    "value": []
  },
  "ud_para_mmie_location_cirle": {
    "value": []
  },
  "ud_silead_factory_data_need_append_dumpsuffix": {
    "value": true
  },
  "ud_support_2p_3p": {
    "value": false
  },
  "ud_support_face_recognization_fingerup": {
    "value": false
  },
  "ud_support_mmie_para": {
    "value": false
  },
  "ud_support_pressure_adjust": {
    "value": false
  },
  "ud_support_unlock_learning": {
    "value": false
  },
  "yaml_debug_simplify_json": {
    "value": false
  },
  "yaml_description": {
    "value": "base config file, modify by lengxuntai 00294297 on 2022.4.1"
  }
}
