4
0, 0, 1.069451718, 0.607465216, 0, 0, 0, 0, 0, 0, 1, 1, 1, 0, 0, 0, 0, 0,
1, 0, 1.069745034, 0.441543041, 0, 0, 0, 0, 0, 0, 1, 1, 1, 0, 0, 0, 0, 0,
2, 0, 0.941090105, 1.179959886, 0, 0, 0, 0, 0, 0, 1, 1, 1, 0, 0, 0, 0, 0,
3, 0, 0.898157271, 1.265990864, 0, 0, 0, 0, 0, 0, 1, 1, 1, 0, 0, 0, 0, 0,
7
0, 0, 0.819702848, 0.894820762, 0, 0, 0, 0, 0, 0, 1, 1, 1, 0, 0, 0, 0, 0,
1, 0, 0.836100462, 0.707138692, 0, 0, 0, 0, 0, 0, 1, 1, 1, 0, 0, 0, 0, 0,
2, 0, 0.834869886, 0.777436813, 0, 0, 0, 0, 0, 0, 1, 1, 1, 0, 0, 0, 0, 0,
3, 0, 0.804944865, 0.627719989, 0, 0, 0, 0, 0, 0, 1, 1, 1, 0, 0, 0, 0, 0,
4, 0, 0.753724898, 0.840877542, 0, 0, 0, 0, 0, 0, 1, 1, 1, 0, 0, 0, 0, 0,
5, 0, 0.747065106, 0.691763616, 0, 0, 0, 0, 0, 0, 1, 1, 1, 0, 0, 0, 0, 0,
6, 0, 0.705660858, 1.020379957, 0, 0, 0, 0, 0, 0, 1, 1, 1, 0, 0, 0, 0, 0,
