{
    "id":"tasty",
    "title_id":"story_template_title_delicous",
    "music":"Resource/music/out.aac",
    "template_desc_id": "tasty_template_desc",
    "segments":[
        {
            "camera_id":0,
            "duration":2.9,
            "demo_offset":[0,2.4],
            "audio_offset":0,
            "clip_desc_id": "auto_shoot_video",
            "algo_scripts":{
                "operation_mode":"panning",
                "operation_param":"20,50,80,50"
            },
            "holder_scripts":{
                "delay_before_shoot_pos":0.5,
                "gimbal_before_shoot_pos":[0,0.2,0,0,-15,1],
                "gimbal_start_pos":[0,0.2,0,0,0,1],
                "gimbal_move":[
                    [0.5,2.9,0,0,15,1]
                ]
            }
        },
        {
            "camera_id":0,
            "duration":3.1,
            "demo_offset":[3.3,5.2],
            "audio_offset":2.7,
            "clip_desc_id": "party_clip_desc_3",
            "algo_scripts":{
			    "operation_mode":"zoom",
                "operation_param":"2,2"
            },
            "holder_scripts":{
            }
        },
        {
            "camera_id":0,
            "duration":2.3,
            "demo_offset":[5.8,7.4],
            "audio_offset":5.4,
            "clip_desc_id": "auto_shoot_video",
            "algo_scripts":{
                "operation_mode":"panning",
                "operation_param":"80,50,20,50"
            },
            "holder_scripts":{
                "delay_before_shoot_pos":0.5,
                "gimbal_before_shoot_pos":[0,0.2,0,0,15,1],
                "gimbal_start_pos":[0,0.2,0,0,0,1],
                "gimbal_move":[
                    [0.5,2.3,0,0,-15,1]
                ]
            }
        },
        {
            "camera_id":0,
            "duration":3.2,
            "demo_offset":[7.9,10.6],
            "audio_offset":7.5,
            "clip_desc_id": "auto_shoot_video",
            "algo_scripts":{
                "operation_mode":"zoom",
                "operation_param":"1,1.8"
            },
            "holder_scripts":{
            }
        },
        {
            "camera_id":0,
            "duration":4.1,
            "demo_offset":[11.5,15],
            "audio_offset":10.9,
            "clip_desc_id": "party_clip_desc_2",
            "algo_scripts":{
			    "operation_mode":"zoom",
                "operation_param":"1,1"
            },
            "holder_scripts":{
            }
        }
    ]
}