{
    "config": {
        "hw_platform": ["QRD"],
        "soc_id": ["501", "415", "439", "502", "456", "515"]
    },
    "sns_motion": {
        "owner": "sns_motion",
        ".config": {
            "owner": "sns_motion",
            "phone_shape": {"type": "int", "ver": "0", "data": "1"}
        },
        ".tilt_tolerance": {
            "owner": "sns_motion",
            "data_0": {"type": "int","ver": "0","data": "-50"},
            "data_1": {"type": "int","ver": "0","data": "60"},
            "data_2": {"type": "int","ver": "0","data": "-50"},
            "data_3": {"type": "int","ver": "0","data": "45"},
            "data_4": {"type": "int","ver": "0","data": "-50"},
            "data_5": {"type": "int","ver": "0","data": "60"},
            "data_6": {"type": "int","ver": "0","data": "-50"},
            "data_7": {"type": "int","ver": "0","data": "45"}
        }
    }
}