{
  "config":{
    "hw_platform": ["QRD"],
    "soc_id": ["515"]
  },

  "sns_dynamic_libraries":
  {
    "owner": "dynamic_sensor",
    "detect_on_every_boot":{ "type": "int", "ver": "0",
        "data": "1"
    },
    ".lib0":
    {
      "owner": "dynamic_sensor",
      "name":{ "type": "str", "ver": "0",
        "data": "sns_mir3da_normal.so"
      },
      "reg_fun":{ "type": "str", "ver": "0",
        "data": "sns_register_mir3da"
      },
      "reg_cnt":{ "type": "int", "ver": "0",
        "data": "1"
      }
    },
    ".lib1":
    {
      "owner": "dynamic_sensor",
      "name":{ "type": "str", "ver": "0",
        "data": "sns_lis2dw12_normal.so"
      },
      "reg_fun":{ "type": "str", "ver": "0",
        "data": "sns_register_lis2dw12"
      },
      "reg_cnt":{ "type": "int", "ver": "0",
        "data": "1"
      }
    },
     ".lib2":
    {
      "owner": "dynamic_sensor",
      "name":{ "type": "str", "ver": "0",
        "data": "sns_icm206xx_normal.so"
      },
      "reg_fun":{ "type": "str", "ver": "0",
        "data": "sns_register_icm206xx"
      },
      "reg_cnt":{ "type": "int", "ver": "0",
        "data": "1"
      }
    },
    ".lib3":
    {
      "owner": "dynamic_sensor",
      "name":{ "type": "str", "ver": "0",
        "data": "sns_tcs3718_normal.so"
      },
      "reg_fun":{ "type": "str", "ver": "0",
        "data": "sns_register_tcs3718"
      },
      "reg_cnt":{ "type": "int", "ver": "0",
        "data": "1"
      }
    }
  }
}
