invalid_node_num,,,,,,,,,,,,,
0,,,,,,,,,,,,,
invalid_nodes,,,,,,,,,,,,,
0,0,0,0,1,1,5,5,6,6,6,6,,
0,1,5,6,0,6,0,6,0,1,5,6,,
reset_test_enable,,,,,,,,,,,,,
1,,,,,,,,,,,,,
int_test_enable,,,,,,,,,,,,,
1,,,,,,,,,,,,,
raw_test_enable,,,,,,,,,,,,,
1,,,,,,,,,,,,,
raw_test_frame,,,,,,,,,,,,,
1,,,,,,,,,,,,,
mutual_raw_limit_max,,,,,,,,,,,,,
65535,65535,10178,9904,8972,65535,65535,,,,,,,
65535,10604,9870,9342,8834,11049,65535,,,,,,,
13667,11697,9846,10164,8924,11908,14924,,,,,,,
14007,11225,9842,10177,8963,11388,15401,,,,,,,
13687,11150,9780,10100,8984,11452,15255,,,,,,,
65535,10589,9460,8872,8889,11283,65535,,,,,,,
65535,65535,9814,9522,9664,65535,65535,,,,,,,
mutual_raw_limit_min,,,,,,,,,,,,,
0,0,5858,5095,4822,0,0,,,,,,,
0,5980,5674,5118,4765,6222,0,,,,,,,
7521,6630,5653,5937,4817,6791,8337,,,,,,,
7718,6319,5645,5963,4839,6411,8577,,,,,,,
7538,6270,5600,5915,4853,6443,8486,,,,,,,
0,5938,5415,4763,4784,6372,0,,,,,,,
0,0,5601,5092,5204,0,0,,,,,,,
self_raw_limit_max,,,,,,,,,,,,,
9000,9000,9000,9000,9000,9000,9000,9000,9000,9000,9000,9000,9000,9000
self_raw_limit_min,,,,,,,,,,,,,
3500,3500,3500,3500,3500,3500,3500,3500,3500,3500,3500,3500,3500,3500
sram_test_enable,,,,,,,,,,,,,
1,,,,,,,,,,,,,
deviation_test_enable,,,,,,,,,,,,,
1,,,,,,,,,,,,,
deviation_test_frame,,,,,,,,,,,,,
1,,,,,,,,,,,,,
mutual_deviation_limit,,,,,,,,,,,,,
65535,65535,600,600,600,65535,65535,,,,,,,
65535,600,600,600,600,600,65535,,,,,,,
600,600,600,600,600,600,600,,,,,,,
600,600,600,600,600,600,600,,,,,,,
600,600,600,600,600,600,600,,,,,,,
65535,600,600,600,600,600,65535,,,,,,,
65535,65535,600,600,600,65535,65535,,,,,,,
mutual_deviation_limit_m,,,,,,,,,,,,,
65535,65535,15000,15000,65535,65535,,,,,,,,
65535,15000,15000,15000,15000,65535,,,,,,,,
15000,15000,15000,15000,15000,15000,,,,,,,,
15000,15000,15000,15000,15000,15000,,,,,,,,
15000,15000,15000,15000,15000,15000,,,,,,,,
65535,15000,15000,15000,15000,65535,,,,,,,,
65535,65535,15000,15000,65535,65535,,,,,,,,
mutual_deviation_limit_n,,,,,,,,,,,,,
65535,65535,15000,15000,15000,65535,65535,,,,,,,
65535,15000,15000,15000,15000,15000,65535,,,,,,,
15000,15000,15000,15000,15000,15000,15000,,,,,,,
15000,15000,15000,15000,15000,15000,15000,,,,,,,
65535,15000,15000,15000,15000,15000,65535,,,,,,,
65535,65535,15000,15000,15000,65535,65535,,,,,,,
self_deviation_limit,,,,,,,,,,,,,
9000,9000,9000,9000,9000,9000,9000,9000,9000,9000,9000,9000,9000,9000
signle_drv_test_enable,,,,,,,,,,,,,
1,,,,,,,,,,,,,
single_drv_limit_max,,,,,,,,,,,,,
65535,65535,4000,4000,4000,65535,65535,,,,,,,
65535,4000,4000,4000,4000,4000,65535,,,,,,,
4000,4000,4000,4000,4000,4000,4000,,,,,,,
4000,4000,4000,4000,4000,4000,4000,,,,,,,
4000,4000,4000,4000,4000,4000,4000,,,,,,,
65535,4000,4000,4000,4000,4000,65535,,,,,,,
65535,65535,4000,4000,4000,65535,65535,,,,,,,
single_drv_limit_min,,,,,,,,,,,,,
0,0,1000,1000,1000,0,0,,,,,,,
0,1000,1000,1000,1000,1000,0,,,,,,,
1000,1000,1000,1000,1000,1000,1000,,,,,,,
1000,1000,1000,1000,1000,1000,1000,,,,,,,
1000,1000,1000,1000,1000,1000,1000,,,,,,,
0,1000,1000,1000,1000,1000,0,,,,,,,
0,0,1000,1000,1000,0,0,,,,,,,
noise_test_enable,,,,,,,,,,,,,
1,,,,,,,,,,,,,
noise_test_frame,,,,,,,,,,,,,
20,,,,,,,,,,,,,
noise_test_frame_ignore,,,,,,,,,,,,,
10,,,,,,,,,,,,,
mutual_noise_limit,,,,,,,,,,,,,
65535,65535,120,120,120,65535,65535,,,,,,,
65535,120,120,120,120,120,65535,,,,,,,
120,120,120,120,120,120,120,,,,,,,
120,120,120,120,120,120,120,,,,,,,
120,120,120,120,120,120,120,,,,,,,
65535,120,120,120,120,120,65535,,,,,,,
65535,65535,120,120,120,65535,65535,,,,,,,
self_noise_limit,,,,,,,,,,,,,
800,800,800,800,800,800,800,800,800,800,800,800,800,800
open_test_enable,,,,,,,,,,,,,
1,,,,,,,,,,,,,
open_limit_max,,,,,,,,,,,,,
65535,65535,2552,2512,2250,65535,65535,,,,,,,
65535,2783,2468,2329,2207,2898,65535,,,,,,,
3692,2924,2464,2552,2232,2977,4180,,,,,,,
3759,2932,2463,2552,2241,2999,4290,,,,,,,
3668,2907,2448,2533,2244,3014,4245,,,,,,,
65535,2732,2365,2210,2221,2924,65535,,,,,,,
65535,65535,2454,2376,2412,65535,65535,,,,,,,
open_limit_min,,,,,,,,,,,,,
0,0,1527,1501,1346,0,0,,,,,,,
0,1665,1477,1391,1320,1736,0,,,,,,,
2211,1750,1476,1528,1335,1783,2503,,,,,,,
2250,1754,1474,1527,1340,1795,2568,,,,,,,
2194,1739,1465,1516,1343,1805,2543,,,,,,,
0,1634,1416,1321,1329,1751,0,,,,,,,
0,0,1469,1421,1442,0,0,,,,,,,
short_test_enable,,,,,,,,,,,,,
1,,,,,,,,,,,,,
short_threshold,,,,,,,,,,,,,
700,700,700,700,700,700,700,700,700,700,700,700,700,700
end,,,,,,,,,,,,,
