{
  "config":{
    "hw_platform": ["HDK"],
    "soc_id": ["439"],
    "platform_subtype_id": ["1"]
  },
    "sx932x_0":{
    "owner": "sns_sx932x",
    ".sar":{
      "owner": "sns_sx932x",
      ".config":{
        "owner": "sns_sx932x",
        "is_dri":{ "type": "int", "ver": "0",
          "data": "1"
        },
        "hw_id":{ "type": "int", "ver": "0",
          "data": "0"
        },
        "res_idx":{ "type": "int", "ver": "0",
          "data": "2"
        },
        "sync_stream":{ "type": "int", "ver": "0",
          "data": "0"
        }
      }
    }
  },
  "sx932x_0_platform":{
    "owner": "sns_sx932x",
    ".config":{
      "owner": "sns_sx932x",
      "bus_type":{ "type": "int", "ver": "0",
        "data": "0"
      },
      "bus_instance":{ "type": "int", "ver": "0",
        "data": "5"
      },
      "slave_config":{ "type": "int", "ver": "0",
        "data": "40"
      },
      "max_bus_speed_khz":{ "type": "int", "ver": "0",
        "data": "400"
      },
      "reg_addr_type":{ "type": "int", "ver": "0",
        "data": "0"
      },
      "dri_irq_num":{ "type": "int", "ver": "0",
        "data": "91"
      },
      "irq_pull_type":{ "type": "int", "ver": "0",
        "data": "3"
      },
      "irq_is_chip_pin":{ "type": "int", "ver": "0",
        "data": "1"
      },
      "irq_drive_strength":{ "type": "int", "ver": "0",
        "data": "0"
      },
      "irq_trigger_type":{ "type": "int", "ver": "0",
        "data": "4"
      },
      "num_rail":{ "type": "int", "ver": "0",
        "data": "1"
      },
      "rail_on_state":{ "type": "int", "ver": "0",
        "data": "1"
      },
      "vddio_rail":{ "type": "str", "ver": "0",
        "data": "/pmic/client/sensor_vddio"
      },
      "rigid_body_type":{ "type": "int", "ver": "0",
      "data": "0"
      }
    },
    ".temp":{
      "owner": "sns_sx932x",
      ".fac_cal":
      {
        "owner": "sns_sx932x",
        ".scale":{
          "owner": "sns_sx932x",
          "x":{ "type": "flt", "ver": "0",
            "data": "1.0"
          }
        },
        ".bias":{
          "owner": "sns_sx932x",
          "x":{ "type": "flt", "ver": "0",
            "data": "0.0"
          }
        }
      }
    },
    ".sar":{
      "owner": "sns_sx932x",
      ".fac_cal":
      {
        "owner": "sns_sx932x",
        ".scale":{
          "owner": "sns_sx932x",
          "x":{ "type": "flt", "ver": "0",
            "data": "1.0"
          }
        },
        ".bias":{
          "owner": "sns_sx932x",
          "x":{ "type": "flt", "ver": "0",
            "data": "0.0"
          }
        }
      }
    },
    ".placement":{
      "owner": "sns_sx932x",
      "0":{ "type": "flt", "ver": "0",
        "data": "0.0"
      },
      "1":{ "type": "flt", "ver": "0",
        "data": "0.0"
      },
      "2":{ "type": "flt", "ver": "0",
        "data": "0.0"
      },
      "3":{ "type": "flt", "ver": "0",
        "data": "0.0"
      },
      "4":{ "type": "flt", "ver": "0",
        "data": "0.0"
      },
      "5":{ "type": "flt", "ver": "0",
        "data": "0.0"
      },
      "6":{ "type": "flt", "ver": "0",
        "data": "0.0"
      },
      "7":{ "type": "flt", "ver": "0",
        "data": "0.0"
      },
      "8":{ "type": "flt", "ver": "0",
        "data": "0.0"
      },
      "9":{ "type": "flt", "ver": "0",
        "data": "0.0"
      },
      "10":{ "type": "flt", "ver": "0",
        "data": "0.0"
      },
      "11":{ "type": "flt", "ver": "0",
        "data": "0.0"
      }
    },
    ".thresh":{
      "owner": "sns_sx932x",
      "threshold_0":{ "type": "flt", "ver": "0",
        "data": "51.0"
      },
      "threshold_1":{ "type": "flt", "ver": "0",
        "data": "51.0"
      },
      "threshold_2":{ "type": "flt", "ver": "0",
        "data": "51.0"
      },
      "threshold_3":{ "type": "flt", "ver": "0",
        "data": "51.0"
      }
    },
    ".offset":{
      "owner": "sns_sx932x",
      "0":{ "type": "flt", "ver": "0",
        "data": "0.0"
      },
      "1":{ "type": "flt", "ver": "0",
        "data": "0.0"
      },
     "2":{ "type": "flt", "ver": "0",
        "data": "0.0"
      },
      "3":{ "type": "flt", "ver": "0",
        "data": "0.0"
      }
    },
    ".register":{
      "owner": "sns_sx932x",
      "Is_config":{ "type": "int", "ver": "0",
        "data": "1"
      },
      "RegAFEPH0_0x28":{ "type": "int", "ver": "0",
        "data": "40"
      },
      "RegAFEPH0":{ "type": "int", "ver": "0",
        "data": "0"
      },
      "RegAFEPH1_0x29":{ "type": "int", "ver": "0",
        "data": "41"
      },
      "RegAFEPH1":{ "type": "int", "ver": "0",
        "data": "1"
      },
      "RegAFEPH2_0x2A":{ "type": "int", "ver": "0",
        "data": "42"
      },
      "RegAFEPH2":{ "type": "int", "ver": "0",
        "data": "39"
      },
      "RegAFEPH3_0x2B":{ "type": "int", "ver": "0",
        "data": "43"
      },
      "RegAFEPH3":{ "type": "int", "ver": "0",
        "data": "0"
      },
      "RegAFECTR4_0x24":{ "type": "int", "ver": "0",
        "data": "36"
      },
      "RegAFECTR4":{ "type": "int", "ver": "0",
        "data": "0"
      },
      "RegAFECTR7_0x27":{ "type": "int", "ver": "0",
        "data": "39"
      },
      "RegAFECTR7":{ "type": "int", "ver": "0",
        "data": "71"
      },
      "RegAFECTR3_0x23":{ "type": "int", "ver": "0",
        "data": "35"
      },
      "RegAFECTR3":{ "type": "int", "ver": "0",
        "data": "0"
      },
      "RegAFECTR6_0x26":{ "type": "int", "ver": "0",
        "data": "38"
      },
      "RegAFECTR6":{ "type": "int", "ver": "0",
        "data": "0"
      },
      "RegAFECTR8_0x2C":{ "type": "int", "ver": "0",
        "data": "44"
      },
      "RegAFECTR8":{ "type": "int", "ver": "0",
        "data": "18"
      },
      "RegAFECTR9_0x2D":{ "type": "int", "ver": "0",
        "data": "45"
      },
      "RegAFECTR9":{ "type": "int", "ver": "0",
        "data": "6"
      },
      "RegPROCTR0_0x30":{ "type": "int", "ver": "0",
        "data": "48"
      },
      "RegPROCTR0":{ "type": "int", "ver": "0",
        "data": "0"
      },
      "RegPROCTR1_0x31":{ "type": "int", "ver": "0",
        "data": "49"
      },
      "RegPROCTR1":{ "type": "int", "ver": "0",
        "data": "33"
      },
      "RegPROCTR4_0x34":{ "type": "int", "ver": "0",
        "data": "52"
      },
      "RegPROCTR4":{ "type": "int", "ver": "0",
        "data": "13"
      },
      "RegPROCTR5_0x35":{ "type": "int", "ver": "0",
        "data": "53"
      },
      "RegPROCTR5":{ "type": "int", "ver": "0",
        "data": "8"
      },
      "RegPROCTR6_0x36":{ "type": "int", "ver": "0",
        "data": "54"
      },
      "RegPROCTR6":{ "type": "int", "ver": "0",
        "data": "0"
      },
      "RegPROCTR7_0x37":{ "type": "int", "ver": "0",
        "data": "55"
      },
      "RegPROCTR7":{ "type": "int", "ver": "0",
        "data": "10"
      },
      "RegADVCTR2_0x42":{ "type": "int", "ver": "0",
        "data": "66"
      },
      "RegADVCTR2":{ "type": "int", "ver": "0",
        "data": "0"
      },
      "RegADVCTR3_0x43":{ "type": "int", "ver": "0",
        "data": "67"
      },
      "RegADVCTR3":{ "type": "int", "ver": "0",
        "data": "0"
      },
      "RegADVCTR4_0x44":{ "type": "int", "ver": "0",
        "data": "68"
      },
      "RegADVCTR4":{ "type": "int", "ver": "0",
        "data": "0"
      },
      "RegIRFQSrc_0x00":{ "type": "int", "ver": "0",
        "data": "0"
      },
      "RegIRFQSrc":{ "type": "int", "ver": "0",
        "data": "0"
      },
      "RegIrqMsk_0x05":{ "type": "int", "ver": "0",
        "data": "5"
      },
      "RegIrqMsk":{ "type": "int", "ver": "0",
        "data": "0"
      },
      "RegGnrlCtrl1_0x11":{ "type": "int", "ver": "0",
        "data": "17"
      },
      "RegGnrlCtrl1":{ "type": "int", "ver": "0",
        "data": "36"
      }
    }
  }
}
