{
  "config":{
    "hw_platform": ["MTP", "Surf", "RCM", "QRD", "HDK"],
    "soc_id": ["415", "439", "456", "502", "501"],
    "board_name": ["BAL_AL00_VA"]
  },
  "bmi26x_0":{
    "owner": "bmi26x",
    ".accel":{
      "owner": "bmi26x",
      ".config":{
        "owner": "bmi26x",
        "is_dri":{ "type": "int", "ver": "0",
          "data": "1"
        },
        "hw_id":{ "type": "int", "ver": "0",
          "data": "0"
        },
        "res_idx":{ "type": "int", "ver": "0",
          "data": "2"
        },
        "sync_stream":{ "type": "int", "ver": "0",
          "data": "0"
        }
      }
    },
    ".gyro":{
      "owner": "bmi26x",
      ".config":{
        "owner": "bmi26x",
        "is_dri":{ "type": "int", "ver": "0",
          "data": "1"
        },
        "hw_id":{ "type": "int", "ver": "0",
          "data": "0"
        },
        "res_idx":{ "type": "int", "ver": "0",
          "data": "4"
        },
        "sync_stream":{ "type": "int", "ver": "0",
          "data": "0"
        }
      }
    },
    ".md":{
      "owner": "bmi26x",
      ".config":{
        "owner": "bmi26x",
        "is_dri":{ "type": "int", "ver": "0",
          "data": "1"
        },
        "hw_id":{ "type": "int", "ver": "0",
          "data": "0"
        },
        "res_idx":{ "type": "int", "ver": "0",
          "data": "0"
        },
        "sync_stream":{ "type": "int", "ver": "0",
          "data": "0"
        }
      }
    },
    ".temp":{
      "owner": "bmi26x",
      ".config":{
        "owner": "bmi26x",
        "is_dri":{ "type": "int", "ver": "0",
          "data": "0"
        },
        "hw_id":{ "type": "int", "ver": "0",
          "data": "0"
        },
        "res_idx":{ "type": "int", "ver": "0",
          "data": "2"
        },
        "sync_stream":{ "type": "int", "ver": "0",
          "data": "0"
        }
      }
    }
  },
  "bmi26x_0_platform":{
    "owner": "bmi26x",
    ".config":{
      "owner": "bmi26x",
      "bus_type":{ "type": "int", "ver": "0",
        "data": "5"
      },
      "bus_instance":{ "type": "int", "ver": "0",
        "data": "1"
      },
      "slave_config":{ "type": "int", "ver": "0",
        "data": "104"
      },
      "i3c_address":{ "type": "int", "ver": "0",
        "data": "10"
      },
      "min_bus_speed_khz":{ "type": "int", "ver": "0",
        "data": "400"
      },
      "max_bus_speed_khz":{ "type": "int", "ver": "0",
        "data": "400"
      },
      "reg_addr_type":{ "type": "int", "ver": "0",
        "data": "0"
      },
      "dri_irq_num":{ "type": "int", "ver": "0",
        "data": "46"
      },
      "irq_pull_type":{ "type": "int", "ver": "0",
        "data": "3"
      },
      "irq_is_chip_pin":{ "type": "int", "ver": "0",
        "data": "1"
      },
      "irq_drive_strength":{ "type": "int", "ver": "0",
        "data": "4"
      },
      "irq_trigger_type":{ "type": "int", "ver": "0",
        "data": "0"
      },
      "num_rail":{ "type": "int", "ver": "0",
        "data": "1"
      },
      "rail_on_state":{ "type": "int", "ver": "0",
        "data": "2"
      },
      "vdd_rail":{ "type": "str", "ver": "0",
        "data": "/pmic/client/sensor_vdd"
      },
      "vddio_rail":{ "type": "str", "ver": "0",
        "data": "/pmic/client/sensor_vddio"
      },
      "rigid_body_type":{ "type": "int", "ver": "0",
        "data": "0"
      },
      "min_odr":{ "type": "int", "ver": "0",
        "data": "20"
      },
      "max_odr":{ "type": "int", "ver": "0",
        "data": "500"
      }
    },
    ".orient":{
      "owner": "bmi26x",
      "x":{ "type": "str", "ver": "0",
        "data": "+x"
      },
      "y":{ "type": "str", "ver": "0",
        "data": "-y"
      },
      "z":{ "type": "str", "ver": "0",
        "data": "+z"
      }
    },
    ".gyro":{
      "owner": "bmi26x",
      ".fac_cal":{
        "owner": "bmi26x",
        ".corr_mat":{
          "owner": "bmi26x",
          "0_0":{ "type": "flt", "ver": "0",
            "data": "1.0"
          },
          "0_1":{ "type": "flt", "ver": "0",
            "data": "0.0"
          },
          "0_2":{ "type": "flt", "ver": "0",
            "data": "0.0"
          },
          "1_0":{ "type": "flt", "ver": "0",
            "data": "0.0"
          },
          "1_1":{ "type": "flt", "ver": "0",
            "data": "1.0"
          },
          "1_2":{ "type": "flt", "ver": "0",
            "data": "0.0"
          },
          "2_0":{ "type": "flt", "ver": "0",
            "data": "0.0"
          },
          "2_1":{ "type": "flt", "ver": "0",
            "data": "0.0"
          },
          "2_2":{ "type": "flt", "ver": "0",
            "data": "1.0"
          }
        },
        ".bias":{
          "owner": "bmi26x",
          "x":{ "type": "flt", "ver": "0",
            "data": "0.0"
          },
          "y":{ "type": "flt", "ver": "0",
            "data": "0.0"
          },
          "z":{ "type": "flt", "ver": "0",
            "data": "0.0"
          }
        }
      }
    },
    ".accel":{
      "owner": "bmi26x",
      ".fac_cal":{
        "owner": "bmi26x",
        ".corr_mat":{
          "owner": "bmi26x",
          "0_0":{ "type": "flt", "ver": "0",
            "data": "1.0"
          },
          "0_1":{ "type": "flt", "ver": "0",
            "data": "0.0"
          },
          "0_2":{ "type": "flt", "ver": "0",
            "data": "0.0"
          },
          "1_0":{ "type": "flt", "ver": "0",
            "data": "0.0"
          },
          "1_1":{ "type": "flt", "ver": "0",
            "data": "1.0"
          },
          "1_2":{ "type": "flt", "ver": "0",
            "data": "0.0"
          },
          "2_0":{ "type": "flt", "ver": "0",
            "data": "0.0"
          },
          "2_1":{ "type": "flt", "ver": "0",
            "data": "0.0"
          },
          "2_2":{ "type": "flt", "ver": "0",
            "data": "1.0"
          }
        },
        ".bias":{
          "owner": "bmi26x",
          "x":{ "type": "flt", "ver": "0",
            "data": "0.0"
          },
          "y":{ "type": "flt", "ver": "0",
            "data": "0.0"
          },
          "z":{ "type": "flt", "ver": "0",
            "data": "0.0"
          }
        }
      }
    },
    ".temp":{
      "owner": "bmi26x",
      ".fac_cal":
      {
        "owner": "bmi26x",
        ".scale":{
          "owner": "bmi26x",
          "x":{ "type": "flt", "ver": "0",
            "data": "1.0"
          }
        },
        ".bias":{
          "owner": "bmi26x",
          "x":{ "type": "flt", "ver": "0",
            "data": "0.0"
          }
        }
      }
    },
    ".md":{
      "owner": "bmi26x",
      ".config":{
        "owner": "bmi26x",
        "thresh":{ "type": "flt", "ver": "0",
            "data": "1.983"
        },
        "disable":{ "type": "int", "ver": "0",
          "data": "0"
        },
        "win":{ "type": "flt", "ver": "0",
          "data": "0.02"
        }
      }
    },
    ".placement":{
      "owner": "bmi26x",
      "0":{ "type": "flt", "ver": "0",
        "data": "0.1"
      },
      "1":{ "type": "flt", "ver": "0",
        "data": "0.1"
      },
      "2":{ "type": "flt", "ver": "0",
        "data": "0.1"
      },
      "3":{ "type": "flt", "ver": "0",
        "data": "0.0"
      },
      "4":{ "type": "flt", "ver": "0",
        "data": "0.0"
      },
      "5":{ "type": "flt", "ver": "0",
        "data": "0.0"
      },
      "6":{ "type": "flt", "ver": "0",
        "data": "0.0"
      },
      "7":{ "type": "flt", "ver": "0",
        "data": "0.0"
      },
      "8":{ "type": "flt", "ver": "0",
        "data": "0.0"
      },
      "9":{ "type": "flt", "ver": "0",
        "data": "0.0"
      },
      "10":{ "type": "flt", "ver": "0",
        "data": "0.0"
      },
      "11":{ "type": "flt", "ver": "0",
        "data": "0.0"
      }
    }
  },
  "bmi26x_crt_state":{
    "owner": "sns_bmi26x",
    ".crt_gain":{
      "owner": "sns_bmi26x",
      "gain_x":{ "type": "int", "ver": "0",
        "data": "0"
      },
      "gain_y":{ "type": "int", "ver": "0",
        "data": "1"
      },
      "gain_z":{ "type": "int", "ver": "0",
        "data": "2"
      }
    }
  },
  "bmi26x_ois_cfg":{
    "owner": "sns_bmi26x",
    ".ois_cfg":{
      "owner": "sns_bmi26x",
      "enable":{ "type": "int", "ver": "0",
        "data": "1"
      },
      "range_idx":{ "type": "int", "ver": "0",
        "data": "1"
      },
      "spi4":{ "type": "int", "ver": "0",
        "data": "0"
      }
    }
  },
  "bmi26x_crt_config":{
    "owner": "sns_bmi26x",
    ".crt_cfg":{
      "owner": "sns_bmi26x",
      "crt_itvl":{ "type": "int", "ver": "0",
        "data": "500"
      },
      "repeate_on_error":{ "type": "int", "ver": "0",
        "data": "1"
      },
      "reserved":{ "type": "int", "ver": "0",
        "data": "2"
      }
    }
  },
  "bmi26x_double_tap":{
    "owner": "sns_bmi26x",
    ".dbtap_cfg":{
      "owner": "sns_bmi26x",
      "enable":{ "type": "int", "ver": "0",
        "data": "1"
      },
      "sens_thres":{ "type": "int", "ver": "0",
        "data": "3"
      },
      "max_gest_dur":{ "type": "int", "ver": "0",
        "data": "400"
      },
      "quite_time_after_gest":{ "type": "int", "ver": "0",
        "data": "400"
      }
    }
  }
}
