{
    "resId": "tts_ai_spanish_resid_group",
    "domain": "TTS",
    "district": "oversea",
    "deviceType": "common",
    "productName": "common",
    "romVersion": "common",
    "osVersion": "EmotionUI_11.0.0",
    "version": "0x01010005",
    "digest": "eaab67888b73d58ec140088196d612da156d06fc7d4f5dcd1f3709a85ae05179",
    "releaseNotes": "this is a tts spanish resource",
	"ResMetaData": [
        {
            "origin_id": "0x0000000008003001",
            "res_value": "",
            "res_path": "tts/tts_spanish_resid_group/spanish/taco_weights/spanish/spanish.bin.zst",
            "data_version": "0x01010005",
            "encrypt_mode": "0",
            "domain": "TTS"
        },
		{
            "origin_id": "0x0000000008003002",
            "res_value": "",
            "res_path": "tts/tts_spanish_resid_group/spanish/taco_weights/spanish/spanish.txt",
            "data_version": "0x01010005",
            "encrypt_mode": "0",
            "domain": "TTS"
        },
		{
            "origin_id": "0x0000000008003003",
            "res_value": "",
            "res_path": "tts/tts_spanish_resid_group/spanish/lpcnet_weights/spanish/spanish.bin.zst",
            "data_version": "0x01010005",
            "encrypt_mode": "0",
            "domain": "TTS"
        },
		{
            "origin_id": "0x0000000008003004",
            "res_value": "",
            "res_path": "tts/tts_spanish_resid_group/spanish/lpcnet_weights/spanish/spanish.txt",
            "data_version": "0x01010005",
            "encrypt_mode": "0",
            "domain": "TTS"
        },
		{
            "origin_id": "0x0000000008003005",
            "res_value": "",
            "res_path": "tts/tts_spanish_resid_group/spanish/lpcnet_weights/spanish_lite/spanish.bin.zst",
            "data_version": "0x01010005",
            "encrypt_mode": "0",
            "domain": "TTS"
        },
		{
            "origin_id": "0x0000000008003006",
            "res_value": "",
            "res_path": "tts/tts_spanish_resid_group/spanish/lpcnet_weights/spanish_lite/spanish.txt",
            "data_version": "0x01010005",
            "encrypt_mode": "0",
            "domain": "TTS"
        }
    ]
}