{
    "pathMapping": {
        "vendor/hisi/odm/charlotte/ALB/camera/etc": "/odm/etc/camera",
        "vendor/hisi/odm/charlotte/charlotte/camera/etc/hal_repository/platform": "/odm/etc/camera/hal_repository/platform"
    },
    "configList": {
        "PlatformDeviceConfig": ["vendor/hisi/odm/charlotte/ALB/camera/etc/hal_repository/system/platform_device.json"],
        "MediaControlConfigMap": ["vendor/hisi/odm/charlotte/ALB/camera/etc/hal_repository/system/media_control.json"],
        "HispBufferConfig": ["vendor/hisi/odm/charlotte/ALB/camera/etc/hal_repository/system/HISPBufferConfig.json"],
        "ShareMemoryPoolConfig": ["vendor/hisi/odm/charlotte/ALB/camera/etc/hal_repository/system/ShareMemPoolMgr.json"],
        "ShareMemoryDynamicSize": ["vendor/hisi/odm/charlotte/ALB/camera/etc/hal_repository/system/ShareMemDynamicSize.json"],
        "IspNNConfig": ["vendor/hisi/odm/charlotte/ALB/camera/etc/hal_repository/system/smartisp/ispnnConfig.json"],
        "SmartispDumpConfig": ["vendor/hisi/odm/charlotte/ALB/camera/etc/hal_repository/system/smartisp/SmartISPDumpConfig.json"],
        "AIAFModelConfig": ["vendor/hisi/odm/charlotte/ALB/camera/etc/hal_repository/system/aiaf/AIAFModelCfg.json"],
        "SmartispDebugConfig": [],
        "SmartIspModelConfig": [
            "vendor/hisi/odm/charlotte/ALB/camera/etc/hal_repository/system/smartisp/PaletteModelCfg.json",
            "vendor/hisi/odm/charlotte/ALB/camera/etc/hal_repository/system/smartisp/EnhancerModelCfg.json"
        ],
        "CfgHubDevConfig": ["vendor/hisi/odm/charlotte/ALB/camera/etc/hal_repository/system/cfghubdev_cfg.json"],
        "TempCtrlConfig": ["vendor/hisi/odm/charlotte/ALB/camera/etc/hal_repository/system/tempctrlcfg.json"],
        "MCDefaultStateConfig": [
            "vendor/hisi/odm/charlotte/ALB/camera/etc/hal_repository/multi_camera/fore/DefaultStateConfig.json",
            "vendor/hisi/odm/charlotte/ALB/camera/etc/hal_repository/multi_camera/physical/DefaultStateConfig.json",
            "vendor/hisi/odm/charlotte/ALB/camera/etc/hal_repository/multi_camera/rear/DefaultStateConfig.json"
        ],
        "MCSceneMapConfig": [
            "vendor/hisi/odm/charlotte/ALB/camera/etc/hal_repository/multi_camera/fore/SceneMapConfig.json",
            "vendor/hisi/odm/charlotte/ALB/camera/etc/hal_repository/multi_camera/physical/SceneMapConfig.json",
            "vendor/hisi/odm/charlotte/ALB/camera/etc/hal_repository/multi_camera/rear/SceneMapConfig.json"
        ],
        "MCIdMapVecConfig": [
            "vendor/hisi/odm/charlotte/ALB/camera/etc/hal_repository/multi_camera/fore/IdMapConfig.json",
            "vendor/hisi/odm/charlotte/ALB/camera/etc/hal_repository/multi_camera/physical/IdMapConfig.json",
            "vendor/hisi/odm/charlotte/ALB/camera/etc/hal_repository/multi_camera/rear/IdMapConfig.json"
        ],
        "MCTargetStateStrategyConfig": [
            "vendor/hisi/odm/charlotte/ALB/camera/etc/hal_repository/multi_camera/fore/TargetStateStrategyConfig.json",
            "vendor/hisi/odm/charlotte/ALB/camera/etc/hal_repository/multi_camera/rear/TargetStateStrategyConfig.json"
        ],
        "MCSceneStrategyConfig": [
            "vendor/hisi/odm/charlotte/ALB/camera/etc/hal_repository/multi_camera/fore/SceneStrategyConfig.json",
            "vendor/hisi/odm/charlotte/ALB/camera/etc/hal_repository/multi_camera/physical/SceneStrategyConfig.json",
            "vendor/hisi/odm/charlotte/ALB/camera/etc/hal_repository/multi_camera/rear/SceneStrategyConfig.json"
        ],
        "MCConfigTable": [
            "vendor/hisi/odm/charlotte/ALB/camera/etc/hal_repository/multi_camera/fore/strategy_config",
            "vendor/hisi/odm/charlotte/ALB/camera/etc/hal_repository/multi_camera/rear/strategy_config"
        ],
        "MultiCameraTransition": [
            "vendor/hisi/odm/charlotte/ALB/camera/etc/hal_repository/multi_camera/rear/transition_config"
        ],
        "UsecaseDataConfig": [
            "vendor/hisi/odm/charlotte/ALB/camera/etc/hal_repository/product/features/usecase_data/fore/UsecaseDataConfig.json",
            "vendor/hisi/odm/charlotte/ALB/camera/etc/hal_repository/product/features/usecase_data/physical/UsecaseDataConfig.json",
            "vendor/hisi/odm/charlotte/ALB/camera/etc/hal_repository/product/features/usecase_data/rear/UsecaseDataConfig.json"
        ],
        "ProcessorsConfig": [
            "vendor/hisi/odm/charlotte/ALB/camera/etc/hal_repository/product/features/processors",
            "vendor/hisi/odm/charlotte/charlotte/camera/etc/hal_repository/platform/features"
        ],
        "RepAlgoControlConfig": ["vendor/hisi/odm/charlotte/charlotte/camera/etc/hal_repository/platform/features/reprocess/algo_param_subcontrol.json"],
        "RepFeatureControlConfig": ["vendor/hisi/odm/charlotte/charlotte/camera/etc/hal_repository/platform/features/reprocess/feature_subcontrol.json"],
        "RepFeaturePropertyConfig": ["vendor/hisi/odm/charlotte/charlotte/camera/etc/hal_repository/platform/features/reprocess/feature_property.json"],
        "OfflineDmapPropertyConfig": [],
        "MultiscaleConfig": ["vendor/hisi/odm/charlotte/charlotte/camera/etc/hal_repository/platform/features/multiscale/multiscale.json"],
        "FeatureListConfig": ["vendor/hisi/odm/charlotte/ALB/camera/etc/hal_repository/product/features/feature_list.json"],
        "PQSettingSceneConfig": ["vendor/hisi/odm/charlotte/ALB/camera/etc/hal_repository/product/features/pqsetting_scene_list.json"],
        "SingletonSubctrlsConfig": ["vendor/hisi/odm/charlotte/charlotte/camera/etc/hal_repository/platform/features/stream/SingletonSubctrls.json"],
        "MultiInstanceSubctrlsConfig": ["vendor/hisi/odm/charlotte/charlotte/camera/etc/hal_repository/platform/features/stream/MultiInstanceSubctrls.json"],
        "DmapSubctrlConfig": ["vendor/hisi/odm/charlotte/charlotte/camera/etc/hal_repository/platform/features/controllers/DmapSubctrl.json"],
        "CopybitCapabilityConfig": ["vendor/hisi/odm/charlotte/ALB/camera/etc/hal_repository/product/capabilities/CopybitCap.json"],
        "DvfsCfg": ["vendor/hisi/odm/charlotte/ALB/camera/etc/hal_repository/product/capabilities/CameraDvfs.json"],
        "HispMsgInfoConfigMap": ["vendor/hisi/odm/charlotte/ALB/camera/etc/hal_repository/product/capabilities/CameraHispMsgInfo.json"],
        "FastCoreBindPolicy": ["vendor/hisi/odm/charlotte/ALB/camera/etc/hal_repository/product/capabilities/FastCoreBindPolicy.json"],
        "AccessoryConfig": ["vendor/hisi/odm/charlotte/charlotte/camera/etc/hal_repository/platform/features/controllers/AccessoryConfig.json"],
        "CamCmdProcessConfig": ["vendor/hisi/odm/charlotte/ALB/camera/etc/hal_repository/system/camCmdProcessConfig.json"],
        "RTCmdControllerConfig": ["vendor/hisi/odm/charlotte/ALB/camera/etc/hal_repository/product/features/processors/rtCmdControllerConfig.json"],
        "SensorFwUpgradeListConfig": [],
        "SensorCapabilityConfig": [
            "vendor/hisi/odm/charlotte/ALB/camera/etc/hal_repository/product/capabilities",
            "vendor/hisi/odm/charlotte/ALB/camera/etc/hal_repository/sensor/capabilities",
            "vendor/hisi/odm/charlotte/charlotte/camera/etc/hal_repository/platform/capabilities",
            "vendor/hisi/odm/charlotte/ALB/camera/etc/hal_repository/sensor/invalid/WideInvalidFeatureConfig.xml"
        ],
        "DmdCfg": ["vendor/hisi/odm/charlotte/ALB/camera/etc/hal_repository/product/capabilities/CameraDmd.json"],
        "HardwareScheduleConfig": [
            "vendor/hisi/odm/charlotte/ALB/camera/etc/hal_repository/system/schedule"
        ],
        "ScheduleDeviceRuleConfig": [
            "vendor/hisi/odm/charlotte/ALB/camera/etc/hal_repository/system/schedule"
        ],
        "ScheduleDeviceStateConfig": [
            "vendor/hisi/odm/charlotte/ALB/camera/etc/hal_repository/system/schedule"
        ],
        "ScaleElementConfig":["vendor/hisi/odm/charlotte/ALB/camera/etc/hal_repository/product/scale/ScaleElementLevel.json"],
        "ScaleEnvConfig":["vendor/hisi/odm/charlotte/ALB/camera/etc/hal_repository/product/scale/ScaleEnvLevel.json"],
        "FaultMgrConfigMap": ["vendor/hisi/odm/charlotte/charlotte/camera/etc/hal_repository/platform/fault/FaultMgrConfig.json"],
        "SensorInvalidConfig": ["vendor/hisi/odm/charlotte/ALB/camera/etc/hal_repository/sensor/invalid/SensorInvalidConfig.json"],
        "VidDebugBigDataConfig": ["vendor/hisi/odm/charlotte/charlotte/camera/etc/hal_repository/platform/features/video/VidDebugBigDataConfig.json"],
        "SchedAttr": [ "vendor/hisi/odm/charlotte/charlotte/camera/etc/hal_repository/platform/sched_attr.json" ],
        "SupportWideWhiteListConfig": ["vendor/hisi/odm/charlotte/ALB/camera/etc/hal_repository/product/capabilities/SupportWideWhiteListConfig.json"],
        "RawtnrWhiteListConfig": [ "vendor/hisi/odm/charlotte/ALB/camera/etc/hal_repository/product/capabilities/RawtnrWhiteListConfig.json" ],
        "SHDRWhiteListConfig": [ "vendor/hisi/odm/charlotte/ALB/camera/etc/hal_repository/product/capabilities/SHDRWhiteListConfig.json" ],
        "ForceAfModeWhiteListConfig": ["vendor/hisi/odm/charlotte/ALB/camera/etc/hal_repository/product/capabilities/ForceAfModeWhiteListConfig.json"],
        "DyToneWhiteListConfig": [ "vendor/hisi/odm/charlotte/ALB/camera/etc/hal_repository/product/capabilities/DyToneWhiteListConfig.json" ],
        "MSMCfg": ["vendor/hisi/odm/charlotte/ALB/camera/etc/hal_repository/product/features/msm/MSMCfg.json"],
        "MCSceneCondPoints": ["vendor/hisi/odm/charlotte/ALB/camera/etc/hal_repository/multi_camera/rear/MCConditionPoints.json"],
        "ThirdPartyMfnrWhiteListConfig": ["vendor/hisi/odm/charlotte/ALB/camera/etc/hal_repository/product/capabilities/ThirdPartyMfnrWhiteListConfig.json"]
    }
}
