{
    "ProcessorList": {
        "CIEProcessor": {},
        "HiTrackingProcessor" : {},
        "AntiBandingProcessor": {},
        // "TouchObjectDetectionProcessor": {},
        "MotionDetectionProcessor": {}
    },
    "ProcessorGraphList": {
        "0": {
            "CIEProcessor": {},
             "HiTrackingProcessor" : {},
            "AntiBandingProcessor": {},
            // "TouchObjectDetectionProcessor": {},
            "MotionDetectionProcessor": {}
        }
    }
}
