#,version,,,,,,,,,,,,,,,,,,,,,,,,,,,,,,,,,,,,,,,,,,,,,,,,,,,
2023,3,22,14,,,,,,,,,,,,,,,,,,,,,,,,,,,,,,,,,,,,,,,,,,,,,,,,,
#,row_col_num,,,,,,,,,,,,,,,,,,,,,,,,,,,,,,,,,,,,,,,,,,,,,,,,,,,
37,16,,,,,,,,,,,,,,,,,,,,,,,,,,,,,,,,,,,,,,,,,,,,,,,,,,,
#,noise,,,,,,,,,,,,,,,,,,,,,,,,,,,,,,,,,,,,,,,,,,,,,,,,,,,
-500,500,,,,,,,,,,,,,,,,,,,,,,,,,,,,,,,,,,,,,,,,,,,,,,,,,,,
#,raw_max,,,,,,,,,,,,,,,,,,,,,,,,,,,,,,,,,,,,,,,,,,,,,,,,,,,
25000,21000,21000,21000,21000,21000,21000,21000,21000,21000,21000,21000,21000,21000,21000,25000,,,,,,,,,,,,,,,,,,,,,,,,,,,,,,,,,,,,,
21000,21000,21000,21000,21000,21000,21000,21000,21000,21000,21000,21000,21000,21000,21000,21000,,,,,,,,,,,,,,,,,,,,,,,,,,,,,,,,,,,,,
21000,21000,21000,21000,21000,21000,21000,21000,21000,21000,21000,21000,21000,21000,21000,21000,,,,,,,,,,,,,,,,,,,,,,,,,,,,,,,,,,,,,
21000,21000,21000,21000,21000,21000,21000,21000,21000,21000,21000,21000,21000,21000,21000,21000,,,,,,,,,,,,,,,,,,,,,,,,,,,,,,,,,,,,,
21000,21000,21000,21000,21000,21000,21000,21000,21000,21000,21000,21000,21000,21000,21000,21000,,,,,,,,,,,,,,,,,,,,,,,,,,,,,,,,,,,,,
21000,21000,21000,21000,21000,21000,21000,21000,21000,21000,21000,21000,21000,21000,21000,21000,,,,,,,,,,,,,,,,,,,,,,,,,,,,,,,,,,,,,
21000,21000,21000,21000,21000,21000,21000,21000,21000,21000,21000,21000,21000,21000,21000,21000,,,,,,,,,,,,,,,,,,,,,,,,,,,,,,,,,,,,,
21000,21000,21000,21000,21000,21000,21000,21000,21000,21000,21000,21000,21000,21000,21000,21000,,,,,,,,,,,,,,,,,,,,,,,,,,,,,,,,,,,,,
21000,21000,21000,21000,21000,21000,21000,21000,21000,21000,21000,21000,21000,21000,21000,21000,,,,,,,,,,,,,,,,,,,,,,,,,,,,,,,,,,,,,
21000,21000,21000,21000,21000,21000,21000,21000,21000,21000,21000,21000,21000,21000,21000,21000,,,,,,,,,,,,,,,,,,,,,,,,,,,,,,,,,,,,,
21000,21000,21000,21000,21000,21000,21000,21000,21000,21000,21000,21000,21000,21000,21000,21000,,,,,,,,,,,,,,,,,,,,,,,,,,,,,,,,,,,,,
21000,21000,21000,21000,21000,21000,21000,21000,21000,21000,21000,21000,21000,21000,21000,21000,,,,,,,,,,,,,,,,,,,,,,,,,,,,,,,,,,,,,
21000,21000,21000,21000,21000,21000,21000,21000,21000,21000,21000,21000,21000,21000,21000,21000,,,,,,,,,,,,,,,,,,,,,,,,,,,,,,,,,,,,,
21000,21000,21000,21000,21000,21000,21000,21000,21000,21000,21000,21000,21000,21000,21000,21000,,,,,,,,,,,,,,,,,,,,,,,,,,,,,,,,,,,,,
21000,21000,21000,21000,21000,21000,21000,21000,21000,21000,21000,21000,21000,21000,21000,21000,,,,,,,,,,,,,,,,,,,,,,,,,,,,,,,,,,,,,
21000,21000,21000,21000,21000,21000,21000,21000,21000,21000,21000,21000,21000,21000,21000,21000,,,,,,,,,,,,,,,,,,,,,,,,,,,,,,,,,,,,,
21000,21000,21000,21000,21000,21000,21000,21000,21000,21000,21000,21000,21000,21000,21000,21000,,,,,,,,,,,,,,,,,,,,,,,,,,,,,,,,,,,,,
21000,21000,21000,21000,21000,21000,21000,21000,21000,21000,21000,21000,21000,21000,21000,21000,,,,,,,,,,,,,,,,,,,,,,,,,,,,,,,,,,,,,
21000,21000,21000,21000,21000,21000,21000,21000,21000,21000,21000,21000,21000,21000,21000,21000,,,,,,,,,,,,,,,,,,,,,,,,,,,,,,,,,,,,,
21000,21000,21000,21000,21000,21000,21000,21000,21000,21000,21000,21000,21000,21000,21000,21000,,,,,,,,,,,,,,,,,,,,,,,,,,,,,,,,,,,,,
21000,21000,21000,21000,21000,21000,21000,21000,21000,21000,21000,21000,21000,21000,21000,21000,,,,,,,,,,,,,,,,,,,,,,,,,,,,,,,,,,,,,
21000,21000,21000,21000,21000,21000,21000,21000,21000,21000,21000,21000,21000,21000,21000,21000,,,,,,,,,,,,,,,,,,,,,,,,,,,,,,,,,,,,,
21000,21000,21000,21000,21000,21000,21000,21000,21000,21000,21000,21000,21000,21000,21000,21000,,,,,,,,,,,,,,,,,,,,,,,,,,,,,,,,,,,,,
21000,21000,21000,21000,21000,21000,21000,21000,21000,21000,21000,21000,21000,21000,21000,21000,,,,,,,,,,,,,,,,,,,,,,,,,,,,,,,,,,,,,
21000,21000,21000,21000,21000,21000,21000,21000,21000,21000,21000,21000,21000,21000,21000,21000,,,,,,,,,,,,,,,,,,,,,,,,,,,,,,,,,,,,,
21000,21000,21000,21000,21000,21000,21000,21000,21000,21000,21000,21000,21000,21000,21000,21000,,,,,,,,,,,,,,,,,,,,,,,,,,,,,,,,,,,,,
21000,21000,21000,21000,21000,21000,21000,21000,21000,21000,21000,21000,21000,21000,21000,21000,,,,,,,,,,,,,,,,,,,,,,,,,,,,,,,,,,,,,
21000,21000,21000,21000,21000,21000,21000,21000,21000,21000,21000,21000,21000,21000,21000,21000,,,,,,,,,,,,,,,,,,,,,,,,,,,,,,,,,,,,,
21000,21000,21000,21000,21000,21000,21000,21000,21000,21000,21000,21000,21000,21000,21000,21000,,,,,,,,,,,,,,,,,,,,,,,,,,,,,,,,,,,,,
21000,21000,21000,21000,21000,21000,21000,21000,21000,21000,21000,21000,21000,21000,21000,21000,,,,,,,,,,,,,,,,,,,,,,,,,,,,,,,,,,,,,
21000,21000,21000,21000,21000,21000,21000,21000,21000,21000,21000,21000,21000,21000,21000,21000,,,,,,,,,,,,,,,,,,,,,,,,,,,,,,,,,,,,,
21000,21000,21000,21000,21000,21000,21000,21000,21000,21000,21000,21000,21000,21000,21000,21000,,,,,,,,,,,,,,,,,,,,,,,,,,,,,,,,,,,,,
21000,21000,21000,21000,21000,21000,21000,21000,21000,21000,21000,21000,21000,21000,21000,21000,,,,,,,,,,,,,,,,,,,,,,,,,,,,,,,,,,,,,
21000,21000,21000,21000,21000,21000,21000,21000,21000,21000,21000,21000,21000,21000,21000,21000,,,,,,,,,,,,,,,,,,,,,,,,,,,,,,,,,,,,,
21000,21000,21000,21000,21000,21000,21000,21000,21000,21000,21000,21000,21000,21000,21000,21000,,,,,,,,,,,,,,,,,,,,,,,,,,,,,,,,,,,,,
21000,21000,21000,21000,21000,21000,21000,21000,21000,21000,21000,21000,21000,21000,21000,21000,,,,,,,,,,,,,,,,,,,,,,,,,,,,,,,,,,,,,
25000,21000,21000,21000,21000,21000,21000,21000,21000,21000,21000,21000,21000,21000,21000,25000,,,,,,,,,,,,,,,,,,,,,,,,,,,,,,,,,,,,,
#,raw_min,,,,,,,,,,,,,,,,,,,,,,,,,,,,,,,,,,,,,,,,,,,,,,,,,,,
5000,16000,16000,16000,16000,16000,16000,16000,16000,16000,16000,16000,16000,16000,16000,5000,,,,,,,,,,,,,,,,,,,,,,,,,,,,,,,,,,,,,
16000,16000,16000,16000,16000,16000,16000,16000,16000,16000,16000,16000,16000,16000,16000,16000,,,,,,,,,,,,,,,,,,,,,,,,,,,,,,,,,,,,,
16000,16000,16000,16000,16000,16000,16000,16000,16000,16000,16000,16000,16000,16000,16000,16000,,,,,,,,,,,,,,,,,,,,,,,,,,,,,,,,,,,,,
16000,16000,16000,16000,16000,16000,16000,16000,16000,16000,16000,16000,16000,16000,16000,16000,,,,,,,,,,,,,,,,,,,,,,,,,,,,,,,,,,,,,
16000,16000,16000,16000,16000,16000,16000,16000,16000,16000,16000,16000,16000,16000,16000,16000,,,,,,,,,,,,,,,,,,,,,,,,,,,,,,,,,,,,,
16000,16000,16000,16000,16000,16000,16000,16000,16000,16000,16000,16000,16000,16000,16000,16000,,,,,,,,,,,,,,,,,,,,,,,,,,,,,,,,,,,,,
16000,16000,16000,16000,16000,16000,16000,16000,16000,16000,16000,16000,16000,16000,16000,16000,,,,,,,,,,,,,,,,,,,,,,,,,,,,,,,,,,,,,
16000,16000,16000,16000,16000,16000,16000,16000,16000,16000,16000,16000,16000,16000,16000,16000,,,,,,,,,,,,,,,,,,,,,,,,,,,,,,,,,,,,,
16000,16000,16000,16000,16000,16000,16000,16000,16000,16000,16000,16000,16000,16000,16000,16000,,,,,,,,,,,,,,,,,,,,,,,,,,,,,,,,,,,,,
16000,16000,16000,16000,16000,16000,16000,16000,16000,16000,16000,16000,16000,16000,16000,16000,,,,,,,,,,,,,,,,,,,,,,,,,,,,,,,,,,,,,
16000,16000,16000,16000,16000,16000,16000,16000,16000,16000,16000,16000,16000,16000,16000,16000,,,,,,,,,,,,,,,,,,,,,,,,,,,,,,,,,,,,,
16000,16000,16000,16000,16000,16000,16000,16000,16000,16000,16000,16000,16000,16000,16000,16000,,,,,,,,,,,,,,,,,,,,,,,,,,,,,,,,,,,,,
16000,16000,16000,16000,16000,16000,16000,16000,16000,16000,16000,16000,16000,16000,16000,16000,,,,,,,,,,,,,,,,,,,,,,,,,,,,,,,,,,,,,
16000,16000,16000,16000,16000,16000,16000,16000,16000,16000,16000,16000,16000,16000,16000,16000,,,,,,,,,,,,,,,,,,,,,,,,,,,,,,,,,,,,,
16000,16000,16000,16000,16000,16000,16000,16000,16000,16000,16000,16000,16000,16000,16000,16000,,,,,,,,,,,,,,,,,,,,,,,,,,,,,,,,,,,,,
16000,16000,16000,16000,16000,16000,16000,16000,16000,16000,16000,16000,16000,16000,16000,16000,,,,,,,,,,,,,,,,,,,,,,,,,,,,,,,,,,,,,
16000,16000,16000,16000,16000,16000,16000,16000,16000,16000,16000,16000,16000,16000,16000,16000,,,,,,,,,,,,,,,,,,,,,,,,,,,,,,,,,,,,,
16000,16000,16000,16000,16000,16000,16000,16000,16000,16000,16000,16000,16000,16000,16000,16000,,,,,,,,,,,,,,,,,,,,,,,,,,,,,,,,,,,,,
16000,16000,16000,16000,16000,16000,16000,16000,16000,16000,16000,16000,16000,16000,16000,16000,,,,,,,,,,,,,,,,,,,,,,,,,,,,,,,,,,,,,
16000,16000,16000,16000,16000,16000,16000,16000,16000,16000,16000,16000,16000,16000,16000,16000,,,,,,,,,,,,,,,,,,,,,,,,,,,,,,,,,,,,,
16000,16000,16000,16000,16000,16000,16000,16000,16000,16000,16000,16000,16000,16000,16000,16000,,,,,,,,,,,,,,,,,,,,,,,,,,,,,,,,,,,,,
16000,16000,16000,16000,16000,16000,16000,16000,16000,16000,16000,16000,16000,16000,16000,16000,,,,,,,,,,,,,,,,,,,,,,,,,,,,,,,,,,,,,
16000,16000,16000,16000,16000,16000,16000,16000,16000,16000,16000,16000,16000,16000,16000,16000,,,,,,,,,,,,,,,,,,,,,,,,,,,,,,,,,,,,,
16000,16000,16000,16000,16000,16000,16000,16000,16000,16000,16000,16000,16000,16000,16000,16000,,,,,,,,,,,,,,,,,,,,,,,,,,,,,,,,,,,,,
16000,16000,16000,16000,16000,16000,16000,16000,16000,16000,16000,16000,16000,16000,16000,16000,,,,,,,,,,,,,,,,,,,,,,,,,,,,,,,,,,,,,
16000,16000,16000,16000,16000,16000,16000,16000,16000,16000,16000,16000,16000,16000,16000,16000,,,,,,,,,,,,,,,,,,,,,,,,,,,,,,,,,,,,,
16000,16000,16000,16000,16000,16000,16000,16000,16000,16000,16000,16000,16000,16000,16000,16000,,,,,,,,,,,,,,,,,,,,,,,,,,,,,,,,,,,,,
16000,16000,16000,16000,16000,16000,16000,16000,16000,16000,16000,16000,16000,16000,16000,16000,,,,,,,,,,,,,,,,,,,,,,,,,,,,,,,,,,,,,
16000,16000,16000,16000,16000,16000,16000,16000,16000,16000,16000,16000,16000,16000,16000,16000,,,,,,,,,,,,,,,,,,,,,,,,,,,,,,,,,,,,,
16000,16000,16000,16000,16000,16000,16000,16000,16000,16000,16000,16000,16000,16000,16000,16000,,,,,,,,,,,,,,,,,,,,,,,,,,,,,,,,,,,,,
16000,16000,16000,16000,16000,16000,16000,16000,16000,16000,16000,16000,16000,16000,16000,16000,,,,,,,,,,,,,,,,,,,,,,,,,,,,,,,,,,,,,
16000,16000,16000,16000,16000,16000,16000,16000,16000,16000,16000,16000,16000,16000,16000,16000,,,,,,,,,,,,,,,,,,,,,,,,,,,,,,,,,,,,,
16000,16000,16000,16000,16000,16000,16000,16000,16000,16000,16000,16000,16000,16000,16000,16000,,,,,,,,,,,,,,,,,,,,,,,,,,,,,,,,,,,,,
16000,16000,16000,16000,16000,16000,16000,16000,16000,16000,16000,16000,16000,16000,16000,16000,,,,,,,,,,,,,,,,,,,,,,,,,,,,,,,,,,,,,
16000,16000,16000,16000,16000,16000,16000,16000,16000,16000,16000,16000,16000,16000,16000,16000,,,,,,,,,,,,,,,,,,,,,,,,,,,,,,,,,,,,,
16000,16000,16000,16000,16000,16000,16000,16000,16000,16000,16000,16000,16000,16000,16000,16000,,,,,,,,,,,,,,,,,,,,,,,,,,,,,,,,,,,,,
5000,16000,16000,16000,16000,16000,16000,16000,16000,16000,16000,16000,16000,16000,16000,5000,,,,,,,,,,,,,,,,,,,,,,,,,,,,,,,,,,,,,
#,raw_row_delta_max,,,,,,,,,,,,,,,,,,,,,,,,,,,,,,,,,,,,,,,,,,,,,,,,,,,
2000,1500,1500,1500,1500,1500,1500,1500,1500,1500,1500,1500,1500,1500,1500,2000,,,,,,,,,,,,,,,,,,,,,,,,,,,,,,,,,,,,,
800,800,800,800,800,800,800,1000,1000,800,800,800,800,800,800,800,,,,,,,,,,,,,,,,,,,,,,,,,,,,,,,,,,,,,
800,800,800,800,800,800,800,800,800,800,800,800,800,800,800,800,,,,,,,,,,,,,,,,,,,,,,,,,,,,,,,,,,,,,
800,800,800,800,800,800,800,800,800,800,800,800,800,800,800,800,,,,,,,,,,,,,,,,,,,,,,,,,,,,,,,,,,,,,
800,800,800,800,800,800,800,800,800,800,800,800,800,800,800,800,,,,,,,,,,,,,,,,,,,,,,,,,,,,,,,,,,,,,
800,800,800,800,800,800,800,800,800,800,800,800,800,800,800,800,,,,,,,,,,,,,,,,,,,,,,,,,,,,,,,,,,,,,
800,800,800,800,800,800,800,800,800,800,800,800,800,800,800,800,,,,,,,,,,,,,,,,,,,,,,,,,,,,,,,,,,,,,
800,800,800,800,800,800,800,800,800,800,800,800,800,800,800,800,,,,,,,,,,,,,,,,,,,,,,,,,,,,,,,,,,,,,
800,800,800,800,800,800,800,800,800,800,800,800,800,800,800,800,,,,,,,,,,,,,,,,,,,,,,,,,,,,,,,,,,,,,
800,800,800,800,800,800,800,800,800,800,800,800,800,800,800,800,,,,,,,,,,,,,,,,,,,,,,,,,,,,,,,,,,,,,
800,800,800,800,800,800,800,800,800,800,800,800,800,800,800,800,,,,,,,,,,,,,,,,,,,,,,,,,,,,,,,,,,,,,
800,800,800,800,800,800,800,800,800,800,800,800,800,800,800,800,,,,,,,,,,,,,,,,,,,,,,,,,,,,,,,,,,,,,
800,800,800,800,800,800,800,800,800,800,800,800,800,800,800,800,,,,,,,,,,,,,,,,,,,,,,,,,,,,,,,,,,,,,
800,800,800,800,800,800,800,800,800,800,800,800,800,800,800,800,,,,,,,,,,,,,,,,,,,,,,,,,,,,,,,,,,,,,
800,800,800,800,800,800,800,800,800,800,800,800,800,800,800,800,,,,,,,,,,,,,,,,,,,,,,,,,,,,,,,,,,,,,
800,800,800,800,800,800,800,800,800,800,800,800,800,800,800,800,,,,,,,,,,,,,,,,,,,,,,,,,,,,,,,,,,,,,
800,800,800,800,800,800,800,800,800,800,800,800,800,800,800,800,,,,,,,,,,,,,,,,,,,,,,,,,,,,,,,,,,,,,
800,800,800,800,800,800,800,800,800,800,800,800,800,800,800,800,,,,,,,,,,,,,,,,,,,,,,,,,,,,,,,,,,,,,
800,800,800,800,800,800,800,800,800,800,800,800,800,800,800,800,,,,,,,,,,,,,,,,,,,,,,,,,,,,,,,,,,,,,
800,800,800,800,800,800,800,800,800,800,800,800,800,800,800,800,,,,,,,,,,,,,,,,,,,,,,,,,,,,,,,,,,,,,
800,800,800,800,800,800,800,800,800,800,800,800,800,800,800,800,,,,,,,,,,,,,,,,,,,,,,,,,,,,,,,,,,,,,
800,800,800,800,800,800,800,800,800,800,800,800,800,800,800,800,,,,,,,,,,,,,,,,,,,,,,,,,,,,,,,,,,,,,
800,800,800,800,800,800,800,800,800,800,800,800,800,800,800,800,,,,,,,,,,,,,,,,,,,,,,,,,,,,,,,,,,,,,
800,800,800,800,800,800,800,800,800,800,800,800,800,800,800,800,,,,,,,,,,,,,,,,,,,,,,,,,,,,,,,,,,,,,
800,800,800,800,800,800,800,800,800,800,800,800,800,800,800,800,,,,,,,,,,,,,,,,,,,,,,,,,,,,,,,,,,,,,
800,800,800,800,800,800,800,800,800,800,800,800,800,800,800,800,,,,,,,,,,,,,,,,,,,,,,,,,,,,,,,,,,,,,
800,800,800,800,800,800,800,800,800,800,800,800,800,800,800,800,,,,,,,,,,,,,,,,,,,,,,,,,,,,,,,,,,,,,
800,800,800,800,800,800,800,800,800,800,800,800,800,800,800,800,,,,,,,,,,,,,,,,,,,,,,,,,,,,,,,,,,,,,
800,800,800,800,800,800,800,800,800,800,800,800,800,800,800,800,,,,,,,,,,,,,,,,,,,,,,,,,,,,,,,,,,,,,
800,800,800,800,800,800,800,800,800,800,800,800,800,800,800,800,,,,,,,,,,,,,,,,,,,,,,,,,,,,,,,,,,,,,
800,800,800,800,800,800,800,800,800,800,800,800,800,800,800,800,,,,,,,,,,,,,,,,,,,,,,,,,,,,,,,,,,,,,
800,800,800,800,800,800,800,800,800,800,800,800,800,800,800,800,,,,,,,,,,,,,,,,,,,,,,,,,,,,,,,,,,,,,
800,800,800,800,800,800,800,800,800,800,800,800,800,800,800,800,,,,,,,,,,,,,,,,,,,,,,,,,,,,,,,,,,,,,
800,800,800,800,800,800,800,800,800,800,800,800,800,800,800,800,,,,,,,,,,,,,,,,,,,,,,,,,,,,,,,,,,,,,
800,800,800,800,800,800,800,800,800,800,800,800,800,800,800,800,,,,,,,,,,,,,,,,,,,,,,,,,,,,,,,,,,,,,
2000,1500,1500,1500,1500,1500,1500,1500,1500,1500,1500,1500,1500,1500,1500,2000,,,,,,,,,,,,,,,,,,,,,,,,,,,,,,,,,,,,,
#,raw_row_delta_min,,,,,,,,,,,,,,,,,,,,,,,,,,,,,,,,,,,,,,,,,,,,,,,,,,,
-2000,-1500,-1500,-1500,-1500,-1500,-1500,-1500,-1500,-1500,-1500,-1500,-1500,-1500,-1500,-2000,,,,,,,,,,,,,,,,,,,,,,,,,,,,,,,,,,,,,
-800,-800,-800,-800,-800,-800,-800,-1000,-1000,-800,-800,-800,-800,-800,-800,-800,,,,,,,,,,,,,,,,,,,,,,,,,,,,,,,,,,,,,
-800,-800,-800,-800,-800,-800,-800,-800,-800,-800,-800,-800,-800,-800,-800,-800,,,,,,,,,,,,,,,,,,,,,,,,,,,,,,,,,,,,,
-800,-800,-800,-800,-800,-800,-800,-800,-800,-800,-800,-800,-800,-800,-800,-800,,,,,,,,,,,,,,,,,,,,,,,,,,,,,,,,,,,,,
-800,-800,-800,-800,-800,-800,-800,-800,-800,-800,-800,-800,-800,-800,-800,-800,,,,,,,,,,,,,,,,,,,,,,,,,,,,,,,,,,,,,
-800,-800,-800,-800,-800,-800,-800,-800,-800,-800,-800,-800,-800,-800,-800,-800,,,,,,,,,,,,,,,,,,,,,,,,,,,,,,,,,,,,,
-800,-800,-800,-800,-800,-800,-800,-800,-800,-800,-800,-800,-800,-800,-800,-800,,,,,,,,,,,,,,,,,,,,,,,,,,,,,,,,,,,,,
-800,-800,-800,-800,-800,-800,-800,-800,-800,-800,-800,-800,-800,-800,-800,-800,,,,,,,,,,,,,,,,,,,,,,,,,,,,,,,,,,,,,
-800,-800,-800,-800,-800,-800,-800,-800,-800,-800,-800,-800,-800,-800,-800,-800,,,,,,,,,,,,,,,,,,,,,,,,,,,,,,,,,,,,,
-800,-800,-800,-800,-800,-800,-800,-800,-800,-800,-800,-800,-800,-800,-800,-800,,,,,,,,,,,,,,,,,,,,,,,,,,,,,,,,,,,,,
-800,-800,-800,-800,-800,-800,-800,-800,-800,-800,-800,-800,-800,-800,-800,-800,,,,,,,,,,,,,,,,,,,,,,,,,,,,,,,,,,,,,
-800,-800,-800,-800,-800,-800,-800,-800,-800,-800,-800,-800,-800,-800,-800,-800,,,,,,,,,,,,,,,,,,,,,,,,,,,,,,,,,,,,,
-800,-800,-800,-800,-800,-800,-800,-800,-800,-800,-800,-800,-800,-800,-800,-800,,,,,,,,,,,,,,,,,,,,,,,,,,,,,,,,,,,,,
-800,-800,-800,-800,-800,-800,-800,-800,-800,-800,-800,-800,-800,-800,-800,-800,,,,,,,,,,,,,,,,,,,,,,,,,,,,,,,,,,,,,
-800,-800,-800,-800,-800,-800,-800,-800,-800,-800,-800,-800,-800,-800,-800,-800,,,,,,,,,,,,,,,,,,,,,,,,,,,,,,,,,,,,,
-800,-800,-800,-800,-800,-800,-800,-800,-800,-800,-800,-800,-800,-800,-800,-800,,,,,,,,,,,,,,,,,,,,,,,,,,,,,,,,,,,,,
-800,-800,-800,-800,-800,-800,-800,-800,-800,-800,-800,-800,-800,-800,-800,-800,,,,,,,,,,,,,,,,,,,,,,,,,,,,,,,,,,,,,
-800,-800,-800,-800,-800,-800,-800,-800,-800,-800,-800,-800,-800,-800,-800,-800,,,,,,,,,,,,,,,,,,,,,,,,,,,,,,,,,,,,,
-800,-800,-800,-800,-800,-800,-800,-800,-800,-800,-800,-800,-800,-800,-800,-800,,,,,,,,,,,,,,,,,,,,,,,,,,,,,,,,,,,,,
-800,-800,-800,-800,-800,-800,-800,-800,-800,-800,-800,-800,-800,-800,-800,-800,,,,,,,,,,,,,,,,,,,,,,,,,,,,,,,,,,,,,
-800,-800,-800,-800,-800,-800,-800,-800,-800,-800,-800,-800,-800,-800,-800,-800,,,,,,,,,,,,,,,,,,,,,,,,,,,,,,,,,,,,,
-800,-800,-800,-800,-800,-800,-800,-800,-800,-800,-800,-800,-800,-800,-800,-800,,,,,,,,,,,,,,,,,,,,,,,,,,,,,,,,,,,,,
-800,-800,-800,-800,-800,-800,-800,-800,-800,-800,-800,-800,-800,-800,-800,-800,,,,,,,,,,,,,,,,,,,,,,,,,,,,,,,,,,,,,
-800,-800,-800,-800,-800,-800,-800,-800,-800,-800,-800,-800,-800,-800,-800,-800,,,,,,,,,,,,,,,,,,,,,,,,,,,,,,,,,,,,,
-800,-800,-800,-800,-800,-800,-800,-800,-800,-800,-800,-800,-800,-800,-800,-800,,,,,,,,,,,,,,,,,,,,,,,,,,,,,,,,,,,,,
-800,-800,-800,-800,-800,-800,-800,-800,-800,-800,-800,-800,-800,-800,-800,-800,,,,,,,,,,,,,,,,,,,,,,,,,,,,,,,,,,,,,
-800,-800,-800,-800,-800,-800,-800,-800,-800,-800,-800,-800,-800,-800,-800,-800,,,,,,,,,,,,,,,,,,,,,,,,,,,,,,,,,,,,,
-800,-800,-800,-800,-800,-800,-800,-800,-800,-800,-800,-800,-800,-800,-800,-800,,,,,,,,,,,,,,,,,,,,,,,,,,,,,,,,,,,,,
-800,-800,-800,-800,-800,-800,-800,-800,-800,-800,-800,-800,-800,-800,-800,-800,,,,,,,,,,,,,,,,,,,,,,,,,,,,,,,,,,,,,
-800,-800,-800,-800,-800,-800,-800,-800,-800,-800,-800,-800,-800,-800,-800,-800,,,,,,,,,,,,,,,,,,,,,,,,,,,,,,,,,,,,,
-800,-800,-800,-800,-800,-800,-800,-800,-800,-800,-800,-800,-800,-800,-800,-800,,,,,,,,,,,,,,,,,,,,,,,,,,,,,,,,,,,,,
-800,-800,-800,-800,-800,-800,-800,-800,-800,-800,-800,-800,-800,-800,-800,-800,,,,,,,,,,,,,,,,,,,,,,,,,,,,,,,,,,,,,
-800,-800,-800,-800,-800,-800,-800,-800,-800,-800,-800,-800,-800,-800,-800,-800,,,,,,,,,,,,,,,,,,,,,,,,,,,,,,,,,,,,,
-800,-800,-800,-800,-800,-800,-800,-800,-800,-800,-800,-800,-800,-800,-800,-800,,,,,,,,,,,,,,,,,,,,,,,,,,,,,,,,,,,,,
-800,-800,-800,-800,-800,-800,-800,-800,-800,-800,-800,-800,-800,-800,-800,-800,,,,,,,,,,,,,,,,,,,,,,,,,,,,,,,,,,,,,
-2000,-1500,-1500,-1500,-1500,-1500,-1500,-1500,-1500,-1500,-1500,-1500,-1500,-1500,-1500,-2000,,,,,,,,,,,,,,,,,,,,,,,,,,,,,,,,,,,,,
#,raw_col_delta_max,,,,,,,,,,,,,,,,,,,,,,,,,,,,,,,,,,,,,,,,,,,,,,,,,,,
2000,800,800,800,800,800,1500,1500,1500,800,800,800,800,800,2000,,,,,,,,,,,,,,,,,,,,,,,,,,,,,,,,,,,,,,
800,800,800,800,800,800,1500,1500,1500,800,800,800,800,800,800,,,,,,,,,,,,,,,,,,,,,,,,,,,,,,,,,,,,,,
800,800,800,800,800,800,800,800,800,800,800,800,800,800,800,,,,,,,,,,,,,,,,,,,,,,,,,,,,,,,,,,,,,,
800,800,800,800,800,800,800,800,800,800,800,800,800,800,800,,,,,,,,,,,,,,,,,,,,,,,,,,,,,,,,,,,,,,
800,800,800,800,800,800,800,800,800,800,800,800,800,800,800,,,,,,,,,,,,,,,,,,,,,,,,,,,,,,,,,,,,,,
800,800,800,800,800,800,800,800,800,800,800,800,800,800,800,,,,,,,,,,,,,,,,,,,,,,,,,,,,,,,,,,,,,,
800,800,800,800,800,800,800,800,800,800,800,800,800,800,800,,,,,,,,,,,,,,,,,,,,,,,,,,,,,,,,,,,,,,
800,800,800,800,800,800,800,800,800,800,800,800,800,800,800,,,,,,,,,,,,,,,,,,,,,,,,,,,,,,,,,,,,,,
800,800,800,800,800,800,800,800,800,800,800,800,800,800,800,,,,,,,,,,,,,,,,,,,,,,,,,,,,,,,,,,,,,,
800,800,800,800,800,800,800,800,800,800,800,800,800,800,800,,,,,,,,,,,,,,,,,,,,,,,,,,,,,,,,,,,,,,
800,800,800,800,800,800,800,800,800,800,800,800,800,800,800,,,,,,,,,,,,,,,,,,,,,,,,,,,,,,,,,,,,,,
800,800,800,800,800,800,800,800,800,800,800,800,800,800,800,,,,,,,,,,,,,,,,,,,,,,,,,,,,,,,,,,,,,,
800,800,800,800,800,800,800,800,800,800,800,800,800,800,800,,,,,,,,,,,,,,,,,,,,,,,,,,,,,,,,,,,,,,
800,800,800,800,800,800,800,800,800,800,800,800,800,800,800,,,,,,,,,,,,,,,,,,,,,,,,,,,,,,,,,,,,,,
800,800,800,800,800,800,800,800,800,800,800,800,800,800,800,,,,,,,,,,,,,,,,,,,,,,,,,,,,,,,,,,,,,,
800,800,800,800,800,800,800,800,800,800,800,800,800,800,800,,,,,,,,,,,,,,,,,,,,,,,,,,,,,,,,,,,,,,
800,800,800,800,800,800,800,800,800,800,800,800,800,800,800,,,,,,,,,,,,,,,,,,,,,,,,,,,,,,,,,,,,,,
800,800,800,800,800,800,800,800,800,800,800,800,800,800,800,,,,,,,,,,,,,,,,,,,,,,,,,,,,,,,,,,,,,,
800,800,800,800,800,800,800,800,800,800,800,800,800,800,800,,,,,,,,,,,,,,,,,,,,,,,,,,,,,,,,,,,,,,
800,800,800,800,800,800,800,800,800,800,800,800,800,800,800,,,,,,,,,,,,,,,,,,,,,,,,,,,,,,,,,,,,,,
800,800,800,800,800,800,800,800,800,800,800,800,800,800,800,,,,,,,,,,,,,,,,,,,,,,,,,,,,,,,,,,,,,,
800,800,800,800,800,800,800,800,800,800,800,800,800,800,800,,,,,,,,,,,,,,,,,,,,,,,,,,,,,,,,,,,,,,
800,800,800,800,800,800,800,800,800,800,800,800,800,800,800,,,,,,,,,,,,,,,,,,,,,,,,,,,,,,,,,,,,,,
800,800,800,800,800,800,800,800,800,800,800,800,800,800,800,,,,,,,,,,,,,,,,,,,,,,,,,,,,,,,,,,,,,,
800,800,800,800,800,800,800,800,800,800,800,800,800,800,800,,,,,,,,,,,,,,,,,,,,,,,,,,,,,,,,,,,,,,
800,800,800,800,800,800,800,800,800,800,800,800,800,800,800,,,,,,,,,,,,,,,,,,,,,,,,,,,,,,,,,,,,,,
800,800,800,800,800,800,800,800,800,800,800,800,800,800,800,,,,,,,,,,,,,,,,,,,,,,,,,,,,,,,,,,,,,,
800,800,800,800,800,800,800,800,800,800,800,800,800,800,800,,,,,,,,,,,,,,,,,,,,,,,,,,,,,,,,,,,,,,
800,800,800,800,800,800,800,800,800,800,800,800,800,800,800,,,,,,,,,,,,,,,,,,,,,,,,,,,,,,,,,,,,,,
800,800,800,800,800,800,800,800,800,800,800,800,800,800,800,,,,,,,,,,,,,,,,,,,,,,,,,,,,,,,,,,,,,,
800,800,800,800,800,800,800,800,800,800,800,800,800,800,800,,,,,,,,,,,,,,,,,,,,,,,,,,,,,,,,,,,,,,
800,800,800,800,800,800,800,800,800,800,800,800,800,800,800,,,,,,,,,,,,,,,,,,,,,,,,,,,,,,,,,,,,,,
800,800,800,800,800,800,800,800,800,800,800,800,800,800,800,,,,,,,,,,,,,,,,,,,,,,,,,,,,,,,,,,,,,,
800,800,800,800,800,800,800,800,800,800,800,800,800,800,800,,,,,,,,,,,,,,,,,,,,,,,,,,,,,,,,,,,,,,
800,800,800,800,800,800,800,800,800,800,800,800,800,800,800,,,,,,,,,,,,,,,,,,,,,,,,,,,,,,,,,,,,,,
800,800,800,800,800,800,800,800,800,800,800,800,800,800,800,,,,,,,,,,,,,,,,,,,,,,,,,,,,,,,,,,,,,,
2000,800,800,800,800,800,800,800,800,800,800,800,800,800,2000,,,,,,,,,,,,,,,,,,,,,,,,,,,,,,,,,,,,,,
#,raw_col_delta_min,,,,,,,,,,,,,,,,,,,,,,,,,,,,,,,,,,,,,,,,,,,,,,,,,,,
-2000,-800,-800,-800,-800,-800,-1500,-1500,-1500,-800,-800,-800,-800,-800,-2000,,,,,,,,,,,,,,,,,,,,,,,,,,,,,,,,,,,,,,
-800,-800,-800,-800,-800,-800,-1500,-1500,-1500,-800,-800,-800,-800,-800,-800,,,,,,,,,,,,,,,,,,,,,,,,,,,,,,,,,,,,,,
-800,-800,-800,-800,-800,-800,-800,-800,-800,-800,-800,-800,-800,-800,-800,,,,,,,,,,,,,,,,,,,,,,,,,,,,,,,,,,,,,,
-800,-800,-800,-800,-800,-800,-800,-800,-800,-800,-800,-800,-800,-800,-800,,,,,,,,,,,,,,,,,,,,,,,,,,,,,,,,,,,,,,
-800,-800,-800,-800,-800,-800,-800,-800,-800,-800,-800,-800,-800,-800,-800,,,,,,,,,,,,,,,,,,,,,,,,,,,,,,,,,,,,,,
-800,-800,-800,-800,-800,-800,-800,-800,-800,-800,-800,-800,-800,-800,-800,,,,,,,,,,,,,,,,,,,,,,,,,,,,,,,,,,,,,,
-800,-800,-800,-800,-800,-800,-800,-800,-800,-800,-800,-800,-800,-800,-800,,,,,,,,,,,,,,,,,,,,,,,,,,,,,,,,,,,,,,
-800,-800,-800,-800,-800,-800,-800,-800,-800,-800,-800,-800,-800,-800,-800,,,,,,,,,,,,,,,,,,,,,,,,,,,,,,,,,,,,,,
-800,-800,-800,-800,-800,-800,-800,-800,-800,-800,-800,-800,-800,-800,-800,,,,,,,,,,,,,,,,,,,,,,,,,,,,,,,,,,,,,,
-800,-800,-800,-800,-800,-800,-800,-800,-800,-800,-800,-800,-800,-800,-800,,,,,,,,,,,,,,,,,,,,,,,,,,,,,,,,,,,,,,
-800,-800,-800,-800,-800,-800,-800,-800,-800,-800,-800,-800,-800,-800,-800,,,,,,,,,,,,,,,,,,,,,,,,,,,,,,,,,,,,,,
-800,-800,-800,-800,-800,-800,-800,-800,-800,-800,-800,-800,-800,-800,-800,,,,,,,,,,,,,,,,,,,,,,,,,,,,,,,,,,,,,,
-800,-800,-800,-800,-800,-800,-800,-800,-800,-800,-800,-800,-800,-800,-800,,,,,,,,,,,,,,,,,,,,,,,,,,,,,,,,,,,,,,
-800,-800,-800,-800,-800,-800,-800,-800,-800,-800,-800,-800,-800,-800,-800,,,,,,,,,,,,,,,,,,,,,,,,,,,,,,,,,,,,,,
-800,-800,-800,-800,-800,-800,-800,-800,-800,-800,-800,-800,-800,-800,-800,,,,,,,,,,,,,,,,,,,,,,,,,,,,,,,,,,,,,,
-800,-800,-800,-800,-800,-800,-800,-800,-800,-800,-800,-800,-800,-800,-800,,,,,,,,,,,,,,,,,,,,,,,,,,,,,,,,,,,,,,
-800,-800,-800,-800,-800,-800,-800,-800,-800,-800,-800,-800,-800,-800,-800,,,,,,,,,,,,,,,,,,,,,,,,,,,,,,,,,,,,,,
-800,-800,-800,-800,-800,-800,-800,-800,-800,-800,-800,-800,-800,-800,-800,,,,,,,,,,,,,,,,,,,,,,,,,,,,,,,,,,,,,,
-800,-800,-800,-800,-800,-800,-800,-800,-800,-800,-800,-800,-800,-800,-800,,,,,,,,,,,,,,,,,,,,,,,,,,,,,,,,,,,,,,
-800,-800,-800,-800,-800,-800,-800,-800,-800,-800,-800,-800,-800,-800,-800,,,,,,,,,,,,,,,,,,,,,,,,,,,,,,,,,,,,,,
-800,-800,-800,-800,-800,-800,-800,-800,-800,-800,-800,-800,-800,-800,-800,,,,,,,,,,,,,,,,,,,,,,,,,,,,,,,,,,,,,,
-800,-800,-800,-800,-800,-800,-800,-800,-800,-800,-800,-800,-800,-800,-800,,,,,,,,,,,,,,,,,,,,,,,,,,,,,,,,,,,,,,
-800,-800,-800,-800,-800,-800,-800,-800,-800,-800,-800,-800,-800,-800,-800,,,,,,,,,,,,,,,,,,,,,,,,,,,,,,,,,,,,,,
-800,-800,-800,-800,-800,-800,-800,-800,-800,-800,-800,-800,-800,-800,-800,,,,,,,,,,,,,,,,,,,,,,,,,,,,,,,,,,,,,,
-800,-800,-800,-800,-800,-800,-800,-800,-800,-800,-800,-800,-800,-800,-800,,,,,,,,,,,,,,,,,,,,,,,,,,,,,,,,,,,,,,
-800,-800,-800,-800,-800,-800,-800,-800,-800,-800,-800,-800,-800,-800,-800,,,,,,,,,,,,,,,,,,,,,,,,,,,,,,,,,,,,,,
-800,-800,-800,-800,-800,-800,-800,-800,-800,-800,-800,-800,-800,-800,-800,,,,,,,,,,,,,,,,,,,,,,,,,,,,,,,,,,,,,,
-800,-800,-800,-800,-800,-800,-800,-800,-800,-800,-800,-800,-800,-800,-800,,,,,,,,,,,,,,,,,,,,,,,,,,,,,,,,,,,,,,
-800,-800,-800,-800,-800,-800,-800,-800,-800,-800,-800,-800,-800,-800,-800,,,,,,,,,,,,,,,,,,,,,,,,,,,,,,,,,,,,,,
-800,-800,-800,-800,-800,-800,-800,-800,-800,-800,-800,-800,-800,-800,-800,,,,,,,,,,,,,,,,,,,,,,,,,,,,,,,,,,,,,,
-800,-800,-800,-800,-800,-800,-800,-800,-800,-800,-800,-800,-800,-800,-800,,,,,,,,,,,,,,,,,,,,,,,,,,,,,,,,,,,,,,
-800,-800,-800,-800,-800,-800,-800,-800,-800,-800,-800,-800,-800,-800,-800,,,,,,,,,,,,,,,,,,,,,,,,,,,,,,,,,,,,,,
-800,-800,-800,-800,-800,-800,-800,-800,-800,-800,-800,-800,-800,-800,-800,,,,,,,,,,,,,,,,,,,,,,,,,,,,,,,,,,,,,,
-800,-800,-800,-800,-800,-800,-800,-800,-800,-800,-800,-800,-800,-800,-800,,,,,,,,,,,,,,,,,,,,,,,,,,,,,,,,,,,,,,
-800,-800,-800,-800,-800,-800,-800,-800,-800,-800,-800,-800,-800,-800,-800,,,,,,,,,,,,,,,,,,,,,,,,,,,,,,,,,,,,,,
-800,-800,-800,-800,-800,-800,-800,-800,-800,-800,-800,-800,-800,-800,-800,,,,,,,,,,,,,,,,,,,,,,,,,,,,,,,,,,,,,,
-2000,-800,-800,-800,-800,-800,-800,-800,-800,-800,-800,-800,-800,-800,-2000,,,,,,,,,,,,,,,,,,,,,,,,,,,,,,,,,,,,,,
#,line_max,,,,,,,,,,,,,,,,,,,,,,,,,,,,,,,,,,,,,,,,,,,,,,,,,,,
55547,54007,53978,54001,54175,54652,55112,54875,55409,56611,55736,55256,55757,55859,55634,55201,55947,56417,56063,54375,53856,54117,54605,55196,55385,55277,55696,56029,55885,56705,56492,56207,56830,56809,56116,56506,56786,56585,56214,56528,56686,56258,56903,56012,55983,56085,56678,56102,56268,57091,57136,56361,56192
#,line_min,,,,,,,,,,,,,,,,,,,,,,,,,,,,,,,,,,,,,,,,,,,,,,,,,,,
12265,14673,14534,14244,13941,13668,13018,13186,12354,11622,12182,12544,12149,12200,12151,12527,11982,10948,10955,14170,15015,14317,13822,12990,12827,13007,12177,12044,12134,11629,11716,11783,11400,10970,11910,11513,11159,11669,11711,11159,11095,11402,11315,11585,11436,11441,11100,11622,11427,10976,10817,10817,11112
#,full_max,,,,,,,,,,,,,,,,,,,,,,,,,,,,,,,,,,,,,,,,,,,,,,,,,,,
3000,1345,1339,1338,1339,1348,1331,3000,3000,1324,1324,1317,1296,1296,1282,3000,,,,,,,,,,,,,,,,,,,,,,,,,,,,,,,,,,,,,
1394,1381,1363,1366,1372,1381,1369,3000,3000,1380,1380,1379,1360,1362,1353,1306,,,,,,,,,,,,,,,,,,,,,,,,,,,,,,,,,,,,,
1428,1380,1362,1362,1369,1381,1370,1381,1369,1365,1373,1376,1359,1363,1355,1341,,,,,,,,,,,,,,,,,,,,,,,,,,,,,,,,,,,,,
1439,1398,1383,1383,1394,1401,1390,1407,1374,1370,1383,1387,1372,1373,1365,1355,,,,,,,,,,,,,,,,,,,,,,,,,,,,,,,,,,,,,
1429,1393,1374,1377,1381,1391,1383,1394,1365,1362,1372,1380,1360,1366,1356,1348,,,,,,,,,,,,,,,,,,,,,,,,,,,,,,,,,,,,,
1437,1402,1384,1387,1391,1402,1395,1407,1377,1373,1381,1390,1374,1376,1367,1355,,,,,,,,,,,,,,,,,,,,,,,,,,,,,,,,,,,,,
1429,1395,1379,1381,1387,1400,1390,1401,1369,1366,1376,1384,1367,1370,1362,1351,,,,,,,,,,,,,,,,,,,,,,,,,,,,,,,,,,,,,
1419,1386,1366,1370,1377,1388,1379,1387,1358,1353,1365,1373,1358,1360,1348,1338,,,,,,,,,,,,,,,,,,,,,,,,,,,,,,,,,,,,,
1409,1376,1360,1365,1372,1384,1373,1381,1352,1351,1360,1367,1352,1355,1346,1332,,,,,,,,,,,,,,,,,,,,,,,,,,,,,,,,,,,,,
1393,1365,1351,1355,1360,1372,1362,1370,1353,1339,1394,1374,1339,1341,1334,1318,,,,,,,,,,,,,,,,,,,,,,,,,,,,,,,,,,,,,
1383,1360,1344,1346,1353,1366,1353,1360,1335,1332,1342,1348,1332,1334,1324,1310,,,,,,,,,,,,,,,,,,,,,,,,,,,,,,,,,,,,,
1395,1370,1353,1356,1365,1374,1363,1372,1356,1342,1373,1362,1342,1344,1334,1320,,,,,,,,,,,,,,,,,,,,,,,,,,,,,,,,,,,,,
1381,1358,1344,1346,1353,1365,1352,1359,1335,1334,1342,1349,1332,1334,1324,1309,,,,,,,,,,,,,,,,,,,,,,,,,,,,,,,,,,,,,
1373,1351,1335,1337,1345,1355,1346,1353,1360,1328,1348,1355,1335,1345,1341,1325,,,,,,,,,,,,,,,,,,,,,,,,,,,,,,,,,,,,,
1373,1352,1335,1339,1349,1359,1349,1356,1330,1328,1335,1341,1325,1325,1320,1302,,,,,,,,,,,,,,,,,,,,,,,,,,,,,,,,,,,,,
1359,1335,1320,1325,1332,1345,1335,1339,1337,1311,1356,1349,1311,1313,1304,1286,,,,,,,,,,,,,,,,,,,,,,,,,,,,,,,,,,,,,
1346,1327,1310,1314,1324,1335,1324,1331,1306,1306,1320,1321,1304,1303,1296,1278,,,,,,,,,,,,,,,,,,,,,,,,,,,,,,,,,,,,,
1352,1335,1317,1321,1328,1339,1331,1338,1314,1310,1318,1325,1310,1309,1302,1285,,,,,,,,,,,,,,,,,,,,,,,,,,,,,,,,,,,,,
1337,1318,1302,1304,1316,1327,1317,1325,1299,1295,1303,1310,1297,1296,1286,1274,,,,,,,,,,,,,,,,,,,,,,,,,,,,,,,,,,,,,
1338,1320,1303,1307,1314,1328,1317,1323,1299,1293,1300,1309,1297,1296,1286,1276,,,,,,,,,,,,,,,,,,,,,,,,,,,,,,,,,,,,,
1293,1271,1257,1260,1262,1276,1265,1271,1260,1257,1264,1271,1257,1255,1248,1241,,,,,,,,,,,,,,,,,,,,,,,,,,,,,,,,,,,,,
1260,1248,1233,1236,1244,1255,1243,1250,1237,1236,1241,1250,1237,1236,1227,1222,,,,,,,,,,,,,,,,,,,,,,,,,,,,,,,,,,,,,
1275,1241,1237,1229,1239,1248,1237,1241,1232,1229,1234,1244,1232,1232,1223,1216,,,,,,,,,,,,,,,,,,,,,,,,,,,,,,,,,,,,,
1247,1233,1219,1219,1225,1237,1229,1233,1223,1219,1226,1234,1222,1222,1213,1205,,,,,,,,,,,,,,,,,,,,,,,,,,,,,,,,,,,,,
1254,1239,1229,1232,1233,1247,1237,1240,1232,1230,1233,1243,1229,1227,1222,1213,,,,,,,,,,,,,,,,,,,,,,,,,,,,,,,,,,,,,
1257,1240,1271,1218,1225,1230,1240,1225,1216,1215,1219,1227,1213,1215,1206,1201,,,,,,,,,,,,,,,,,,,,,,,,,,,,,,,,,,,,,
1233,1223,1216,1219,1222,1233,1226,1229,1219,1215,1219,1229,1218,1218,1209,1204,,,,,,,,,,,,,,,,,,,,,,,,,,,,,,,,,,,,,
1232,1220,1211,1216,1218,1227,1218,1222,1212,1212,1216,1225,1211,1212,1205,1199,,,,,,,,,,,,,,,,,,,,,,,,,,,,,,,,,,,,,
1220,1208,1205,1204,1204,1215,1205,1209,1201,1198,1204,1209,1199,1201,1194,1187,,,,,,,,,,,,,,,,,,,,,,,,,,,,,,,,,,,,,
1218,1205,1195,1201,1199,1209,1201,1205,1197,1192,1198,1204,1195,1197,1187,1184,,,,,,,,,,,,,,,,,,,,,,,,,,,,,,,,,,,,,
1232,1218,1206,1211,1211,1219,1212,1212,1206,1204,1206,1215,1205,1206,1198,1195,,,,,,,,,,,,,,,,,,,,,,,,,,,,,,,,,,,,,
1226,1208,1195,1197,1199,1211,1199,1202,1194,1190,1195,1204,1191,1190,1185,1184,,,,,,,,,,,,,,,,,,,,,,,,,,,,,,,,,,,,,
1225,1205,1191,1195,1195,1208,1197,1198,1190,1188,1192,1199,1187,1188,1181,1180,,,,,,,,,,,,,,,,,,,,,,,,,,,,,,,,,,,,,
1220,1202,1188,1192,1194,1204,1192,1191,1185,1183,1188,1194,1184,1181,1177,1176,,,,,,,,,,,,,,,,,,,,,,,,,,,,,,,,,,,,,
1237,1202,1185,1187,1188,1199,1190,1190,1181,1181,1185,1191,1180,1178,1173,1167,,,,,,,,,,,,,,,,,,,,,,,,,,,,,,,,,,,,,
1218,1215,1202,1201,1202,1216,1205,1206,1197,1197,1199,1206,1195,1195,1185,1169,,,,,,,,,,,,,,,,,,,,,,,,,,,,,,,,,,,,,
3000,1209,1198,1185,1185,1192,1178,1174,1160,1159,1163,1174,1163,1164,1153,3000,,,,,,,,,,,,,,,,,,,,,,,,,,,,,,,,,,,,,
#,full_min,,,,,,,,,,,,,,,,,,,,,,,,,,,,,,,,,,,,,,,,,,,,,,,,,,,
100,464,472,475,475,480,483,300,300,489,490,496,486,490,498,100,,,,,,,,,,,,,,,,,,,,,,,,,,,,,,,,,,,,,
451,463,469,469,470,471,473,300,300,473,473,476,463,467,470,511,,,,,,,,,,,,,,,,,,,,,,,,,,,,,,,,,,,,,
448,463,469,479,481,478,473,464,481,471,473,476,463,466,470,508,,,,,,,,,,,,,,,,,,,,,,,,,,,,,,,,,,,,,
448,463,468,469,468,470,462,464,468,471,473,476,463,465,469,507,,,,,,,,,,,,,,,,,,,,,,,,,,,,,,,,,,,,,
446,461,467,466,465,468,459,461,466,468,469,473,461,462,466,501,,,,,,,,,,,,,,,,,,,,,,,,,,,,,,,,,,,,,
447,461,467,466,466,468,459,461,466,468,469,473,461,462,467,496,,,,,,,,,,,,,,,,,,,,,,,,,,,,,,,,,,,,,
445,459,466,465,464,467,459,461,464,468,469,472,460,461,464,495,,,,,,,,,,,,,,,,,,,,,,,,,,,,,,,,,,,,,
445,461,468,466,465,467,460,461,466,467,468,473,460,461,465,494,,,,,,,,,,,,,,,,,,,,,,,,,,,,,,,,,,,,,
447,461,467,466,464,467,460,461,465,468,468,472,460,463,465,492,,,,,,,,,,,,,,,,,,,,,,,,,,,,,,,,,,,,,
441,456,462,462,461,463,456,457,461,463,464,468,456,457,462,486,,,,,,,,,,,,,,,,,,,,,,,,,,,,,,,,,,,,,
438,455,461,460,460,461,453,455,458,462,462,466,453,456,458,484,,,,,,,,,,,,,,,,,,,,,,,,,,,,,,,,,,,,,
438,453,461,459,458,461,453,453,458,460,462,465,453,455,456,480,,,,,,,,,,,,,,,,,,,,,,,,,,,,,,,,,,,,,
437,450,456,456,455,456,451,451,456,458,458,462,451,452,454,477,,,,,,,,,,,,,,,,,,,,,,,,,,,,,,,,,,,,,
434,448,454,454,453,456,449,450,453,456,458,461,450,451,453,474,,,,,,,,,,,,,,,,,,,,,,,,,,,,,,,,,,,,,
433,449,454,453,453,456,448,449,452,456,456,459,448,450,452,471,,,,,,,,,,,,,,,,,,,,,,,,,,,,,,,,,,,,,
431,445,451,451,451,453,447,447,456,453,456,458,446,449,451,468,,,,,,,,,,,,,,,,,,,,,,,,,,,,,,,,,,,,,
433,445,451,451,453,456,448,449,452,454,456,458,446,451,452,468,,,,,,,,,,,,,,,,,,,,,,,,,,,,,,,,,,,,,
430,445,451,451,451,453,446,445,451,452,453,456,445,448,450,465,,,,,,,,,,,,,,,,,,,,,,,,,,,,,,,,,,,,,
428,444,448,448,448,449,443,443,445,448,449,453,442,444,445,461,,,,,,,,,,,,,,,,,,,,,,,,,,,,,,,,,,,,,
428,441,446,448,446,448,442,442,445,448,449,451,442,443,445,459,,,,,,,,,,,,,,,,,,,,,,,,,,,,,,,,,,,,,
430,444,449,450,449,451,444,445,448,451,451,454,444,445,449,461,,,,,,,,,,,,,,,,,,,,,,,,,,,,,,,,,,,,,
425,438,443,443,443,445,439,439,443,445,446,448,448,440,455,463,,,,,,,,,,,,,,,,,,,,,,,,,,,,,,,,,,,,,
425,438,443,443,443,444,438,439,441,445,445,448,442,439,451,455,,,,,,,,,,,,,,,,,,,,,,,,,,,,,,,,,,,,,
422,435,441,441,440,442,435,436,439,441,443,446,435,438,440,447,,,,,,,,,,,,,,,,,,,,,,,,,,,,,,,,,,,,,
418,434,438,438,438,439,434,434,437,438,440,443,434,434,439,443,,,,,,,,,,,,,,,,,,,,,,,,,,,,,,,,,,,,,
418,432,436,435,434,438,434,433,435,438,439,442,433,434,437,440,,,,,,,,,,,,,,,,,,,,,,,,,,,,,,,,,,,,,
416,428,434,433,433,435,430,430,432,434,436,439,430,431,434,435,,,,,,,,,,,,,,,,,,,,,,,,,,,,,,,,,,,,,
413,427,430,430,430,433,428,428,430,432,434,436,428,428,430,432,,,,,,,,,,,,,,,,,,,,,,,,,,,,,,,,,,,,,
413,425,428,428,430,432,426,426,428,431,433,434,427,428,434,430,,,,,,,,,,,,,,,,,,,,,,,,,,,,,,,,,,,,,
408,421,426,425,425,428,423,422,425,426,428,431,423,424,428,425,,,,,,,,,,,,,,,,,,,,,,,,,,,,,,,,,,,,,
408,420,424,424,422,426,422,421,423,426,426,429,422,423,425,424,,,,,,,,,,,,,,,,,,,,,,,,,,,,,,,,,,,,,
408,422,424,425,424,425,421,420,422,423,425,428,421,422,422,421,,,,,,,,,,,,,,,,,,,,,,,,,,,,,,,,,,,,,
405,417,420,421,421,424,419,419,421,422,423,428,420,420,422,418,,,,,,,,,,,,,,,,,,,,,,,,,,,,,,,,,,,,,
405,416,420,420,420,422,417,417,420,421,422,428,420,420,422,418,,,,,,,,,,,,,,,,,,,,,,,,,,,,,,,,,,,,,
405,417,420,420,420,422,419,418,420,421,422,425,418,419,422,417,,,,,,,,,,,,,,,,,,,,,,,,,,,,,,,,,,,,,
404,413,416,417,417,419,415,415,417,417,420,422,417,419,422,418,,,,,,,,,,,,,,,,,,,,,,,,,,,,,,,,,,,,,
100,347,351,350,349,354,352,354,354,358,359,364,359,359,364,100,,,,,,,,,,,,,,,,,,,,,,,,,,,,,,,,,,,,,
#,full_row_delta_max,,,,,,,,,,,,,,,,,,,,,,,,,,,,,,,,,,,,,,,,,,,,,,,,,,,
6000,4000,4000,4000,4000,4000,4000,4000,4000,4000,4000,4000,4000,4000,4000,4000,4000,4000,4000,4000,4000,4000,4000,4000,4000,4000,4000,4000,4000,4000,4000,4000,4000,4000,4000,6000,,,,,,,,,,,,,,,,,
#,full_row_delta_min,,,,,,,,,,,,,,,,,,,,,,,,,,,,,,,,,,,,,,,,,,,,,,,,,,,
-6000,-4000,-4000,-4000,-4000,-4000,-4000,-4000,-4000,-4000,-4000,-4000,-4000,-4000,-4000,-4000,-4000,-4000,-4000,-4000,-4000,-4000,-4000,-4000,-4000,-4000,-4000,-4000,-4000,-4000,-4000,-4000,-4000,-4000,-4000,-6000,,,,,,,,,,,,,,,,,
#,full_col_delta_max,,,,,,,,,,,,,,,,,,,,,,,,,,,,,,,,,,,,,,,,,,,,,,,,,,,
9000,6000,6000,6000,6000,6000,6000,6000,6000,6000,6000,6000,6000,6000,9000,,,,,,,,,,,,,,,,,,,,,,,,,,,,,,,,,,,,,,
#,full_col_delta_min,,,,,,,,,,,,,,,,,,,,,,,,,,,,,,,,,,,,,,,,,,,,,,,,,,,
-9000,-6000,-6000,-6000,-6000,-6000,-6000,-6000,-6000,-6000,-6000,-6000,-6000,-6000,-9000,,,,,,,,,,,,,,,,,,,,,,,,,,,,,,,,,,,,,,
