{
    "ProcessorList": {
        "MiniispPackageProcessor": {
            "RequestType": "MINIISP_REQUEST"
        }
    },
    "ProcessorGraphList": {
        "package": {
            "MiniispPackageProcessor": {}
        }
    }
}