[
    "HispDynamicShareMemoryController",
    "RefenceAEController",
    "HispAEController",
    "HispISOController",
    "HispCameraModeController",
    "HispFastSnapshotController",
    "HispImuSensorController",
    "HispLCDController",
    "HispDualYuvController",
    "LuxController",
    "HispMmiVsyncController"
]
