{
    "DVFS_SUPPORTED": "1",
    "DVFS_ITEM_LIST": [
        {
            "DVFS_MODE": "DVFS_MODE_OPEN_CAMERA",
            "VOTE_LIST": [
                {
                    "ip": "DVFS_IP_ISP",
                    "level": "DVFS_LEVEL_TURBO"
                },
                {
                    "ip": "DVFS_IP_DDR",
                    "level": "17232"
                },
                {
                    "ip": "DVFS_IP_COPYBIT",
                    "level": "DVFS_LEVEL_TURBO"
                }
            ],
            "CONDITION_LIST": []
        },
        {
            "DVFS_MODE": "DVFS_MODE_CLOSE_CAMERA",
            "VOTE_LIST": [
                {
                    "ip": "DVFS_IP_ISP",
                    "level": "DVFS_LEVEL_ULTLOW"
                },
                {
                    "ip": "DVFS_IP_DDR",
                    "level": "0"
                },
                {
                    "ip": "DVFS_IP_COPYBIT",
                    "level": "DVFS_LEVEL_ULTLOW"
                }
            ],
            "CONDITION_LIST": []
        },
        {
            "DVFS_MODE": "DVFS_MODE_START_STREAM",
            "VOTE_LIST": [
                {
                    "ip": "DVFS_IP_ISP",
                    "level": "DVFS_LEVEL_TURBO"
                },
                {
                    "ip": "DVFS_IP_DDR",
                    "level": "13000"
                },
                {
                    "ip": "DVFS_IP_COPYBIT",
                    "level": "DVFS_LEVEL_TURBO"
                }
            ],
            "CONDITION_LIST": []
        },
        {
            "DVFS_MODE": "DVFS_MODE_NORMAL_CAPTURE",
            "VOTE_LIST": [
                {
                    "ip": "DVFS_IP_ISP",
                    "level": "DVFS_LEVEL_TURBO"
                },
                {
                    "ip": "DVFS_IP_DDR",
                    "level": "17232"
                },
                {
                    "ip": "DVFS_IP_COPYBIT",
                    "level": "DVFS_LEVEL_TURBO"
                }
            ],
            "CONDITION_LIST": [
                {
                    "facing": "FACING_FRONT",
                    "VOTE_LIST": [
                        {
                            "ip": "DVFS_IP_DDR",
                            "level": "10588"
                        }
                    ]
                }
            ]
        },
        {
            "DVFS_MODE": "DVFS_MODE_SINGLE_PREVIEW",
            "VOTE_LIST": [
                {
                    "ip": "DVFS_IP_ISP",
                    "level": "DVFS_LEVEL_ULTLOW"
                },
                {
                    "ip": "DVFS_IP_DDR",
                    "level": "5308"
                },
                {
                    "ip": "DVFS_IP_COPYBIT",
                    "level": "DVFS_LEVEL_ULTLOW"
                }
            ],
            "CONDITION_LIST": [
                {
                    "preId": "0x20002",
                    "VOTE_LIST": [
                        {
                            "ip": "DVFS_IP_ISP",
                            "level": "DVFS_LEVEL_LOW"
                        },
                        {
                            "ip": "DVFS_IP_DDR",
                            "level": "10588"
                        }
                    ]
                },
                {
                    "preId": "0x20003",
                    "VOTE_LIST": [
                        {
                            "ip": "DVFS_IP_ISP",
                            "level": "DVFS_LEVEL_LOW"
                        },
                        {
                            "ip": "DVFS_IP_DDR",
                            "level": "10588"
                        }
                    ]
                }
            ]
        },
        {
            "DVFS_MODE": "DVFS_MODE_NORMAL_PREVIEW",
            "VOTE_LIST": [
                {
                    "ip": "DVFS_IP_ISP",
                    "level": "DVFS_LEVEL_ULTLOW"
                },
                {
                    "ip": "DVFS_IP_DDR",
                    "level": "5308"
                },
                {
                    "ip": "DVFS_IP_COPYBIT",
                    "level": "DVFS_LEVEL_ULTLOW"
                }
            ],
            "CONDITION_LIST": [
                {
                    "preId": "0x20002",
                    "VOTE_LIST": [
                        {
                            "ip": "DVFS_IP_ISP",
                            "level": "DVFS_LEVEL_LOW"
                        },
                        {
                            "ip": "DVFS_IP_DDR",
                            "level": "10588"
                        }
                    ]
                },
                {
                    "preId": "0x20003",
                    "VOTE_LIST": [
                        {
                            "ip": "DVFS_IP_ISP",
                            "level": "DVFS_LEVEL_LOW"
                        },
                        {
                            "ip": "DVFS_IP_DDR",
                            "level": "10588"
                        }
                    ]
                }
            ]
        },
        {
            "DVFS_MODE": "DVFS_MODE_DUAL_YUV_PREVIEW",
            "VOTE_LIST": [
                {
                    "ip": "DVFS_IP_ISP",
                    "level": "DVFS_LEVEL_LOW"
                },
                {
                    "ip": "DVFS_IP_DDR",
                    "level": "7100"
                },
                {
                    "ip": "DVFS_IP_COPYBIT",
                    "level": "DVFS_LEVEL_ULTLOW"
                }
            ],
            "CONDITION_LIST": [
                {
                    "preId": "0x20002",
                    "VOTE_LIST": [
                        {
                            "ip": "DVFS_IP_ISP",
                            "level": "DVFS_LEVEL_LOW"
                        },
                        {
                            "ip": "DVFS_IP_DDR",
                            "level": "10588"
                        }
                    ]
                },
                {
                    "preId": "0x20003",
                    "VOTE_LIST": [
                        {
                            "ip": "DVFS_IP_ISP",
                            "level": "DVFS_LEVEL_LOW"
                        },
                        {
                            "ip": "DVFS_IP_DDR",
                            "level": "10588"
                        }
                    ]
                }
            ]
        },
        {
            "DVFS_MODE": "DVFS_MODE_NORMAL_VIDEO",
            "VOTE_LIST": [
                {
                    "ip": "DVFS_IP_ISP",
                    "level": "DVFS_LEVEL_ULTLOW"
                },
                {
                    "ip": "DVFS_IP_DDR",
                    "level": "7100"
                },
                {
                    "ip": "DVFS_IP_COPYBIT",
                    "level": "DVFS_LEVEL_ULTLOW"
                }
            ],
            "CONDITION_LIST": [
                {
                    "preId": "0x20002",
                    "VOTE_LIST": [
                        {
                            "ip": "DVFS_IP_ISP",
                            "level": "DVFS_LEVEL_LOW"
                        },
                        {
                            "ip": "DVFS_IP_DDR",
                            "level": "10588"
                        }
                    ]
                },
                {
                    "preId": "0x20003",
                    "VOTE_LIST": [
                        {
                            "ip": "DVFS_IP_ISP",
                            "level": "DVFS_LEVEL_LOW"
                        },
                        {
                            "ip": "DVFS_IP_DDR",
                            "level": "10588"
                        }
                    ]
                }
            ]
        },
        {
            "DVFS_MODE": "DVFS_MODE_4K_VIDEO",
            "VOTE_LIST": [
                {
                    "ip": "DVFS_IP_ISP",
                    "level": "DVFS_LEVEL_LOW"
                },
                {
                    "ip": "DVFS_IP_DDR",
                    "level": "10588"
                },
                {
                    "ip": "DVFS_IP_COPYBIT",
                    "level": "DVFS_LEVEL_ULTLOW"
                }
            ],
            "CONDITION_LIST": [
                {
                    "preId": "0x20000",
                    "VOTE_LIST": [
                        {
                            "ip": "DVFS_IP_ISP",
                            "level": "DVFS_LEVEL_ULTLOW"
                        }
                    ]
                },
                {
                    "preId": "0x20001",
                    "VOTE_LIST": [
                        {
                            "ip": "DVFS_IP_ISP",
                            "level": "DVFS_LEVEL_ULTLOW"
                        }
                    ]
                }
            ]
        },
        {
            "DVFS_MODE": "DVFS_MODE_BOKEH_PREVIEW",
            "VOTE_LIST": [
                {
                    "ip": "DVFS_IP_ISP",
                    "level": "DVFS_LEVEL_LOW"
                },
                {
                    "ip": "DVFS_IP_DDR",
                    "level": "5308"
                },
                {
                    "ip": "DVFS_IP_COPYBIT",
                    "level": "DVFS_LEVEL_ULTLOW"
                }
            ]
        },
        {
            "DVFS_MODE": "DVFS_MODE_BOKEH_VIDEO",
            "VOTE_LIST": [
                {
                    "ip": "DVFS_IP_ISP",
                    "level": "DVFS_LEVEL_NORMAL"
                },
                {
                    "ip": "DVFS_IP_DDR",
                    "level": "5308"
                },
                {
                    "ip": "DVFS_IP_COPYBIT",
                    "level": "DVFS_LEVEL_NORMAL"
                }
            ],
            "CONDITION_LIST": []
        },
        {
            "DVFS_MODE": "DVFS_MODE_HFR",
            "VOTE_LIST": [
                {
                    "ip": "DVFS_IP_ISP",
                    "level": "DVFS_LEVEL_NORMAL"
                },
                {
                    "ip": "DVFS_IP_DDR",
                    "level": "13000"
                },
                {
                    "ip": "DVFS_IP_COPYBIT",
                    "level": "DVFS_LEVEL_NORMAL"
                }
            ]
        },
        {
            "DVFS_MODE": "DVFS_MODE_4K_60_VIDEO",
            "VOTE_LIST": [
                {
                    "ip": "DVFS_IP_ISP",
                    "level": "DVFS_LEVEL_TURBO"
                },
                {
                    "ip": "DVFS_IP_DDR",
                    "level": "17232"
                },
                {
                    "ip": "DVFS_IP_COPYBIT",
                    "level": "DVFS_LEVEL_NORMAL"
                }
            ]
        },
        {
            "DVFS_MODE": "DVFS_MODE_LOWPOWER",
            "VOTE_LIST": [
                {
                    "ip": "DVFS_IP_ISP",
                    "level": "DVFS_LEVEL_LOW"
                },
                {
                    "ip": "DVFS_IP_DDR",
                    "level": "5308"
                },
                {
                    "ip": "DVFS_IP_COPYBIT",
                    "level": "DVFS_LEVEL_ULTLOW"
                }
            ],
            "CONDITION_LIST": [
                {
                    "facing": "FACING_FRONT",
                    "VOTE_LIST": [
                        {
                            "ip": "DVFS_IP_ISP",
                            "level": "DVFS_LEVEL_ULTLOW"
                        }
                    ]
                }
            ]
        },
        {
            "DVFS_MODE": "DVFS_MODE_MIDPERFORMANCE",
            "VOTE_LIST": [
                {
                    "ip": "DVFS_IP_ISP",
                    "level": "DVFS_LEVEL_NORMAL"
                },
                {
                    "ip": "DVFS_IP_DDR",
                    "level": "10000"
                },
                {
                    "ip": "DVFS_IP_COPYBIT",
                    "level": "DVFS_LEVEL_LOW"
                }
            ],
            "CONDITION_LIST": []
        },
        {
            "DVFS_MODE": "DVFS_MODE_HIGHPERFORMANCE",
            "VOTE_LIST": [
                {
                    "ip": "DVFS_IP_ISP",
                    "level": "DVFS_LEVEL_TURBO"
                },
                {
                    "ip": "DVFS_IP_DDR",
                    "level": "17232"
                },
                {
                    "ip": "DVFS_IP_COPYBIT",
                    "level": "DVFS_LEVEL_LOW"
                }
            ],
            "CONDITION_LIST": []
        },
        {
            "DVFS_MODE": "DVFS_MODE_SUPERHIGHPERFORMANCE",
            "VOTE_LIST": [
                {
                    "ip": "DVFS_IP_ISP",
                    "level": "DVFS_LEVEL_TURBO"
                },
                {
                    "ip": "DVFS_IP_DDR",
                    "level": "17232"
                },
                {
                    "ip": "DVFS_IP_COPYBIT",
                    "level": "DVFS_LEVEL_LOW"
                }
            ],
            "CONDITION_LIST": []
        },
        {
            "DVFS_MODE": "DVFS_MODE_DYNAMIC_FPS",
            "VOTE_LIST": [
                {
                    "ip": "DVFS_IP_ISP",
                    "level": "DVFS_LEVEL_NORMAL"
                },
                {
                    "ip": "DVFS_IP_DDR",
                    "level": "13000"
                },
                {
                    "ip": "DVFS_IP_COPYBIT",
                    "level": "DVFS_LEVEL_NORMAL"
                }
            ],
            "CONDITION_LIST": [
                {
                    "facing": "FACING_FRONT",
                    "VOTE_LIST": [
                        {
                            "ip": "DVFS_IP_COPYBIT",
                            "level": "DVFS_LEVEL_ULTLOW"
                        }
                    ]
                }
            ]
        },
        {
            "DVFS_MODE": "DVFS_MODE_ARKIT_PREVIEW",
            "VOTE_LIST": [
                {
                    "ip": "DVFS_IP_ISP",
                    "level": "DVFS_LEVEL_ULTLOW"
                },
                {
                    "ip": "DVFS_IP_DDR",
                    "level": "5308"
                },
                {
                    "ip": "DVFS_IP_COPYBIT",
                    "level": "DVFS_LEVEL_ULTLOW"
                }
            ],
            "CONDITION_LIST": []
        },
        {
            "DVFS_MODE": "DVFS_MODE_ISPNN_LOW",
            "VOTE_LIST": [
                {
                    "ip": "DVFS_IP_DMSS",
                    "level": "415"
                }
            ],
            "CONDITION_LIST": []
        },
        {
            "DVFS_MODE": "DVFS_MODE_ISPNN_MID",
            "VOTE_LIST": [
                {
                    "ip": "DVFS_IP_DMSS",
                    "level": "640"
                }
            ],
            "CONDITION_LIST": []
        },
        {
            "DVFS_MODE": "DVFS_MODE_ISPNN_HIGH",
            "VOTE_LIST": [
                {
                    "ip": "DVFS_IP_DMSS",
                    "level": "830"
                }
            ],
            "CONDITION_LIST": []
        }
    ]
}
