{
    "ProcessorList": {
        "DmapMergeProcessor": {
            "IN_PORT_BUFFER_COUNT": 2,
            "LIST_CAPACITY": 2,
            "MERGE_MODE": 1,
            "TIME_OUT_MS": 150,
            "TIME_INTERVAL_MS": 10
        },
        "DcmMergeProcessor": {
            "IN_PORT_BUFFER_COUNT": 2,
            "LIST_CAPACITY": 2,
            "MERGE_MODE": 1,
            "TIME_OUT_MS": 150,
            "TIME_INTERVAL_MS": 20
        },
        "FactoryTestMergeProcessor": {
            "IN_PORT_BUFFER_COUNT": 2,
            "LIST_CAPACITY": 5,
            "MERGE_MODE": 1
        },
        "CaptureMergeProcessor": {}
    },
    "ProcessorGraphList": {
        "DmapMergeProcessorGraph": {
            "DmapMergeProcessor": {}
        },
        "DcmMergeProcessorGraph": {
            "DcmMergeProcessor": {}
        },
        "FactoryTestMergeProcessorGraph": {
            "FactoryTestMergeProcessor": {}
        },
        "CaptureMergeProcessor": {
            "CaptureMergeProcessor": {}
        }
    }
}
