[
    {
        "ZOOM_RATIO": ["MIN", "MAIN_FOV"],
        "Output": ["main", "@wide"]
    },
    {
        "IS_FIRST_START_UP": [1],
        "ZOOM_RATIO": ["MAIN_FOV", "TELE_FOV"],
        "Output": ["@main"]
    },
    {
        "ZOOM_RATIO": ["MAIN_FOV", "DCM_TELE_UP"],
        "Output": ["@main"]
    },
    {
        "ZOOM_RATIO": ["DCM_TELE_UP", "TELE_FOV"],
        "Output": ["@main", "tele"]
    },
    {
        "IS_FIRST_START_UP": [1],
        "ZOOM_RATIO": ["TELE_FOV", "FORCE_TELE_PREVIEW"],
        "LUMINANCE": ["MIN", 10],
        "Output": ["@main"]
    },
    {
        "IS_FIRST_START_UP": [1],
        "ZOOM_RATIO": ["TELE_FOV", "FORCE_TELE_PREVIEW"],
        "OBJECT_DISTANCE": [0, 100],
        "Output": ["@main"]
    },
    {
        "ZOOM_RATIO": ["TELE_FOV", "FORCE_TELE_PREVIEW"],
        "LUMINANCE": [25, "MAX"],
        "OBJECT_DISTANCE": [140, 999999],
        "Output": ["main", "@tele"]
    },
    {
        "ZOOM_RATIO": ["TELE_FOV", "FORCE_TELE_PREVIEW"],
        "LUMINANCE": ["MIN", 10],
        "Output": ["@main", "tele"]
    },
    {
        "ZOOM_RATIO": ["TELE_FOV", "FORCE_TELE_PREVIEW"],
        "OBJECT_DISTANCE": [0, 100],
        "Output": ["@main", "tele"]
    },
    {
        "ZOOM_RATIO": ["TELE_FOV", "FORCE_TELE_PREVIEW"],
        "Output": ["@main", "tele"],
        "Input": ["main", "@wide"]
    },
    {
        "ZOOM_RATIO": ["TELE_FOV", "FORCE_TELE_PREVIEW"],
        "Output": ["@main", "tele"],
        "Input": ["@wide"]
    },
    {
        "ZOOM_RATIO": ["TELE_FOV", "FORCE_TELE_PREVIEW"],
        "Output": ["@main", "tele"],
        "Input": ["@main", "wide"]
    },
    {
        "ZOOM_RATIO": ["TELE_FOV", "FORCE_TELE_PREVIEW"],
        "Output": ["@main", "tele"],
        "Input": ["@main"]
    },
    {
        "ZOOM_RATIO": ["FORCE_TELE_PREVIEW", "MAX"],
        "Output": ["main", "@tele"]
    }
]