[
    {
        "sensorId": 131072,
        "modelType": 0,
        "disLvTh": 10000,
        "enLvTh": 8000,
        "modelInfo": [
            {
                "modelId": 2,
                "npuFreq": 406,
                "modelInterVal": 0
            }
        ],
        "cameraMode": [
            1
        ]
    }
]