{
    "ProcessorList": {
        "PrePackProcessor": {},
        "PackageProcessor": {
            "RequestType": "BASE_REQUEST"
        },
        "PostPackProcessor": {}
    },
    "ProcessorGraphList": {
        "package": {
            "PrePackProcessor": {
                "PackageProcessor": {
                    "PostPackProcessor": {}
                }
            }
        }
    }
}