{
    "deviceType": [
        "HispDeviceManager",
        "MiniispDeviceManager",
        "SensorDeviceManager",
        "MiniispSensorDeviceManager",
        "HidlSensorDeviceManager"
    ],
    "deviceExType": [
        "FlashDeviceManager",
        "LaserDeviceManager"
    ],
    "hisp": {
        "deviceId": "0x10000",
        "name": "hisp350",
        "enableMdcFlag": 0
    },
    "miniisp": {
        "deviceId": "0x10001",
        "name": "miniisp",
        "igsTofSupport": 1
    },
    "sensorList": [
        {
            "deviceId": "0x20000",
            "name": "C895HIV",
            "ispCameraId": 0,
            "ispDeviceId": "0x10000"
        },
        {
            "deviceId": "0x20000",
            "name": "C998YFI",
            "ispCameraId": 0,
            "ispDeviceId": "0x10000"
        },
        {
            "deviceId": "0x20001",
            "name": "C897UTF",
            "ispCameraId": 1,
            "ispDeviceId": "0x10000"
        },
        {
            "deviceId": "0x20002",
            "name": "C802UTF",
            "ispCameraId": 2,
            "ispDeviceId": "0x10000"
        },
        {
            "deviceId": "0x20002",
            "name": "C802DNR",
            "ispCameraId": 2,
            "ispDeviceId": "0x10000"
        },
        {
            "deviceId": "0x20003",
            "name": "C073OBY",
            "ispCameraId": 3,
            "ispDeviceId": "0x10000"
        },
        {
            "deviceId": "0x20004",
            "name": "C896UTF",
            "ispCameraId": 4,
            "ispDeviceId": "0x10000"
        },
        {
            "deviceId": "0x20005",
            "name": "C897UTFFS",
            "ispCameraId": 0,
            "ispDeviceId": "0x10001"
        },
        {
            "deviceId": "0x20006",
            "hostDeviceId": "0x20004",
            "name": "C896UTFFS",
            "ispCameraId": 2,
            "ispDeviceId": "0x10001"
        },
        {
            "deviceId": "0x20007",
            "hostDeviceId": "0x20002",
            "name": "C802UTFFS",
            "ispCameraId": 65537,
            "ispDeviceId": "0x10001"
        },
        {
            "deviceId": "0x20007",
            "hostDeviceId": "0x20002",
            "name": "C802DNRFS_ALB",
            "ispCameraId": 65537,
            "ispDeviceId": "0x10001"
        },
        {
            "deviceId": "0x20008",
            "name": "C896UTFXG",
            "ispCameraId": 5,
            "ispDeviceId": "0x10000"
        }
    ],
    "laserList": [
        {
            "deviceId": "0x30000",
            "i2cId": 0
        }
    ],
    "flashList": [
        {
            "deviceId": "0x40000",
            "name": "aw3642"
        },
        {
            "deviceId": "0x40000",
            "name": "mp3331"
        },
        {
            "deviceId": "0x40000",
            "name": "sy7804"
        }
    ],
    "imuSensorList": [
        {
            "deviceId": "0xFF000",
            "name": "LIGHT"
        },
        {
            "deviceId": "0xFF001",
            "name": "AWB"
        },
        {
            "deviceId": "0xFF002",
            "name": "FLICKER"
        },
        {
            "deviceId": "0xFF003",
            "name": "LINEAR_ACCELERATION"
        },
        {
            "deviceId": "0xFF004",
            "name": "ACCELEROMETER"
        },
        {
            "deviceId": "0xFF005",
            "name": "GYRO",
            "period": 5000
        },
        {
            "deviceId": "0xFF006",
            "name": "ORIENTATION"
        },
        {
            "deviceId": "0xFF007",
            "name": "ROTATION_VECTOR"
        },
        {
            "deviceId": "0xFF008",
            "name": "MAGNETIC"
        }
    ],
    "virCam": {
        "support" : 1
    },
    "authenticate": [],
    "igs": [],
    "luxSensor": "0x20008",
    "secureType": "0",
    "processorNumber": 5,
    "hardwareScheduleCfgPath": "system/schedule/OptimizedHardwareScheduleConfig.json"
}
