{
    "ProcessorList": {
        "CacheMetadataProcessor": {},
        "RawDownscaleProcessor": {},
        "RawDummyProcessor": {}
    },
    "ProcessorGraphList": {
        "ProcessProcessor": {
            "CacheMetadataProcessor": {
                "RawDownscaleProcessor": {
                    "RawDummyProcessor": {}
                }
            }
        },
        "StartProcessor": {
            "CacheMetadataProcessor": {
                "RawDownscaleProcessor": {}
            }
        },
        "StopProcessor": {
            "CacheMetadataProcessor": {
                "RawDownscaleProcessor": {}
            }
        }
    }
}