{
	"centerX" : 0.5,
	"centerY" : 0.5,
	"angle" : 0,
	"scale" : 1,
	"width" : 140,
	"height" : 140,
	"contents" : [
        {
			"type" : "image",
			"resource":{
                "type":"dynamic",
                "resKey":"{WEATHER_ICON}",
                "resources":[
                    {
                        "key":"unknown",
                        "path":"res/unknown.png"
                    },
                    {
                        "key":"sunny",
                        "path":"res/sunny.png"
                    },{
                        "key":"loudy",
                        "path":"res/loudy.png"
                    },{
                        "key":"mostcloudy",
                        "path":"res/mostcloudy.png"
                    },{
                        "key":"fog",
                        "path":"res/fog.png"
                    },{
                        "key":"showers",
                        "path":"res/showers.png"
                    },{
                        "key":"thunderstorms",
                        "path":"res/thunderstorms.png"
                    },{
                        "key":"rain",
                        "path":"res/rain.png"
                    },{
                        "key":"snow",
                        "path":"res/snow.png"
                    },{
                        "key":"hot",
                        "path":"res/hot.png"
                    },{
                        "key":"cold",
                        "path":"res/cold.png"
                    },{
                        "key":"wind",
                        "path":"res/wind.png"
                    },{
                        "key":"sand",
                        "path":"res/sand.png"
                    },{
                        "key":"haze",
                        "path":"res/haze.png"
                    }
                ]
            },
			"centerX" : 0.5,
			"centerY" : 0.244,
			"width" : 60,
			"height" : 60,
			"angle" : 0,
			"zorder" : 1
        },
        {
			"type" : "image",
			"resource" : {
				"type" : "static",
				"path" : "res/line.png"
			},
			"centerX" : 0.5,
			"centerY" : 0.6,
			"width" : 2,
			"height" : 39,
			"angle" : 0,
			"zorder" : 1
		},
		{
            "type": "text",
            "centerX": 0.23,
            "centerY": 0.56,
            "width": 60,
            "height": 16,
            "angle": 0,
            "color": "#ffffffff",
            "isVertical": 0,
            "alignment": 2,
			"text": "{EEEE}",
            "zorder": 2
		},
		{
            "type": "text",
            "centerX": 0.23,
            "centerY": 0.66,
            "width": 60,
            "height": 16,
            "angle": 0,
            "color": "#ffffffff",
            "isVertical": 0,
            "alignment": 2,
            "text": "{yyyy-MM-dd}",
            "zorder": 2
		},
		{
            "type": "text",
            "centerX": 0.65,
            "centerY" : 0.6,
            "width": 35,
            "height": 35,
            "angle": 0,
            "color": "#ffffffff",
            "isVertical": 0,
			"alignment": 0,
            "text": "{TEMPERATURE}",
            "zorder": 2
        },
		{
			"type" : "image",
			"resource":{
                "type":"dynamic",
                "resKey":"{TEMPERATURE_UNIT}",
                "resources":[
                    {
                        "key":"du",
                        "path":"res/du.png"
                    },
                    {
                        "key":"du_en",
                        "path":"res/du_en.png"
                    },{
                        "key":"du_arabic",
                        "path":"res/du_arabic.png"
                    }
                ]
            },
			"centerX" : 0.87,
			"centerY" : 0.615,
			"width" : 25,
			"height" : 25,
            "angle" : 0,
			"zorder" : 1
        },
        {
			"type" : "image",
			"resource" : {
				"type" : "static",
				"path" : "res/location.png"
			},
			"centerX" : 0.35,
			"centerY" : 0.85,
			"width" : 10,
			"height" : 16,
			"angle" : 0,
			"zorder" : 1
		},
		{
            "type": "text",
            "centerX": 0.65,
            "centerY": 0.85,
            "width": 60,
            "height": 16,
            "angle": 0,
            "color": "#ffffffff",
            "isVertical": 0,
			"alignment": 1,
			"text": "{LOCATION}",
			"editable":true,
            "zorder": 2
		}
	]
}
