{
  "config":{
    "hw_platform": ["QRD", "HDK"],
    "soc_id": ["552", "540", "456", "502", "501"]
  },

  "sns_dynamic_libraries":
  {
    "owner": "dynamic_sensor",
    "detect_on_every_boot":{ "type": "int", "ver": "0",
        "data": "1"
    },
    ".lib0":
    {
      "owner": "dynamic_sensor",
      "name":{ "type": "str", "ver": "0",
        "data": "sns_lsm6dso_normal.so"
      },
      "reg_fun":{ "type": "str", "ver": "0",
        "data": "sns_register_lsm6dso"
      },
      "reg_cnt":{ "type": "int", "ver": "0",
        "data": "1"
      }
    },
    ".lib1":
    {
      "owner": "dynamic_sensor",
      "name":{ "type": "str", "ver": "0",
        "data": "sns_icm206xx_normal.so"
      },
      "reg_fun":{ "type": "str", "ver": "0",
        "data": "sns_register_icm206xx"
      },
      "reg_cnt":{ "type": "int", "ver": "0",
        "data": "1"
      }
    },
    ".lib2":
    {
      "owner": "dynamic_sensor",
      "name":{ "type": "str", "ver": "0",
        "data": "sns_sh3201_normal.so"
      },
      "reg_fun":{ "type": "str", "ver": "0",
        "data": "sns_register_sh3201"
      },
      "reg_cnt":{ "type": "int", "ver": "0",
        "data": "1"
      }
    }
  }
}
