{
  "configVersion": "22",
  "queryTimeout": 1500,
  "updateFrequency": 168,
  "cacheSize": 20,
  "defaultResourcePath": "/iConnect",
  "serverUrl": "",
  "serverPath": "/servicesupport/updateserver/data",
  "configNodeId": "com.huawei.iConnect_cloudConfig_config",
  "configFileId": "config_configFile",
  "deviceRssiOffset": {
    "bcm4359_offset": 0,
    "hi1102_offset": -5,
    "hi1103_offset": -5,
    "hi1102a_offset": 0,
    "hisi_offset": -5
  },
  "deviceList": [
    {
      "nodeId": "com.huawei.iConnect_cloudConfig_config",
      "files": [
        {
          "id": "device_000001",
          "version": "2"
        },
        {
          "id": "device_00000101",
          "version": "2"
        },
        {
          "id": "device_00000102",
          "version": "2"
        }
      ],
      "info": {
        "name": "CM-H2",
        "modelId": "000001",
        "isMustRefresh": true,
        "isActive": true,
        "supportReconnect": false,
        "supportNearby": true,
        "packageName": "com.android.settings",
        "loadLabelName_en": "Settings",
        "loadLabelName_zh": "设置",
        "packageVersion": -1,
        "maxConnectNumber": 2,
        "maxPairNumber": 2,
        "connectType": 1,
        "supportBatteryView": true,
        "rssiReference": -48,
        "rssiLowerLimit": -69,
        "isPairNeedDeviceConfirm": true,
        "layoutType": 1,
        "supportdeviceManager": true,
        "needReportDeviceInfo": true,
        "supportOta": true,
        "updateStringScheme": 1,
        "isCloseBlur": true,
        "supportMbbCmd": [
          "288",
          "3074"
        ],
        "oucUpdateName": "BTFCMH2",
        "supportProfiles": [
          "HEADSET",
          "A2DP"
        ],
        "externalDeviceType":"HEADSETS"
      }
    },
    {
      "nodeId": "com.huawei.iConnect_cloudConfig_config",
      "files": [
        {
          "id": "device_000016",
          "version": "2"
        },
        {
          "id": "device_00001601",
          "version": "2"
        }
      ],
      "info": {
        "name": "CM-H2",
        "modelId": "000016",
        "isMustRefresh": true,
        "isActive": true,
        "supportReconnect": false,
        "supportNearby": true,
        "packageName": "com.android.settings",
        "loadLabelName_en": "Settings",
        "loadLabelName_zh": "设置",
        "packageVersion": -1,
        "maxConnectNumber": 2,
        "maxPairNumber": 2,
        "connectType": 1,
        "supportBatteryView": true,
        "rssiReference": -48,
        "rssiLowerLimit": -69,
        "isPairNeedDeviceConfirm": true,
        "layoutType": 1,
        "supportdeviceManager": true,
        "updateStringScheme": 1,
        "supportOta": true,
        "needReportDeviceInfo": true,
        "isCloseBlur": true,
        "supportMbbCmd": [
          "288",
          "3074"
        ],
        "supportProfiles": [
          "HEADSET",
          "A2DP"
        ],
        "externalDeviceType":"HEADSETS"
      }
    },
    {
      "nodeId": "com.huawei.iConnect_cloudConfig_config",
      "files": [
        {
          "id": "device_000019",
          "version": "2"
        },
        {
          "id": "device_00001901",
          "version": "2"
        }
      ],
      "info": {
        "name": "CM-H2",
        "modelId": "000019",
        "isMustRefresh": true,
        "isActive": true,
        "supportReconnect": false,
        "supportNearby": true,
        "packageName": "com.android.settings",
        "loadLabelName_en": "Settings",
        "loadLabelName_zh": "设置",
        "packageVersion": -1,
        "maxConnectNumber": 2,
        "maxPairNumber": 2,
        "connectType": 1,
        "supportBatteryView": true,
        "rssiReference": -48,
        "rssiLowerLimit": -69,
        "isPairNeedDeviceConfirm": true,
        "layoutType": 1,
        "supportdeviceManager": true,
        "supportOta": true,
        "updateStringScheme": 1,
        "needReportDeviceInfo": true,
        "isCloseBlur": true,
        "supportMbbCmd": [
          "288",
          "3074"
        ],
        "supportProfiles": [
          "HEADSET",
          "A2DP"
        ],
        "externalDeviceType":"HEADSETS"
      }
    },
    {
      "nodeId": "com.huawei.iConnect_cloudConfig_config",
      "files": [
        {
          "id": "device_000002",
          "version": "2"
        }
      ],
      "info": {
        "name": "HUAWEI JANUS",
        "modelId": "000002",
        "isMustRefresh": false,
        "isActive": true,
        "supportReconnect": false,
        "supportNearby": true,
        "packageName": "com.huawei.health",
        "loadLabelName_en": "Sport",
        "loadLabelName_zh": "运动健康",
        "packageVersion": 11,
        "maxConnectNumber": 1,
        "maxPairNumber": 1,
        "connectType": 2,
        "supportBatteryView": false,
        "rssiReference": -45,
        "rssiLowerLimit": -69,
        "isPairNeedDeviceConfirm": false,
        "layoutType": 2,
        "externalDeviceType":"BRACELET",
        "isLaunchNeedForbidNotify": true
      }
    },

    {
      "nodeId": "com.huawei.iConnect_cloudConfig_config",
      "files": [
        {
          "id": "device_000003",
          "version": "2"
        }
      ],
      "info": {
        "name": "BETOP W1",
        "modelId": "000003",
        "isMustRefresh": false,
        "isActive": true,
        "supportReconnect": false,
        "supportNearby": true,
        "packageName": "com.huawei.gameassistant",
        "loadLabelName_en": "AppGallery Assistant",
        "loadLabelName_zh": "应用助手",
        "maxConnectNumber": 1,
        "maxPairNumber": 255,
        "connectType": 1,
        "supportBatteryView": false,
        "rssiReference": -40,
        "rssiLowerLimit": -69,
        "isPairNeedDeviceConfirm": false,
        "layoutType": 4,
        "needBackgroundNotifyApp": true,
        "externalDeviceType":"GAMEPAD",
        "scanCondition": "ro.config.gameassist.peripherals"
      }
    },
    {
      "nodeId": "com.huawei.iConnect_cloudConfig_config",
      "files": [
        {
          "id": "device_000004",
          "version": "2"
        }
      ],
      "info": {
        "name": "BETOP HALF1",
        "modelId": "000004",
        "isMustRefresh": false,
        "isActive": true,
        "supportReconnect": false,
        "supportNearby": true,
        "packageName": "com.huawei.gameassistant",
        "loadLabelName_en": "AppGallery Assistant",
        "loadLabelName_zh": "应用助手",
        "maxConnectNumber": 1,
        "maxPairNumber": 255,
        "connectType": 1,
        "supportBatteryView": false,
        "rssiReference": -40,
        "rssiLowerLimit": -69,
        "isPairNeedDeviceConfirm": false,
        "layoutType": 4,
        "needBackgroundNotifyApp": true,
        "externalDeviceType":"GAMEPAD",
        "scanCondition": "ro.config.gameassist.peripherals"
      }
    },

    {
      "nodeId": "com.huawei.iConnect_cloudConfig_config",
      "files": [
        {
          "id": "device_000005",
          "version": "1"
        }
      ],
      "info": {
        "name": "MateBook",
        "modelId": "000005",
        "isMustRefresh": false,
        "isActive": true,
        "supportReconnect": false,
        "supportNearby": true,
        "packageName": "com.huawei.pcassistant",
        "loadLabelName_en": "PCAssistant",
        "loadLabelName_zh": "电脑助手",
        "packageVersion": 11,
        "maxConnectNumber": 1,
        "maxPairNumber": 1,
        "connectType": 2,
        "supportBatteryView": false,
        "rssiReference": -45,
        "rssiLowerLimit": -69,
        "isPairNeedDeviceConfirm": false,
        "layoutType": 3,
        "externalDeviceType":"PC",
        "modelInfoList":[
          {
            "subModelId":"00",
            "modelName":"MateBook",
            "abilityFlag":0
          },
          {
            "subModelId":"01",
            "modelName":"MateBook",
            "abilityFlag":1
          },
          {
            "subModelId":"02",
            "modelName":"MateBook X",
            "abilityFlag":0
          },
          {
            "subModelId":"03",
            "modelName":"MateBook D",
            "abilityFlag":0
          },
          {
            "subModelId":"04",
            "modelName":"MateBook E",
            "abilityFlag":0
          },
          {
            "subModelId":"05",
            "modelName":"MateBook D(2018)",
            "abilityFlag":0
          },
          {
            "subModelId":"06",
            "modelName":"MateBook X Pro",
            "abilityFlag":0
          },
          {
            "subModelId":"07",
            "modelName":"MateBook 13",
            "abilityFlag":1
          },
          {
            "subModelId":"08",
            "modelName":"MateBook 14",
            "abilityFlag":1
          },
          {
            "subModelId":"09",
            "modelName":"MateBook 15",
            "abilityFlag":1
          }
        ],
        "findNearbyTime":6000,
        "findNearbyCount":10
      }
    },

    {
      "nodeId": "com.huawei.iConnect_cloudConfig_config",
      "files": [
        {
          "id": "device_000006",
          "version": "1"
        }
      ],
      "info": {
        "name": "PC",
        "modelId": "000006",
        "isMustRefresh": false,
        "isActive": true,
        "supportReconnect": false,
        "supportNearby": true,
        "packageName": "com.huawei.pcassistant",
        "loadLabelName_en": "PCAssistant",
        "loadLabelName_zh": "电脑助手",
        "packageVersion": 11,
        "maxConnectNumber": 1,
        "maxPairNumber": 1,
        "connectType": 2,
        "supportBatteryView": false,
        "rssiReference": -45,
        "rssiLowerLimit": -69,
        "isPairNeedDeviceConfirm": false,
        "layoutType": 3,
        "externalDeviceType":"PC",
        "modelInfoList":[
          {
            "subModelId":"01",
            "modelName":"MateStation",
            "abilityFlag":0
          },
          {
            "subModelId":"02",
            "modelName":"HONOR MagicStation",
            "abilityFlag":0
          }
        ],
        "findNearbyTime":6000,
        "findNearbyCount":10
      }
    },

    {
      "nodeId": "com.huawei.iConnect_cloudConfig_config",
      "files": [
        {
          "id": "device_000007",
          "version": "1"
        }
      ],
      "info": {
        "name": "NoteBook",
        "modelId": "000007",
        "isMustRefresh": false,
        "isActive": true,
        "supportReconnect": false,
        "supportNearby": true,
        "packageName": "com.huawei.pcassistant",
        "loadLabelName_en": "PCAssistant",
        "loadLabelName_zh": "电脑助手",
        "packageVersion": 11,
        "maxConnectNumber": 1,
        "maxPairNumber": 1,
        "connectType": 4,
        "supportBatteryView": false,
        "rssiReference": -45,
        "rssiLowerLimit": -69,
        "isPairNeedDeviceConfirm": false,
        "layoutType": 3,
        "externalDeviceType":"PC",
        "modelInfoList":[
          {
            "subModelId":"01",
            "modelName":"Huawei",
            "abilityFlag":0
          },
          {
            "subModelId":"02",
            "modelName": "HONOR",
            "abilityFlag":0
          },
          {
            "subModelId":"03",
            "modelName":"Lenovo",
            "abilityFlag":0
          },
          {
            "subModelId":"04",
            "modelName":"HP",
            "abilityFlag":0
          },
          {
            "subModelId":"05",
            "modelName":"Dell",
            "abilityFlag":0
          },
          {
            "subModelId":"06",
            "modelName":"Apple",
            "abilityFlag":0
          },
          {
            "subModelId":"07",
            "modelName":"Acer",
            "abilityFlag":0
          },
          {
            "subModelId":"08",
            "modelName":"ASUS",
            "abilityFlag":0
          },
          {
            "subModelId":"09",
            "modelName":"Xiaomi",
            "abilityFlag":0
          },
          {
            "subModelId": "0A",
            "modelName": "MateStation",
            "abilityFlag": 0
          },
          {
            "subModelId": "0B",
            "modelName": "HONOR MagicStation",
            "abilityFlag": 1
          },
          {
            "subModelId":"FF",
            "modelName":"Others",
            "abilityFlag":0
          }
        ],
        "findNearbyTime":6000,
        "findNearbyCount":10
      }
    },

    {
      "nodeId": "com.huawei.iConnect_cloudConfig_config",
      "files": [
        {
          "id": "device_000008",
          "version": "1"
        }
      ],
      "info": {
        "name": "MagicBook",
        "modelId": "000008",
        "isMustRefresh": false,
        "isActive": true,
        "supportReconnect": false,
        "supportNearby": true,
        "packageName": "com.huawei.pcassistant",
        "loadLabelName_en": "PCAssistant",
        "loadLabelName_zh": "电脑助手",
        "packageVersion": 11,
        "maxConnectNumber": 1,
        "maxPairNumber": 1,
        "connectType": 2,
        "supportBatteryView": false,
        "rssiReference": -45,
        "rssiLowerLimit": -69,
        "isPairNeedDeviceConfirm": false,
        "layoutType": 3,
        "externalDeviceType":"PC",
        "modelInfoList":[
          {
            "subModelId":"00",
            "modelName":"MagicBook",
            "abilityFlag":0
          },
          {
            "subModelId":"01",
            "modelName":"MagicBook",
            "abilityFlag":1
          },
          {
            "subModelId": "09",
            "modelName": "HONOR HUNTER",
            "abilityFlag": 1
          }
        ],
        "findNearbyTime":6000,
        "findNearbyCount":10
      }
    },

    {
      "nodeId": "com.huawei.iConnect_cloudConfig_config",
      "files": [
        {
          "id": "device_000009",
          "version": "2"
        }
      ],
      "info": {
        "name": "BETOP N2S",
        "modelId": "000009",
        "isMustRefresh": false,
        "isActive": true,
        "supportReconnect": false,
        "supportNearby": true,
        "packageName": "com.huawei.gameassistant",
        "loadLabelName_en": "AppGallery Assistant",
        "loadLabelName_zh": "应用助手",
        "maxConnectNumber": 1,
        "maxPairNumber": 255,
        "connectType": 1,
        "supportBatteryView": false,
        "rssiReference": -40,
        "rssiLowerLimit": -69,
        "isPairNeedDeviceConfirm": false,
        "layoutType": 4,
        "needBackgroundNotifyApp": true,
        "externalDeviceType":"GAMEPAD",
        "scanCondition": "ro.config.gameassist.peripherals"
      }
    },
    {
      "nodeId": "com.huawei.iConnect_cloudConfig_config",
      "files": [
        {
          "id": "device_00000E",
          "version": "1"
        }
      ],
      "info": {
        "name": "Ci31",
        "modelId": "00000E",
        "isMustRefresh": false,
        "isActive": true,
        "supportReconnect": false,
        "supportNearby": true,
        "packageName": "com.huawei.ci31",
        "loadLabelName_en": "",
        "loadLabelName_zh": "荣耀AI测肤",
        "maxConnectNumber": 1,
        "maxPairNumber": 255,
        "connectType": 2,
        "supportBatteryView": false,
        "rssiReference": -43,
        "rssiLowerLimit": -69,
        "isPairNeedDeviceConfirm": false,
        "layoutType": 5,
        "needBackgroundNotifyApp": true,
        "externalDeviceType": "DEFALUT",
        "subExternalDeviceType": "SPECTROSCOPE"
      }
    },
    {
      "nodeId": "com.huawei.iConnect_cloudConfig_config",
      "files": [
        {
          "id": "device_00001A",
          "version": "1"
        }
      ],
      "info": {
        "name": "H1C",
        "modelId": "00001A",
        "isMustRefresh": false,
        "isActive": true,
        "supportReconnect": false,
        "supportNearby": true,
        "packageName": "com.android.settings",
        "loadLabelName_en": "",
        "loadLabelName_zh": "",
        "maxConnectNumber": 1,
        "maxPairNumber": 255,
        "connectType": 1,
        "supportBatteryView": true,
        "supportdeviceManager": true,
        "rssiReference": -31,
        "rssiLowerLimit": -69,
        "isPairNeedDeviceConfirm": false,
        "layoutType": 5,
        "needBackgroundNotifyApp": false,
        "externalDeviceType": "DEFALUT",
        "subExternalDeviceType": "TWS_FLAT"
      }
    },
    {
      "nodeId": "com.huawei.iConnect_cloudConfig_config",
      "files": [
        {
          "id": "device_000010",
          "version": "1"
        }
      ],
      "info": {
        "name": "Vimble2",
        "modelId": "000010",
        "isMustRefresh": false,
        "isActive": true,
        "supportReconnect": false,
        "supportNearby": true,
        "maxConnectNumber": 1,
        "maxPairNumber": 7,
        "connectType": 1,
        "supportBatteryView": false,
        "checkPairedByLocal":true,
        "rssiReference": -50,
        "rssiLowerLimit": -69,
        "isPairNeedDeviceConfirm": false,
        "layoutType": 5,
        "needBackgroundNotifyApp": false,
        "externalDeviceType": "DEFALUT",
        "subExternalDeviceType": "HANDHELD_GIMBAL"
      }
    },
    {
      "nodeId": "com.huawei.iConnect_cloudConfig_config",
      "files": [
        {
          "id": "device_00002F",
          "version": "1"
        }
      ],
      "info": {
        "name": "Om3",
        "modelId": "00002F",
        "isMustRefresh": false,
        "isActive": true,
        "supportReconnect": false,
        "supportNearby": true,
        "maxConnectNumber": 1,
        "maxPairNumber": 7,
        "connectType": 1,
        "supportBatteryView": true,
        "checkPairedByLocal": true,
        "rssiReference": -43,
        "rssiLowerLimit": -69,
        "isPairNeedDeviceConfirm": false,
        "layoutType": 5,
        "needBackgroundNotifyApp": false,
        "isCloseBlur": true,
        "externalDeviceType": "DEFALUT",
        "subExternalDeviceType": "HANDHELD_GIMBAL"
      }
    },
    {
      "nodeId": "com.huawei.iConnect_cloudConfig_config",
      "files": [
        {
          "id": "device_00001B00",
          "version": "1"
        },
        {
          "id": "device_00001B01",
          "version": "1"
        },
        {
          "id": "device_00001B02",
          "version": "1"
        },
        {
          "id": "device_00001B03",
          "version": "1"
        },
        {
          "id": "device_00001B04",
          "version": "1"
        },
        {
          "id": "device_00001B05",
          "version": "1"
        }
      ],
      "info": {
        "name": "HUAWEI FreeLace",
        "modelId": "00001B",
        "isMustRefresh": true,
        "isActive": true,
        "supportReconnect": false,
        "supportNearby": true,
        "packageName": "com.android.settings",
        "loadLabelName_en": "",
        "loadLabelName_zh": "",
        "maxConnectNumber": 1,
        "maxPairNumber": 255,
        "connectType": 1,
        "supportBatteryView": true,
        "rssiReference": -50,
        "rssiLowerLimit": -69,
        "isPairNeedDeviceConfirm": false,
        "layoutType": 5,
        "supportdeviceManager": true,
        "needBackgroundNotifyApp": false,
        "supportOta": true,
        "updateStringScheme": 2,
        "needReportDeviceInfo": true,
        "externalDeviceType":"NECKAROUND"
      }
    },
    {
      "nodeId": "com.huawei.iConnect_cloudConfig_config",
      "files": [
        {
          "id": "device_000051",
          "version": "1"
        }
      ],
      "info": {
        "name": "Huawei Pad",
        "modelId": "000051",
        "isMustRefresh": false,
        "isActive": true,
        "supportReconnect": false,
        "supportNearby": true,
        "packageName": "com.huawei.pcassistant",
        "loadLabelName_en": "PCAssistant",
        "loadLabelName_zh": "电脑助手",
        "packageVersion": 11,
        "maxConnectNumber": 1,
        "maxPairNumber": 1,
        "connectType": 2,
        "supportBatteryView": false,
        "rssiReference": -50,
        "rssiLowerLimit": -75,
        "isPairNeedDeviceConfirm": false,
        "layoutType": 3,
        "externalDeviceType":"PAD",
        "modelInfoList":[
          {
            "subModelId":"00",
            "modelName":"HUAWEI MatePad Pro",
            "abilityFlag":0
          }
        ],
        "supportVersion": [
          "910_9999",
          "911_9999",
          "1000_0006"
        ],
        "findNearbyTime":6000,
        "findNearbyCount":2
      }
    },
    {
      "nodeId": "com.huawei.iConnect_cloudConfig_config",
      "files": [
        {
          "id": "device_00003100",
          "version": "1"
        }
      ],
      "info": {
        "name": "HUAWEI M-Pencil",
        "modelId": "000031",
        "isMustRefresh": false,
        "isActive": true,
        "supportReconnect": false,
        "supportNearby": true,
        "packageName": "com.huawei.stylus.floatmenu",
        "loadLabelName_en": "",
        "loadLabelName_zh": "",
        "maxConnectNumber": 1,
        "maxPairNumber": 255,
        "connectType": 1,
        "supportBatteryView": false,
        "rssiReference": -50,
        "rssiLowerLimit": -69,
        "checkPairedByLocal": true,
        "isPairNeedDeviceConfirm": false,
        "layoutType": 1,
        "supportdeviceManager": false,
        "needBackgroundNotifyApp": false,
        "supportOta": false,
        "supportChannels": [
          "BLE"
        ],
        "externalDeviceType":"PEN"
      }
    },
    {
      "nodeId": "com.huawei.iConnect_cloudConfig_config",
      "files": [
        {
          "id": "device_00011900",
          "version": "1"
        }
      ],
      "info": {
        "name": "Magic-Pencil ",
        "modelId": "000119",
        "isMustRefresh": false,
        "isActive": true,
        "supportReconnect": false,
        "supportNearby": true,
        "packageName": "com.huawei.stylus.floatmenu",
        "loadLabelName_en": "",
        "loadLabelName_zh": "",
        "maxConnectNumber": 1,
        "maxPairNumber": 255,
        "connectType": 1,
        "supportBatteryView": false,
        "rssiReference": -50,
        "rssiLowerLimit": -69,
        "checkPairedByLocal": true,
        "isPairNeedDeviceConfirm": false,
        "layoutType": 1,
        "supportdeviceManager": false,
        "needBackgroundNotifyApp": false,
        "supportOta": false,
        "supportChannels": [
          "BLE"
        ],
        "externalDeviceType":"PEN"
      }
    },
    {
      "nodeId": "com.huawei.iConnect_cloudConfig_config",
      "files": [
        {
          "id": "device_00011A00",
          "version": "1"
        }
      ],
      "info": {
        "name": "M-Pen 2",
        "modelId": "00011A",
        "isMustRefresh": false,
        "isActive": true,
        "supportReconnect": false,
        "supportNearby": true,
        "packageName": "com.huawei.stylus.floatmenu",
        "loadLabelName_en": "",
        "loadLabelName_zh": "",
        "maxConnectNumber": 1,
        "maxPairNumber": 255,
        "connectType": 1,
        "supportBatteryView": false,
        "rssiReference": -50,
        "rssiLowerLimit": -69,
        "checkPairedByLocal": true,
        "isPairNeedDeviceConfirm": false,
        "layoutType": 1,
        "supportdeviceManager": false,
        "needBackgroundNotifyApp": false,
        "supportOta": false,
        "supportChannels": [
          "BLE"
        ],
        "externalDeviceType":"PEN"
      }
    },
     {
      "nodeId": "com.huawei.iConnect_cloudConfig_config",
      "files": [
        {
          "id": "device_00011B00",
          "version": "1"
        }
      ],
      "info": {
        "name": "HUAWEI M-Pencil",
        "modelId": "00011B",
        "isMustRefresh": false,
        "isActive": true,
        "supportReconnect": false,
        "supportNearby": true,
        "packageName": "com.huawei.stylus.floatmenu",
        "loadLabelName_en": "",
        "loadLabelName_zh": "",
        "maxConnectNumber": 1,
        "maxPairNumber": 255,
        "connectType": 1,
        "supportBatteryView": false,
        "rssiReference": -50,
        "rssiLowerLimit": -69,
        "checkPairedByLocal": true,
        "isPairNeedDeviceConfirm": false,
        "layoutType": 1,
        "supportdeviceManager": false,
        "needBackgroundNotifyApp": false,
        "supportOta": false,
        "supportChannels": [
          "BLE"
        ],
        "externalDeviceType":"PEN"
      }
    },
{
      "nodeId": "com.huawei.iConnect_cloudConfig_config",
      "files": [
        {
          "id": "device_00RX0C00",
          "version": "1"
        }
      ],
      "info": {
        "name": "HUAWEI M-Pen 2s",
        "modelId": "00RX0C",
        "isMustRefresh": false,
        "isActive": true,
        "supportReconnect": false,
        "supportNearby": true,
        "packageName": "com.huawei.stylus.floatmenu",
        "loadLabelName_en": "",
        "loadLabelName_zh": "",
        "maxConnectNumber": 1,
        "maxPairNumber": 255,
        "connectType": 1,
        "supportBatteryView": false,
        "rssiReference": -50,
        "rssiLowerLimit": -69,
        "checkPairedByLocal": true,
        "isPairNeedDeviceConfirm": false,
        "layoutType": 1,
        "supportdeviceManager": false,
        "needBackgroundNotifyApp": false,
        "supportOta": false,
        "supportChannels": [
          "BLE"
        ],
        "externalDeviceType":"PEN"
      }
    },
    {
      "nodeId": "com.huawei.iConnect_cloudConfig_config",
      "files": [
        {
          "id": "device_00002700",
          "version": "1"
        },
        {
          "id": "device_00002701",
          "version": "1"
        },
        {
          "id": "device_00002702",
          "version": "1"
        }
      ],
      "info": {
        "name": "FreeBuds 3",
        "modelId": "000027",
        "isMustRefresh": true,
        "isActive": true,
        "supportReconnect": false,
        "supportNearby": true,
        "packageName": "com.android.settings",
        "loadLabelName_en": "",
        "loadLabelName_zh": "",
        "maxConnectNumber": 1,
        "maxPairNumber": 255,
        "connectType": 1,
        "supportBatteryView": true,
        "rssiReference": -48,
        "rssiLowerLimit": -86,
        "isPairNeedDeviceConfirm": false,
        "layoutType": 5,
        "supportdeviceManager": true,
        "needBackgroundNotifyApp": false,
        "supportOta": true,
        "updateStringScheme": 3,
        "isCloseBlur": true,
        "supportMbbCmd": [
          "288",
          "3074",
          "11013"
        ],
        "supportProfiles": [
          "HEADSET_BR",
          "A2DP_BR"
        ],
        "needReportDeviceInfo": true,
        "externalDeviceType": "TWS"
      }
    },
    {
      "nodeId": "com.huawei.iConnect_cloudConfig_config",
      "files": [
        {
          "id": "device_00002B10",
          "version": "1"
        },
        {
          "id": "device_00002B11",
          "version": "1"
        },
        {
          "id": "device_00002B12",
          "version": "1"
        }
      ],
      "info": {
        "name": "HONOR xSport PRO",
        "modelId": "00002B",
        "isMustRefresh": true,
        "isActive": true,
        "supportReconnect": false,
        "supportNearby": true,
        "packageName": "com.android.settings",
        "loadLabelName_en": "",
        "loadLabelName_zh": "",
        "maxConnectNumber": 1,
        "maxPairNumber": 255,
        "connectType": 1,
        "supportBatteryView": true,
        "rssiReference": -50,
        "rssiLowerLimit": -69,
        "isPairNeedDeviceConfirm": false,
        "layoutType": 5,
        "supportdeviceManager": true,
        "needBackgroundNotifyApp": false,
        "supportOta": true,
        "updateStringScheme": 2,
        "needReportDeviceInfo": true,
        "externalDeviceType": "NECKAROUND"
      }
    },
    {
      "nodeId": "com.huawei.iConnect_cloudConfig_config",
      "files": [
        {
          "id": "device_00003801",
          "version": "1"
        },
        {
          "id": "device_00003805",
          "version": "1"
        }
      ],
      "info": {
        "name": "Walrus",
        "modelId": "000038",
        "isMustRefresh": true,
        "isActive": true,
        "supportReconnect": false,
        "supportNearby": true,
        "packageName": "com.android.settings",
        "loadLabelName_en": "",
        "loadLabelName_zh": "",
        "maxConnectNumber": 1,
        "maxPairNumber": 255,
        "connectType": 1,
        "supportBatteryView": true,
        "rssiReference": -60,
        "rssiLowerLimit": -86,
        "isPairNeedDeviceConfirm": false,
        "layoutType": 5,
        "supportdeviceManager": true,
        "needBackgroundNotifyApp": false,
        "supportOta": true,
        "updateStringScheme": 3,
        "supportMbbCmd": [
          "288",
          "3074",
          "11031"
        ],
        "supportProfiles": [
          "HEADSET_BR",
          "A2DP_BR"
        ],
        "needReportDeviceInfo": true,
        "externalDeviceType": "TWS",
        "subExternalDeviceType": "TWS_FLAT"
      }
    },
    {
      "nodeId": "com.huawei.iConnect_cloudConfig_config",
      "files": [
        {
          "id": "device_00002101",
          "version": "1"
        }
      ],
      "info": {
        "name": "CMG0-PERRIER",
        "modelId": "000021",
        "isMustRefresh": false,
        "isActive": true,
        "supportReconnect": false,
        "supportNearby": true,
        "packageName": "com.android.settings",
        "loadLabelName_en": "Settings",
        "loadLabelName_zh": "设置",
        "packageVersion": -1,
        "maxConnectNumber": 2,
        "maxPairNumber": 2,
        "connectType": 1,
        "supportBatteryView": true,
        "rssiReference": -38,
        "rssiLowerLimit": -69,
        "isPairNeedDeviceConfirm": true,
        "layoutType": 5,
        "supportdeviceManager": true,
        "updateStringScheme": 5,
        "supportOta": true,
        "needReportDeviceInfo": true,
        "supportMbbCmd": [
          "288",
          "3074",
          "11023"
        ],
        "supportProfiles": [
          "HEADSET",
          "A2DP"
        ],
        "supportVersion": [
          "910_0002",
          "911_0002",
          "1000_0004"
        ],
        "externalDeviceType": "GLASSES"
      }
    },
    {
      "nodeId": "com.huawei.iConnect_cloudConfig_config",
      "files": [
        {
          "id": "device_00010101",
          "version": "1"
        }
      ],
      "info": {
        "name": "HUAWEI MatePad Keyboard",
        "modelId": "000101",
        "isMustRefresh": false,
        "isActive": true,
        "supportReconnect": false,
        "supportNearby": true,
        "loadLabelName_en": "",
        "loadLabelName_zh": "",
        "maxConnectNumber": 1,
        "maxPairNumber": 255,
        "connectType": 1,
        "supportBatteryView": false,
        "rssiReference": -50,
        "rssiLowerLimit": -69,
        "checkPairedByLocal": true,
        "isPairNeedDeviceConfirm": false,
        "layoutType": 1,
        "supportdeviceManager": false,
        "needBackgroundNotifyApp": false,
        "supportOta": false,
        "supportChannels": [
          "BLE"
        ],
        "externalDeviceType":"KEYBOARD"
      }
    },
    {
      "nodeId": "com.huawei.iConnect_cloudConfig_config",
      "files": [
        {
          "id": "device_00001C02",
          "version": "1"
        }
      ],
      "info": {
        "name": "HUAWEI FreeGO",
        "modelId": "00001C",
        "isMustRefresh": true,
        "isActive": true,
        "supportReconnect": false,
        "supportNearby": true,
        "packageName": "com.android.settings",
        "loadLabelName_en": "",
        "loadLabelName_zh": "",
        "maxConnectNumber": 1,
        "maxPairNumber": 255,
        "connectType": 1,
        "supportBatteryView": true,
        "rssiReference": -50,
        "rssiLowerLimit": -69,
        "isPairNeedDeviceConfirm": false,
        "layoutType": 5,
        "needBackgroundNotifyApp": false,
        "supportOta": true,
        "updateStringScheme": 4,
        "externalDeviceType": "AI_BOX",
        "needReportDeviceInfo": true
      }
    },
    {
      "nodeId": "com.huawei.iConnect_cloudConfig_config",
      "files": [
        {
          "id": "device_00011706",
          "version": "1"
        },
        {
          "id": "device_00011702",
          "version": "1"
        },
        {
          "id": "device_00011704",
          "version": "1"
        }
      ],
      "info": {
        "name": "HUAWEI FreeLace Pro",
        "modelId": "000117",
        "isMustRefresh": true,
        "isActive": true,
        "supportReconnect": false,
        "supportNearby": true,
        "packageName": "com.android.settings",
        "loadLabelName_en": "",
        "loadLabelName_zh": "",
        "maxConnectNumber": 1,
        "maxPairNumber": 255,
        "connectType": 1,
        "supportBatteryView": true,
        "reconnectAutoDisappearTime": 5000,
        "rssiReference": -50,
        "rssiLowerLimit": -69,
        "isPairNeedDeviceConfirm": false,
        "layoutType": 5,
        "supportdeviceManager": true,
        "needBackgroundNotifyApp": false,
        "supportOta": true,
        "updateStringScheme": 2,
        "needReportDeviceInfo": true,
        "supportMbbCmd": [
          "3074",
          "11031"
        ],
        "externalDeviceType": "NECKAROUND"
      }
    },
    {
      "nodeId": "com.huawei.iConnect_cloudConfig_config",
      "files": [
        {
          "id": "device_00041401",
          "version": "1"
        }
      ],
      "info": {
        "name": "BAOJUN530",
        "modelId": "000414",
        "isMustRefresh": false,
        "isActive": true,
        "supportReconnect": false,
        "supportNearby": true,
        "packageName": "com.huawei.hicar",
        "loadLabelName_en": "HUAWEI HiCar",
        "loadLabelName_zh": "HUAWEI HiCar",
        "maxConnectNumber": 1,
        "maxPairNumber": 255,
        "connectType": 2,
        "supportBatteryView": false,
        "rssiReference": -78,
        "rssiLowerLimit": -78,
        "isPairNeedDeviceConfirm": false,
        "layoutType": 4,
        "needBackgroundNotifyApp": false,
        "externalDeviceType":"CAR",
        "isLaunchNeedForbidNotify": true,
        "scanCondition":"ro.config.hw_hicar_mode",
        "supportVersion": [
          "1000_0004"
        ],
        "supportChannels": [
          "BR",
          "USB"
        ]
      }
    },
    {
      "nodeId": "com.huawei.iConnect_cloudConfig_config",
      "files": [
        {
          "id": "device_00003801",
          "version": "1"
        },
        {
          "id": "device_00003805",
          "version": "1"
        }
      ],
      "info": {
        "name": "Walrus",
        "modelId": "000038",
        "isMustRefresh": true,
        "isActive": true,
        "supportReconnect": false,
        "supportNearby": true,
        "packageName": "com.android.settings",
        "loadLabelName_en": "",
        "loadLabelName_zh": "",
        "maxConnectNumber": 1,
        "maxPairNumber": 255,
        "connectType": 1,
        "supportBatteryView": true,
        "rssiReference": -60,
        "rssiLowerLimit": -86,
        "isPairNeedDeviceConfirm": false,
        "layoutType": 5,
        "supportdeviceManager": true,
        "needBackgroundNotifyApp": false,
        "supportOta": true,
        "updateStringScheme": 3,
        "supportMbbCmd": [
          "288",
          "3074",
          "11031"
        ],
        "supportProfiles": [
          "HEADSET_BR",
          "A2DP_BR"
        ],
        "needReportDeviceInfo": true,
        "externalDeviceType": "TWS",
        "subExternalDeviceType": "TWS_FLAT"
      }
    },
    {
      "nodeId": "com.huawei.iConnect_cloudConfig_config",
      "files": [
        {
          "id": "device_00003901",
          "version": "1"
        },
        {
          "id": "device_00003902",
          "version": "1"
        }
      ],
      "info": {
        "name": "HUAWEI FreeBuds 3i",
        "modelId": "000039",
        "isMustRefresh": true,
        "isActive": true,
        "supportReconnect": false,
        "supportNearby": true,
        "packageName": "com.android.settings",
        "loadLabelName_en": "",
        "loadLabelName_zh": "",
        "maxConnectNumber": 1,
        "maxPairNumber": 255,
        "connectType": 1,
        "supportBatteryView": true,
        "rssiReference": -60,
        "rssiLowerLimit": -86,
        "isPairNeedDeviceConfirm": false,
        "layoutType": 5,
        "supportdeviceManager": true,
        "needBackgroundNotifyApp": false,
        "supportOta": true,
        "updateStringScheme": 3,
        "supportMbbCmd": [
          "288",
          "3074",
          "11031"
        ],
        "supportProfiles": [
          "HEADSET_BR",
          "A2DP_BR"
        ],
        "needReportDeviceInfo": true,
        "externalDeviceType": "TWS",
        "subExternalDeviceType": "TWS_FLAT"
      }
    },
    {
      "nodeId": "com.huawei.iConnect_cloudConfig_config",
      "files": [
        {
          "id": "device_0003E800",
          "version": "1"
        }
      ],
      "info": {
        "name": "Car",
        "modelId": "0003E8",
        "isMustRefresh": false,
        "isActive": true,
        "supportReconnect": false,
        "supportNearby": true,
        "packageName": "com.huawei.hicar",
        "loadLabelName_en": "HUAWEI HiCar",
        "loadLabelName_zh": "HUAWEI HiCar",
        "maxConnectNumber": 1,
        "maxPairNumber": 255,
        "connectType": 2,
        "supportBatteryView": false,
        "rssiReference": -48,
        "rssiLowerLimit": -78,
        "isPairNeedDeviceConfirm": false,
        "layoutType": 4,
        "needBackgroundNotifyApp": false,
        "externalDeviceType":"CAR",
        "isLaunchNeedForbidNotify": true,
        "scanCondition":"ro.config.hw_hicar_mode",
        "supportVersion": [
          "1000_0004"
        ],
        "supportChannels": [
          "USB"
        ]
      }
    },
    {
      "nodeId": "com.huawei.iConnect_cloudConfig_config",
      "files": [
        {
          "id": "device_0003E900",
          "version": "1"
        },
        {
          "id": "device_0003E901",
          "version": "1"
        }
      ],
      "info": {
        "name": "RC-6",
        "modelId": "0003E9",
        "isMustRefresh": false,
        "isActive": true,
        "supportReconnect": false,
        "supportNearby": true,
        "packageName": "com.huawei.hicar",
        "loadLabelName_en": "HUAWEI HiCar",
        "loadLabelName_zh": "HUAWEI HiCar",
        "maxConnectNumber": 1,
        "maxPairNumber": 255,
        "connectType": 2,
        "supportBatteryView": false,
        "rssiReference": -60,
        "rssiLowerLimit": -78,
        "isPairNeedDeviceConfirm": false,
        "layoutType": 4,
        "needBackgroundNotifyApp": false,
        "externalDeviceType":"CAR",
        "isLaunchNeedForbidNotify": true,
        "scanCondition":"ro.config.hw_hicar_mode",
        "supportVersion": [
          "1000_0004"
        ],
        "supportChannels": [
          "BR",
          "USB"
        ]
      }
    },
    {
      "nodeId": "com.huawei.iConnect_cloudConfig_config",
      "files": [
        {
          "id": "device_0003EB00",
          "version": "1"
        }
      ],
      "info": {
        "name": "HUAWEI HiCar",
        "modelId": "0003EB",
        "isMustRefresh": false,
        "isActive": true,
        "supportReconnect": false,
        "supportNearby": true,
        "packageName": "com.huawei.hicar",
        "loadLabelName_en": "HUAWEI HiCar",
        "loadLabelName_zh": "HUAWEI HiCar",
        "maxConnectNumber": 1,
        "maxPairNumber": 255,
        "connectType": 2,
        "supportBatteryView": false,
        "rssiReference": -78,
        "rssiLowerLimit": -78,
        "isPairNeedDeviceConfirm": false,
        "layoutType": 4,
        "needBackgroundNotifyApp": false,
        "externalDeviceType":"CAR",
        "isLaunchNeedForbidNotify": true,
        "scanCondition":"ro.config.hw_hicar_mode",
        "supportVersion": [
          "1000_0004"
        ],
        "supportChannels": [
          "BR",
          "USB"
        ]
      }
    },
    {
      "nodeId": "com.huawei.iConnect_cloudConfig_config",
      "files": [
        {
          "id": "device_0003EC00",
          "version": "1"
        }
      ],
      "info": {
        "name": "Car",
        "modelId": "0003EC",
        "isMustRefresh": false,
        "isActive": true,
        "supportReconnect": false,
        "supportNearby": true,
        "packageName": "com.huawei.hicar",
        "loadLabelName_en": "HUAWEI HiCar",
        "loadLabelName_zh": "HUAWEI HiCar",
        "maxConnectNumber": 1,
        "maxPairNumber": 255,
        "connectType": 2,
        "supportBatteryView": false,
        "rssiReference": -60,
        "rssiLowerLimit": -78,
        "isPairNeedDeviceConfirm": false,
        "layoutType": 4,
        "needBackgroundNotifyApp": false,
        "externalDeviceType":"CAR",
        "isLaunchNeedForbidNotify": true,
        "scanCondition":"ro.config.hw_hicar_mode",
        "supportVersion": [
          "1000_0004"
        ],
        "supportChannels": [
          "BR",
          "USB"
        ]
      }
    },
    {
      "nodeId": "com.huawei.iConnect_cloudConfig_config",
      "files": [
        {
          "id": "device_0003ED00",
          "version": "1"
        }
      ],
      "info": {
        "name": "RM-5",
        "modelId": "0003ED",
        "isMustRefresh": false,
        "isActive": true,
        "supportReconnect": false,
        "supportNearby": true,
        "packageName": "com.huawei.hicar",
        "loadLabelName_en": "HUAWEI HiCar",
        "loadLabelName_zh": "HUAWEI HiCar",
        "maxConnectNumber": 1,
        "maxPairNumber": 255,
        "connectType": 2,
        "supportBatteryView": false,
        "rssiReference": -60,
        "rssiLowerLimit": -78,
        "isPairNeedDeviceConfirm": false,
        "layoutType": 4,
        "needBackgroundNotifyApp": false,
        "externalDeviceType":"CAR",
        "isLaunchNeedForbidNotify": true,
        "supportVersion": [
          "1000_0004"
        ],
        "supportChannels": [
          "BR",
          "USB"
        ]
      }
    },
    {
      "nodeId": "com.huawei.iConnect_cloudConfig_config",
      "files": [
        {
          "id": "device_0003EE00",
          "version": "1"
        }
      ],
      "info": {
        "name": "RS-3",
        "modelId": "0003EE",
        "isMustRefresh": false,
        "isActive": true,
        "supportReconnect": false,
        "supportNearby": true,
        "packageName": "com.huawei.hicar",
        "loadLabelName_en": "HUAWEI HiCar",
        "loadLabelName_zh": "HUAWEI HiCar",
        "maxConnectNumber": 1,
        "maxPairNumber": 255,
        "connectType": 2,
        "supportBatteryView": false,
        "rssiReference": -60,
        "rssiLowerLimit": -78,
        "isPairNeedDeviceConfirm": false,
        "layoutType": 4,
        "needBackgroundNotifyApp": false,
        "externalDeviceType":"CAR",
        "isLaunchNeedForbidNotify": true,
        "supportVersion": [
          "1000_0004"
        ],
        "supportChannels": [
          "BR",
          "USB"
        ]
      }
    },
    {
      "nodeId": "com.huawei.iConnect_cloudConfig_config",
      "files": [
        {
          "id": "device_0003EF00",
          "version": "1"
        }
      ],
      "info": {
        "name": "RS-5",
        "modelId": "0003EF",
        "isMustRefresh": false,
        "isActive": true,
        "supportReconnect": false,
        "supportNearby": true,
        "packageName": "com.huawei.hicar",
        "loadLabelName_en": "HUAWEI HiCar",
        "loadLabelName_zh": "HUAWEI HiCar",
        "maxConnectNumber": 1,
        "maxPairNumber": 255,
        "connectType": 2,
        "supportBatteryView": false,
        "rssiReference": -60,
        "rssiLowerLimit": -78,
        "isPairNeedDeviceConfirm": false,
        "layoutType": 4,
        "needBackgroundNotifyApp": false,
        "externalDeviceType":"CAR",
        "isLaunchNeedForbidNotify": true,
        "supportVersion": [
          "1000_0004"
        ],
        "supportChannels": [
          "BR",
          "USB"
        ]
      }
    },
    {
      "nodeId": "com.huawei.iConnect_cloudConfig_config",
      "files": [
        {
          "id": "device_0003F000",
          "version": "1"
        },
        {
          "id": "device_0003F001",
          "version": "1"
        }
      ],
      "info": {
        "name": "RS-7",
        "modelId": "0003F0",
        "isMustRefresh": false,
        "isActive": true,
        "supportReconnect": false,
        "supportNearby": true,
        "packageName": "com.huawei.hicar",
        "loadLabelName_en": "HUAWEI HiCar",
        "loadLabelName_zh": "HUAWEI HiCar",
        "maxConnectNumber": 1,
        "maxPairNumber": 255,
        "connectType": 2,
        "supportBatteryView": false,
        "rssiReference": -60,
        "rssiLowerLimit": -78,
        "isPairNeedDeviceConfirm": false,
        "layoutType": 4,
        "needBackgroundNotifyApp": false,
        "externalDeviceType":"CAR",
        "isLaunchNeedForbidNotify": true,
        "supportVersion": [
          "1000_0004"
        ],
        "supportChannels": [
          "BR",
          "USB"
        ]
      }
    },
    {
      "nodeId": "com.huawei.iConnect_cloudConfig_config",
      "files": [
        {
          "id": "device_000113",
          "version": "1"
        }
      ],
      "info": {
        "name": "Game Case",
        "modelId": "000113",
        "isMustRefresh": true,
        "isActive": true,
        "supportReconnect": false,
        "supportNearby": true,
        "packageName": "com.huawei.gameassistant",
        "loadLabelName_en": "",
        "loadLabelName_zh": "",
        "maxConnectNumber": 1,
        "maxPairNumber": 255,
        "connectType": 1,
        "supportBatteryView": false,
        "rssiReference": -53,
        "rssiLowerLimit": -69,
        "isPairNeedDeviceConfirm": false,
        "layoutType": 4,
        "needBackgroundNotifyApp": true,
        "supportVersion": [
          "1000_0008"
        ],
        "externalDeviceType": "PHONESHELL"
      }
    },
    {
      "nodeId": "com.huawei.iConnect_cloudConfig_config",
      "files": [
        {
          "id": "device_000114",
          "version": "1"
        }
      ],
      "info": {
        "name": "Snorkeling Case",
        "modelId": "000114",
        "isMustRefresh": true,
        "isActive": true,
        "supportReconnect": false,
        "supportNearby": true,
        "loadLabelName_en": "",
        "loadLabelName_zh": "",
        "maxConnectNumber": 1,
        "maxPairNumber": 255,
        "connectType": 1,
        "supportBatteryView": false,
        "rssiReference": -46,
        "rssiLowerLimit": -69,
        "isPairNeedDeviceConfirm": false,
        "layoutType": 4,
        "needBackgroundNotifyApp": false,
        "supportVersion": [
          "1000_0008"
        ],
        "externalDeviceType": "PHONESHELL"
      }
    },
    {
      "nodeId": "com.huawei.iConnect_cloudConfig_config",
      "files": [
        {
          "id": "device_000108",
          "version": "1"
        }
      ],
      "info": {
        "name": "HUAWEI HET",
        "modelId": "000108",
        "isMustRefresh": false,
        "isActive": true,
        "supportReconnect": false,
        "supportNearby": true,
        "packageName": "com.huawei.health",
        "loadLabelName_en": "Sport",
        "loadLabelName_zh": "运动健康",
        "packageVersion": 11,
        "maxConnectNumber": 1,
        "maxPairNumber": 1,
        "connectType": 2,
        "supportBatteryView": false,
        "rssiReference": -65,
        "rssiLowerLimit": -69,
        "isPairNeedDeviceConfirm": false,
        "layoutType": 2,
        "externalDeviceType":"WATCH",
        "isNotSupportProfile":true,
        "supportVersion": [
          "1000_0008"
        ],
        "isLaunchNeedForbidNotify": true
      }
    },
    {
      "nodeId": "com.huawei.iConnect_cloudConfig_config",
      "files": [
        {
          "id": "device_000109",
          "version": "1"
        }
      ],
      "info": {
        "name": "HUAWEI B6",
        "modelId": "000109",
        "isMustRefresh": false,
        "isActive": true,
        "supportReconnect": false,
        "supportNearby": true,
        "packageName": "com.huawei.health",
        "loadLabelName_en": "Sport",
        "loadLabelName_zh": "运动健康",
        "packageVersion": 11,
        "maxConnectNumber": 1,
        "maxPairNumber": 1,
        "connectType": 2,
        "supportBatteryView": false,
        "rssiReference": -45,
        "rssiLowerLimit": -69,
        "isPairNeedDeviceConfirm": false,
        "layoutType": 2,
        "externalDeviceType": "BRACELET",
        "supportVersion": [
          "1000_0008"
        ],
        "isLaunchNeedForbidNotify": true
      }
    },
    {
      "nodeId": "com.huawei.iConnect_cloudConfig_config",
      "files": [
        {
          "id": "device_00010200",
          "version": "1"
        }
      ],
      "info": {
        "name": "Huawei Phone",
        "modelId": "000102",
        "isMustRefresh": false,
        "isActive": true,
        "supportReconnect": false,
        "supportNearby": true,
        "packageName": "com.hicloud.android.clone",
        "className": "com.huawei.android.clone.activity.sender.ScanQrCodeActivity",
        "loadLabelName_en": "",
        "loadLabelName_zh": "",
        "maxConnectNumber": 1,
        "maxPairNumber": 255,
        "connectType": 3,
        "supportBatteryView": false,
        "rssiReference": -45,
        "rssiLowerLimit": -86,
        "isPairNeedDeviceConfirm": false,
        "layoutType": 5,
        "needBackgroundNotifyApp": true,
        "isLaunchNeedForbidNotify": true,
        "supportVersion": [
          "1000_0008"
        ],
        "externalDeviceType": "PHONE"
      }
    },
    {
      "nodeId": "com.huawei.iConnect_cloudConfig_config",
      "files": [
        {
          "id": "device_00011600",
          "version": "1"
        }
      ],
      "info": {
        "name": "HUAWEI smart Keyboard",
        "modelId": "000116",
        "isMustRefresh": false,
        "isActive": true,
        "supportReconnect": false,
        "supportNearby": true,
        "loadLabelName_en": "",
        "loadLabelName_zh": "",
        "maxConnectNumber": 1,
        "maxPairNumber": 255,
        "connectType": 1,
        "supportBatteryView": false,
        "rssiReference": -50,
        "rssiLowerLimit": -69,
        "checkPairedByLocal": true,
        "isPairNeedDeviceConfirm": false,
        "layoutType": 1,
        "supportdeviceManager": false,
        "needBackgroundNotifyApp": false,
        "supportOta": false,
        "supportChannels": [
          "BLE"
        ],
        "externalDeviceType":"KEYBOARD"
      }
    },
    {
      "nodeId": "com.huawei.iConnect_cloudConfig_config",
      "files": [
        {
          "id": "device_00011500",
          "version": "1"
        }
      ],
      "info": {
        "name": "DDPAI R1",
        "modelId": "000115",
        "isMustRefresh": false,
        "isActive": true,
        "supportReconnect": false,
        "supportNearby": true,
        "loadLabelName_en": "",
        "loadLabelName_zh": "",
        "maxConnectNumber": 1,
        "maxPairNumber": 255,
        "connectType": 1,
        "supportBatteryView": false,
        "rssiReference": -48,
        "rssiLowerLimit": -86,
        "checkPairedByLocal": true,
        "isPairNeedDeviceConfirm": false,
        "layoutType": 5,
        "supportdeviceManager": true,
        "needBackgroundNotifyApp": false,
        "needReportDeviceInfo": true,
        "isLaunchNeedForbidNotify": true,
        "supportVersion": [
          "1000_0008"
        ],
        "externalDeviceType": "PHONE_HOLDER",
        "buttonType":1
      }
    },
    {
      "nodeId": "com.huawei.iConnect_cloudConfig_config",
      "files": [
        {
          "id": "device_00003B02",
          "version": "1"
        }
      ],
      "info": {
        "name": "HUAWEI FreeBuds Studio",
        "modelId": "00003B",
        "isMustRefresh": false,
        "isActive": true,
        "supportReconnect": false,
        "supportNearby": true,
        "supportOverlapLayout": false,
        "isCloseBlur": true,
        "supportOverlapVersion": 2,
        "packageName": "com.android.settings",
        "loadLabelName_en": "",
        "loadLabelName_zh": "",
        "maxConnectNumber": 1,
        "maxPairNumber": 255,
        "connectType": 1,
        "supportBatteryView": true,
        "rssiReference": -50,
        "rssiLowerLimit": -69,
        "isPairNeedDeviceConfirm": false,
        "layoutType": 5,
        "supportdeviceManager": true,
        "needBackgroundNotifyApp": false,
        "supportOta": true,
        "updateStringScheme": 2,
        "supportMbbCmd": [
          "3074"
        ],
        "supportProfiles": [
          "HEADSET_BR",
          "A2DP_BR"
        ],
        "needReportDeviceInfo": true,
        "externalDeviceType": "HEADWEAR"
      }
    },
    {
      "nodeId": "com.huawei.iConnect_cloudConfig_config",
      "files": [
        {
          "id": "device_00003C01",
          "version": "1"
        }
      ],
      "info": {
        "name": "HUAWEI FreeBuds Pro",
        "modelId": "00003C",
        "isMustRefresh": true,
        "isActive": true,
        "supportReconnect": false,
        "supportNearby": true,
        "supportOverlapLayout": false,
        "supportOverlapVersion": 2,
        "isCloseBlur": true,
        "packageName": "com.android.settings",
        "loadLabelName_en": "",
        "loadLabelName_zh": "",
        "maxConnectNumber": 1,
        "maxPairNumber": 255,
        "connectType": 1,
        "supportBatteryView": true,
        "rssiReference": -60,
        "rssiLowerLimit": -86,
        "isPairNeedDeviceConfirm": false,
        "layoutType": 5,
        "supportdeviceManager": true,
        "needBackgroundNotifyApp": false,
        "supportOta": true,
        "updateStringScheme": 3,
        "supportMbbCmd": [
          "3074"
        ],
        "supportProfiles": [
          "HEADSET_BR",
          "A2DP_BR"
        ],
        "needReportDeviceInfo": true,
        "externalDeviceType": "TWS",
        "subExternalDeviceType": "TWS_FLAT_MERMAID"
      }
    },
    {
      "nodeId": "com.huawei.iConnect_cloudConfig_config",
      "files": [
        {
          "id": "device_00012200",
          "version": "1"
        },
        {
          "id": "device_00012201",
          "version": "1"
        }
      ],
      "info": {
        "name": "EYEWEAR II",
        "modelId": "000122",
        "isMustRefresh": true,
        "isActive": true,
        "supportReconnect": false,
        "supportNearby": true,
        "supportOverlapLayout": false,
        "supportOverlapVersion": 2,
        "isCloseBlur": true,
        "packageName": "com.android.settings",
        "loadLabelName_en": "Settings",
        "loadLabelName_zh": "设置",
        "packageVersion": -1,
        "maxConnectNumber": 2,
        "maxPairNumber": 2,
        "connectType": 1,
        "supportBatteryView": true,
        "rssiReference": -48,
        "rssiLowerLimit": -69,
        "isPairNeedDeviceConfirm": true,
        "layoutType": 5,
        "supportdeviceManager": true,
        "updateStringScheme": 5,
        "supportOta": true,
        "needReportDeviceInfo": true,
        "supportProfiles": [
          "HEADSET",
          "A2DP"
        ],
        "supportVersion": [
          "910_0002",
          "911_0002",
          "1000_0004"
        ],
        "externalDeviceType": "GLASSES",
        "subExternalDeviceType": "GLASSES_NO_BOX"
      }
    },
    {
      "nodeId": "com.huawei.iConnect_cloudConfig_config",
      "files": [
        {
          "id": "device_00H001",
          "version": "1"
        }
      ],
      "info": {
        "name": "T-Touch Connect",
        "modelId": "00H001",
        "isMustRefresh": false,
        "isActive": true,
        "supportReconnect": false,
        "supportNearby": true,
        "packageName": "com.tissotwatches.smartwatch.solar",
        "className": "com.tissot.chronosnba.splash.SplashActivity",
        "loadLabelName_en": "T-Connect",
        "loadLabelName_zh": "天梭无界",
        "maxConnectNumber": 1,
        "maxPairNumber": 1,
        "connectType": 3,
        "supportBatteryView": false,
        "rssiReference": -75,
        "rssiLowerLimit": -78,
        "isPairNeedDeviceConfirm": false,
        "layoutType": 5,
        "externalDeviceType":"DEFALUT",
        "supportVersion": [
          "1000_0009"
        ],
        "isLaunchNeedForbidNotify": true
      }
    }
  ]
}
