{
    "lightParameter":
    {
        "booth":{
            "effect_face_num":10,
            "exit_eye_shortside_ratio_l":0.0,
            "exit_eye_shortside_ratio_h":1.0,
            "exit_yaw_threshold":90.0,
            "exit_pitch_threshold":90.0,
            "switch_delay_count":1000000
        },
        "window":{
            "effect_face_num":1,
            "blend_ratio":0.1666,
            "template_path_hori":"blind_hori.jpg",
            "template_path_vert":"blind_vert.jpg",
            "exit_eye_shortside_ratio_l":0.1,
            "exit_eye_shortside_ratio_h":0.6,
            "exit_yaw_threshold":30.0,
            "exit_pitch_threshold":30.0,
            "switch_delay_count":10
        },
        "pop":{
            "effect_face_num":1,
            "blend_ratio":0.3,
            "template_path":"Pop.jpg",
            "exit_eye_shortside_ratio_l":0.1,
            "exit_eye_shortside_ratio_h":0.6,
            "exit_yaw_threshold":30.0,
            "exit_pitch_threshold":30.0,
            "switch_delay_count":10
        },
        "stage":{
            "effect_face_num":1,
            "seg_freq":2,
            "exit_eye_shortside_ratio_l":0.1,
            "exit_eye_shortside_ratio_h":0.6,
            "exit_yaw_threshold":30.0,
            "exit_pitch_threshold":30.0,
            "switch_delay_count":10,
            "rotation_source":"landmark",
            "segment_enable":true
        }
    }
}