{
  "config": {
    "hw_platform": ["QRD"],
    "soc_id": ["515", "415", "439", "456", "502", "501", "552", "540"]
  },
  "sns_hw_mag_cal": {
    "owner": "sns_hw_mag_cal",
    ".config": {
      "owner": "sns_hw_mag_cal",
      "phone_shape": {"type": "int","ver": "0","data": "2"},
      "doe": {"type": "int","ver": "0","data": "0"},
      "difscreen": {"type": "int","ver": "0","data": "1"}
    },
    ".bias": {
      "owner": "sns_hw_mag_cal",
      "data_0": {"type": "int","ver": "0","data": "0"},
      "data_1": {"type": "int","ver": "0","data": "0"},
      "data_2": {"type": "int","ver": "0","data": "0"},
      "data_3": {"type": "int","ver": "0","data": "0"},
      "data_4": {"type": "int","ver": "0","data": "0"},
      "data_5": {"type": "int","ver": "0","data": "0"}
    }
  }
}
