[
  {
    "color": [
      0.3144092857837677,
      0.31440785527229309,
      0.31440785527229309
    ],
    "ignore_ext_mv": false,
    "intensity_diff": 5,
    "intensity_spec": 0,
    "ltc_two_sided": true,
    "name": "key",
    "onnoff": true,
    "rel_rot": [
      -0.41399002075195313,
      -0.57048022747039795,
      0
    ],
    "rel_scale": [
      2,
      1
    ],
    "rel_trans": [
      -4.0011811256408691,
      3.25543212890625,
      6.2358050346374512
    ],
    "shadow_cast": true,
    "type": "AREA"
  },
  {
    "color": [
      0.70990538597106934,
      0.70990216732025146,
      0.70990216732025146
    ],
    "ignore_ext_mv": true,
    "intensity_diff": 10,
    "intensity_spec": 0,
    "ltc_two_sided": true,
    "name": "fill",
    "onnoff": false,
    "rel_rot": [
      0,
      0.90986084938049316,
      5
    ],
    "rel_scale": [
      2,
      2
    ],
    "rel_trans": [
      2.5720000267028809,
      0,
      2
    ],
    "shadow_cast": false,
    "type": "AREA"
  },
  {
    "color": [
      0.70990538597106934,
      0.70990216732025146,
      0.70990216732025146
    ],
    "ignore_ext_mv": true,
    "intensity_diff": 10,
    "intensity_spec": 0.10000000149011612,
    "ltc_two_sided": true,
    "name": "back",
    "onnoff": false,
    "rel_rot": [
      0.1140739917755127,
      -1.167569637298584,
      0
    ],
    "rel_scale": [
      1,
      1
    ],
    "rel_trans": [
      -2.9773173332214355,
      -0.37085846066474915,
      1.2701292037963867
    ],
    "shadow_cast": false,
    "type": "AREA"
  }
]
