[
    {
        "conditionList": [
            {
                "name": "ZOOM_RATIO",
                "min": 0,
                "max": 9999.0
            }
        ],
        "outState": [
            {
                "camName": "main",
                "prev": "true"
            }
        ]
    }
]
