[
    {
        "deviceId": "0x20001",
        "name": "main",
        "mask": "0x01"
    },
    {
        "deviceId": "0x20004",
        "name": "tof",
        "mask": "0x02"
    },
    {
        "deviceId": "0x20005",
        "name": "igs",
        "mask": "0x04"
    }
]
