{
    "SCALE_SCENE_DEFAULT": {
        "ENV_SHELL_TEMP": {
            "ENV_LEVEL_WELL":     { "value": "0" },
            "ENV_LEVEL_NORMAL":   { "value": "1" },
            "ENV_LEVEL_REDUCING": { "value": "2" },
            "ENV_LEVEL_LIMITED":  { "value": "3" },
            "ENV_LEVEL_NA":       { "low":   "4" }
        }
    },
    "SCALE_SCENE_VIDEO": {
        "ENV_SHELL_TEMP": {
            "ENV_LEVEL_NORMAL":   { "value": "0" },
            "ENV_LEVEL_REDUCING": { "value": "1" },
            "ENV_LEVEL_LIMITED":  { "value": "2" },
            "ENV_LEVEL_NA":       { "value": "3" },
            "ENV_LEVEL_SUPER_HOT":{ "low":   "4" }
        }
    }
}
