﻿{
	"centerX" : 0.5,
	"centerY" : 0.5,
	"angle" : 0,
	"scale" : 1,
	"width" : 60,
	"height" : 192,
	"contents" : [{
			"type" : "image",
			"resource":{
				"type":"dynamic",
				"resKey":"{t}",
				"resources":[
					{
						"key":"小寒",
						"path":"res/xiaohan.png"
					},
					{
						"key":"小寒-大寒",
						"path":"res/xiaohan_dahan.png"
					},
					{
						"key":"大寒",
						"path":"res/dahan.png"
					},
					{
						"key":"大寒-立春",
						"path":"res/dahan_lichun.png"
					},{
						"key":"立春",
						"path":"res/lichun.png"
					},
					{
						"key":"立春-雨水",
						"path":"res/lichun_yushui.png"
					},
					{
						"key":"雨水",
						"path":"res/yushui.png"
					},{
						"key":"雨水-惊蛰",
						"path":"res/yushui_jingzhe.png"
					},
					{
						"key":"惊蛰",
						"path":"res/jingzhe.png"
					},
					{
						"key":"惊蛰-春分",
						"path":"res/jingzhe_chunfen.png"
					},
					{
						"key":"春分",
						"path":"res/chunfen.png"
					},{
						"key":"春分-清明",
						"path":"res/chunfen_qingming.png"
					},
					{
						"key":"清明",
						"path":"res/qingming.png"
					},
					{
						"key":"清明-谷雨",
						"path":"res/qingming_guyu.png"
					},{
						"key":"谷雨",
						"path":"res/guyu.png"
					},
					{
						"key":"谷雨-立夏",
						"path":"res/guyu_lixia.png"
					},
					{
						"key":"立夏",
						"path":"res/lixia.png"
					},
					{
						"key":"立夏-小满",
						"path":"res/lixia_xiaoman.png"
					},{
						"key":"小满",
						"path":"res/xiaoman.png"
					},
					{
						"key":"小满-芒种",
						"path":"res/xiaoman_mangzhong.png"
					},
					{
						"key":"芒种",
						"path":"res/mangzhong.png"
					},{
						"key":"芒种-夏至",
						"path":"res/mangzhong_xiazhi.png"
					},
					{
						"key":"夏至",
						"path":"res/xiazhi.png"
					},
					{
						"key":"夏至-小暑",
						"path":"res/xiazhi_xiaoshu.png"
					},
					{
						"key":"小暑",
						"path":"res/xiaoshu.png"
					},{
						"key":"小暑-大暑",
						"path":"res/xiaoshu_dashu.png"
					},
					{
						"key":"大暑",
						"path":"res/dashu.png"
					},
					{
						"key":"大暑-立秋",
						"path":"res/dashu_liqiu.png"
					},{
						"key":"立秋",
						"path":"res/liqiu.png"
					},
					{
						"key":"立秋-处暑",
						"path":"res/liqiu_chushu.png"
					},
					{
						"key":"处暑",
						"path":"res/chushu.png"
					},
					{
						"key":"处暑-白露",
						"path":"res/chushu_bailu.png"
					},{
						"key":"白露",
						"path":"res/bailu.png"
					},
					{
						"key":"白露-秋分",
						"path":"res/bailu_qiufen.png"
					},
					{
						"key":"秋分",
						"path":"res/qiufen.png"
					},{
						"key":"秋分-寒露",
						"path":"res/qiufen_hanlu.png"
					},
					{
						"key":"寒露",
						"path":"res/hanlu.png"
					},
					{
						"key":"寒露-霜降",
						"path":"res/hanlu_shuangjiang.png"
					},
					{
						"key":"霜降",
						"path":"res/shuangjiang.png"
					},{
						"key":"霜降-立冬",
						"path":"res/shuangjiang_lidong.png"
					},
					{
						"key":"立冬",
						"path":"res/lidong.png"
					},
					{
						"key":"立冬-小雪",
						"path":"res/lidong_xiaoxue.png"
					},{
						"key":"小雪",
						"path":"res/xiaoxue.png"
					},
					{
						"key":"小雪-大雪",
						"path":"res/xiaoxue_daxue.png"
					},
					{
						"key":"大雪",
						"path":"res/daxue.png"
					},
					{
						"key":"大雪-冬至",
						"path":"res/daxue_dongzhi.png"
					},{
						"key":"冬至",
						"path":"res/dongzhi.png"
					},
					{
						"key":"冬至-小寒",
						"path":"res/dongzhi_xiaohan.png"
					}
				]
			},
			"centerX" : 0.5,
			"centerY" : 0.5,
			"width" : 60,
			"height" : 192,
			"angle" : 0,
			"zorder" : 1
		}
	]
}
