{
	"version": "v1",
	"releaseTime": 1650507040,
	"effectiveTime": 1650507040,
	"inChanCommInfo": {
		"inFeqTypeSupp": 2,
		"inPilotRatio": 3,
		"inPilotSeq": 58649,
		"inSyncSymbol": "FFFFFFFFFF",
		"inSpreadSpecSeq": [{
				"freqType": 1,
				"syncSeq": 13687411,
				"dataSeq": 4198960
			}, {
				"freqType": 2,
				"syncSeq": 13687411,
				"dataSeq": 4198960
			}
		]
	},
	"outChanCommInfo": {
		"outCodeMode": 1
	},
	"beamChanInfo": [{
			"svid": 59,
			"prn": 1,
			"fixDelayOffset": 52018.849
		}, {
			"svid": 59,
			"prn": 2,
			"fixDelayOffset": 52018.840
		}, {
			"svid": 59,
			"prn": 3,
			"fixDelayOffset": 26017.013
		}, {
			"svid": 59,
			"prn": 4,
			"fixDelayOffset": 26017
		}, {
			"svid": 59,
			"prn": 5,
			"fixDelayOffset": 15.367
		}, {
			"svid": 59,
			"prn": 6,
			"fixDelayOffset": 15.354
		}, {
			"svid": 60,
			"prn": 8,
			"fixDelayOffset": 52018.408
		}, {
			"svid": 60,
			"prn": 9,
			"fixDelayOffset": 52018.405
		}, {
			"svid": 60,
			"prn": 10,
			"fixDelayOffset": 26016
		}, {
			"svid": 60,
			"prn": 11,
			"fixDelayOffset": 26016
		}, {
			"svid": 60,
			"prn": 12,
			"fixDelayOffset": 14
		}, {
			"svid": 60,
			"prn": 13,
			"fixDelayOffset": 14
		}, {
			"svid": 61,
			"prn": 15,
			"fixDelayOffset": 52018.650
		}, {
			"svid": 61,
			"prn": 16,
			"fixDelayOffset": 52018.657
		}, {
			"svid": 61,
			"prn": 17,
			"fixDelayOffset": 26016
		}, {
			"svid": 61,
			"prn": 18,
			"fixDelayOffset": 26016
		}, {
			"svid": 61,
			"prn": 19,
			"fixDelayOffset": 15.166
		}, {
			"svid": 61,
			"prn": 20,
			"fixDelayOffset": 15.166
		}
	],
	"cityCoverInfo": {
		"distanceThreshold": 100000,
		"cityList": [{
				"city": "Shanghai",
				"longitude": 121.626961,
				"latitude": 31.265257,
				"beamInfo": [4, 13, 18]
			}, {
				"city": "Shijiazhuang",
				"longitude": 114.357874,
				"latitude": 38.05527,
				"beamInfo": [16, 11, 2]
			}, {
				"city": "Zhumadian",
				"longitude": 113.975647,
				"latitude": 33.002596,
				"beamInfo": [4, 16, 13, 11]
			}, {
				"city": "Beijing",
				"longitude": 116.312915,
				"latitude": 39.8913,
				"beamInfo": [16, 11, 2]
			}, {
				"city": "Qingyang",
				"longitude": 107.626085,
				"latitude": 35.696083,
				"beamInfo": [11, 16, 3]
			}, {
				"city": "Fuzhou",
				"longitude": 119.647353,
				"latitude": 25.915736,
				"beamInfo": [18, 4, 13]
			}, {
				"city": "Wulumuqi",
				"longitude": 87.506437,
				"latitude": 43.829244,
				"beamInfo": [10, 2]
			}, {
				"city": "Tianjin",
				"longitude": 117.202057,
				"latitude": 39.132835,
				"beamInfo": [16, 2, 11]
			}, {
				"city": "Chengdu",
				"longitude": 104.171926,
				"latitude": 30.633633,
				"beamInfo": [3, 17, 12]
			}, {
				"city": "Guiyang",
				"longitude": 106.632655,
				"latitude": 26.627004,
				"beamInfo": [17, 3]
			}, {
				"city": "Hefei",
				"longitude": 117.253505,
				"latitude": 31.767317,
				"beamInfo": [4, 13]
			}, {
				"city": "Datong",
				"longitude": 113.322967,
				"latitude": 40.078989,
				"beamInfo": [16, 11, 2]
			}, {
				"city": "Yinchuan",
				"longitude": 106.17206,
				"latitude": 38.492081,
				"beamInfo": [16, 11, 2]
			}, {
				"city": "Wuhan",
				"longitude": 114.409855,
				"latitude": 30.618538,
				"beamInfo": [4, 13, 18]
			}, {
				"city": "Lasa",
				"longitude": 91.06715,
				"latitude": 29.629213,
				"beamInfo": [15, 10, 3]
			}, {
				"city": "Nanjing",
				"longitude": 118.745894,
				"latitude": 31.934629,
				"beamInfo": [16, 4, 18, 2, 11]
			}, {
				"city": "Chengde",
				"longitude": 117.939901,
				"latitude": 40.976004,
				"beamInfo": [16, 2, 11]
			}, {
				"city": "Shantou",
				"longitude": 116.755227,
				"latitude": 23.352435,
				"beamInfo": [13, 18]
			}, {
				"city": "Tulufan",
				"longitude": 89.108117,
				"latitude": 43.020046,
				"beamInfo": [10, 2]
			}, {
				"city": "Chongqing",
				"longitude": 106.580059,
				"latitude": 29.720063,
				"beamInfo": [3, 17, 12]
			}, {
				"city": "Liupanshui",
				"longitude": 104.848189,
				"latitude": 26.586859,
				"beamInfo": [3, 17, 12]
			}, {
				"city": "Hangzhou",
				"longitude": 120.21399,
				"latitude": 30.246559,
				"beamInfo": [4, 18]
			}, {
				"city": "xuancheng",
				"longitude": 118.76659,
				"latitude": 30.91990,
				"beamInfo": [4, 11, 16]
			}, {
				"city": "Bayannaoer",
				"longitude": 107.419587,
				"latitude": 40.732868,
				"beamInfo": [2, 16, 11]
			}, {
				"city": "Hami",
				"longitude": 93.509176,
				"latitude": 42.841426,
				"beamInfo": [15, 10]
			}, {
				"city": "Huangshi",
				"longitude": 115.033345,
				"latitude": 30.20078,
				"beamInfo": [13, 4, 18]
			}, {
				"city": "Chifeng",
				"longitude": 118.883331,
				"latitude": 42.252811,
				"beamInfo": [16, 11, 2]
			}, {
				"city": "Milin",
				"longitude": 94.21343,
				"latitude": 29.230926,
				"beamInfo": [15, 12, 3]
			}, {
				"city": "Wenshan",
				"longitude": 104.158166,
				"latitude": 24.047306,
				"beamInfo": [17, 3, 12]
			}, {
				"city": "Yongzhou",
				"longitude": 111.597899,
				"latitude": 26.432728,
				"beamInfo": [13, 17]
			}, {
				"city": "Yulin",
				"longitude": 109.743738,
				"latitude": 38.252795,
				"beamInfo": [16, 11, 2]
			}, {
				"city": "Ningbo",
				"longitude": 121.53961,
				"latitude": 29.86771,
				"beamInfo": [4, 18, 13]
			}, {
				"city": "Xining",
				"longitude": 102.040939,
				"latitude": 36.521988,
				"beamInfo": [3, 11]
			}, {
				"city": "Xianggelila",
				"longitude": 99.721829,
				"latitude": 27.840546,
				"beamInfo": [12, 3, 17]
			}, {
				"city": "Rikeze",
				"longitude": 88.892147,
				"latitude": 29.279018,
				"beamInfo": [15, 10]
			}, {
				"city": "Dali",
				"longitude": 100.245572,
				"latitude": 25.601213,
				"beamInfo": [12, 3, 17]
			}, {
				"city": "Jingzhou",
				"longitude": 112.207227,
				"latitude": 30.371255,
				"beamInfo": [13, 4, 3, 17]
			}, {
				"city": "Shenyang",
				"longitude": 123.398176,
				"latitude": 41.782944,
				"beamInfo": [16, 2, 4]
			}, {
				"city": "Haikou",
				"longitude": 110.433285,
				"latitude": 19.947256,
				"beamInfo": [17, 13, 5]
			}, {
				"city": "Kangding",
				"longitude": 101.947589,
				"latitude": 30.000782,
				"beamInfo": [12, 3, 17]
			}, {
				"city": "Delingha",
				"longitude": 97.374095,
				"latitude": 37.373047,
				"beamInfo": [10, 15, 3]
			}, {
				"city": "Baoshan",
				"longitude": 99.178262,
				"latitude": 25.113325,
				"beamInfo": [12, 17]
			}, {
				"city": "Jinan",
				"longitude": 117.023917,
				"latitude": 36.67904,
				"beamInfo": [16, 4, 11]
			}, {
				"city": "Sanya",
				"longitude": 109.492162,
				"latitude": 18.275476,
				"beamInfo": [17, 5]
			}, {
				"city": "Kelamayi",
				"longitude": 84.91451,
				"latitude": 45.545938,
				"beamInfo": [2, 8]
			}, {
				"city": "Bazhong",
				"longitude": 106.752935,
				"latitude": 31.84459,
				"beamInfo": [3, 17]
			}, {
				"city": "Zhangjiajie",
				"longitude": 110.481407,
				"latitude": 29.108777,
				"beamInfo": [3, 17, 13]
			}, {
				"city": "Longnan",
				"longitude": 104.939473,
				"latitude": 33.28828,
				"beamInfo": [3, 11]
			}, {
				"city": "Haiyan",
				"longitude": 100.991585,
				"latitude": 36.895386,
				"beamInfo": [3, 15]
			}, {
				"city": "Panzhihua",
				"longitude": 101.73826,
				"latitude": 26.488759,
				"beamInfo": [3, 12, 17]
			}, {
				"city": "Naqu",
				"longitude": 91.989313,
				"latitude": 31.44474,
				"beamInfo": [15, 10, 3]
			}, {
				"city": "Changsha",
				"longitude": 113.064562,
				"latitude": 28.150001,
				"beamInfo": [13, 3, 17, 4, 18]
			}, {
				"city": "Baise",
				"longitude": 106.631679,
				"latitude": 23.902532,
				"beamInfo": [17, 3, 13]
			}, {
				"city": "Qingdao",
				"longitude": 120.313367,
				"latitude": 36.061748,
				"beamInfo": [4, 16]
			}, {
				"city": "Liuzhou",
				"longitude": 109.413351,
				"latitude": 24.227723,
				"beamInfo": [17, 3, 13]
			}, {
				"city": "Nanchang",
				"longitude": 115.789542,
				"latitude": 28.62982,
				"beamInfo": [4, 13, 18]
			}, {
				"city": "Aletai",
				"longitude": 88.086057,
				"latitude": 47.722452,
				"beamInfo": [2, 10]
			}, {
				"city": "Yibin",
				"longitude": 104.604385,
				"latitude": 28.727795,
				"beamInfo": [3, 17, 12]
			}, {
				"city": "Jiayuguan",
				"longitude": 98.285958,
				"latitude": 39.77417,
				"beamInfo": [10, 15, 2]
			}, {
				"city": "Nanning",
				"longitude": 108.223527,
				"latitude": 22.829801,
				"beamInfo": [17, 3, 12]
			}, {
				"city": "Abazhou",
				"longitude": 102.361488,
				"latitude": 32.528476,
				"beamInfo": [3, 12]
			}, {
				"city": "Jinchang",
				"longitude": 102.171864,
				"latitude": 38.543328,
				"beamInfo": [11, 2, 15]
			}, {
				"city": "Guangzhou",
				"longitude": 113.250126,
				"latitude": 23.394154,
				"beamInfo": [13, 17, 5]
			}, {
				"city": "Yining",
				"longitude": 81.277455,
				"latitude": 43.953516,
				"beamInfo": [8, 2]
			}, {
				"city": "Jinghong",
				"longitude": 100.804976,
				"latitude": 22.006410,
				"beamInfo": [12, 17, 3]
			}, {
				"city": "Xian",
				"longitude": 108.940620,
				"latitude": 34.369863,
				"beamInfo": [16, 3, 11]
			}, {
				"city": "Akesu",
				"longitude": 80.271,
				"latitude": 41.148769,
				"beamInfo": [8, 1]
			}, {
				"city": "Kunming",
				"longitude": 102.685723,
				"latitude": 24.943971,
				"beamInfo": [12, 3, 17]
			}, {
				"city": "Kashi",
				"longitude": 76.025429,
				"latitude": 39.486555,
				"beamInfo": [8]
			}, {
				"city": "Kunyu",
				"longitude": 79.275615,
				"latitude": 37.219218,
				"beamInfo": [8, 1, 15]
			}, {
				"city": "Kuerle",
				"longitude": 86.143546,
				"latitude": 41.762544,
				"beamInfo": [10, 15]
			}
		]
	},
	"serviceAreaSuggest": [{
			"svid": 59,
			"prn": 1,
			"position": [
				[75.36241954, 45.18301577],
				[76.49679917, 44.93093141],
				[77.79923504, 44.30072051],
				[79.18569903, 44.09065020],
				[80.36209272, 43.29238306],
				[81.91661296, 42.66217215],
				[82.88293635, 41.94793312],
				[84.01731598, 40.98160973],
				[84.94162531, 39.84723010],
				[85.40377997, 38.71285047],
				[85.23572373, 37.15833024],
				[84.68954094, 36.14999279],
				[84.26940034, 35.09964128],
				[83.68120349, 34.04928977],
				[82.84092229, 33.20900856],
				[81.87459890, 31.94858675],
				[80.86626145, 31.02427742],
				[79.81590994, 30.22601027],
				[78.55548813, 29.63781343],
				[77.46312256, 29.30170094],
				[76.37075699, 28.96558846],
				[74.27005397, 28.50343380],
				[73.38775870, 28.33537756],
				[72.16935095, 28.04127913],
				[71.07698538, 28.08329319],
				[70.02663387, 28.20933537],
				[68.68218393, 28.58746192],
				[67.33773400, 29.00760252],
				[65.74119971, 29.93191185],
				[64.81689038, 31.06629148],
				[64.01862323, 32.24268517],
				[63.80855293, 33.37706480],
				[63.85056699, 34.59547255],
				[64.01862323, 35.98193655],
				[64.52279195, 37.45242866],
				[64.94293256, 38.58680829],
				[65.27904504, 39.38507544],
				[66.03529813, 40.56146913],
				[66.70752310, 41.86390500],
				[67.46377618, 42.74620027],
				[68.26204333, 43.29238306],
				[69.27038078, 44.13266426],
				[70.57281665, 44.93093141],
				[71.66518222, 45.56114232],
				[72.84157591, 45.56114232],
				[74.31206803, 45.56114232]
			]
		},
		{
			"svid": 59,
			"prn": 2,
			"position": [
				[100.31877141, 54.08999658],
				[101.70523540, 54.08999658],
				[103.30176970, 53.79589815],
				[104.64621963, 53.54381379],
				[105.86462738, 53.29172943],
				[107.29310543, 52.91360289],
				[108.84762567, 52.49346228],
				[110.23408966, 52.11533574],
				[111.53652553, 51.69519513],
				[112.96500359, 51.06498423],
				[114.14139728, 50.39275926],
				[115.48584721, 49.72053430],
				[116.62022684, 48.83823903],
				[117.67057835, 48.25004218],
				[118.93100016, 46.82156413],
				[119.77128137, 45.72919856],
				[120.31746416, 44.30072051],
				[120.69559070, 43.04029869],
				[120.69559070, 41.86390500],
				[120.52753446, 40.60348319],
				[119.89732355, 39.80521604],
				[118.97301422, 38.96493484],
				[118.17474708, 38.25069581],
				[117.33446587, 37.83055520],
				[116.36814248, 37.41041460],
				[115.10772067, 36.90624588],
				[113.80528480, 36.69617557],
				[112.54486298, 36.36006309],
				[111.15839899, 35.93992249],
				[109.56186470, 35.98193655],
				[108.17540070, 36.02395061],
				[106.99900701, 36.36006309],
				[105.86462738, 36.40207715],
				[104.43614933, 36.44409121],
				[103.25975564, 36.82221776],
				[102.16739007, 36.99027400],
				[100.86495419, 37.03228806],
				[99.64654644, 37.24235836],
				[98.59619493, 37.24235836],
				[97.08368876, 37.70451302],
				[95.10902792, 38.20868175],
				[93.68054987, 38.46076611],
				[92.50415618, 38.46076611],
				[90.94963594, 38.46076611],
				[89.52115789, 38.67083641],
				[87.84059547, 38.92292077],
				[86.49614554, 39.04896296],
				[85.23572373, 39.13299108],
				[84.43745658, 39.55313168],
				[83.26106289, 39.84723010],
				[81.11834581, 40.56146913],
				[79.77389588, 41.56980658],
				[78.00930534, 42.53612997],
				[76.95895383, 43.33439712],
				[76.37075699, 44.04863614],
				[75.19436329, 45.22502983],
				[74.98429299, 46.35940946],
				[74.98429299, 47.57781722],
				[74.98429299, 48.62816873],
				[75.23637735, 50.05664678],
				[76.79089759, 51.52713889],
				[77.75722098, 52.40943416],
				[79.05965685, 52.87158883],
				[80.44612084, 53.16568725],
				[81.74855672, 53.20770131],
				[83.00897853, 53.58582785],
				[84.43745658, 53.96395440],
				[85.69787839, 53.83791221],
				[87.00031426, 54.04798252],
				[88.59684856, 53.96395440],
				[90.15136879, 53.92194034],
				[91.78991715, 54.30006688],
				[93.26040926, 54.04798252],
				[94.77291544, 54.13201064],
				[96.20139349, 54.00596846],
				[97.54584342, 54.08999658],
				[98.68022305, 53.96395440]
			]
		}, {
			"svid": 59,
			"prn": 3,
			"position": [
				[110.92732166, 35.07863425],
				[111.68357475, 34.15432492],
				[112.18774347, 33.60814213],
				[112.52385595, 32.59980469],
				[113.11205280, 31.92757972],
				[113.61622152, 31.33938287],
				[113.95233401, 30.49910167],
				[114.12039025, 29.40673610],
				[114.28844649, 28.81853925],
				[114.37247461, 28.14631428],
				[114.58254491, 27.30603308],
				[114.45650273, 26.46575187],
				[114.07837619, 25.83554096],
				[113.91031995, 25.03727381],
				[113.44816528, 24.61713321],
				[112.64989813, 23.69282388],
				[112.43982783, 23.23066922],
				[111.93565911, 22.68448643],
				[111.59954663, 22.30635989],
				[110.71725136, 21.50809274],
				[109.20474518, 20.70982559],
				[107.73425307, 20.24767093],
				[106.76792968, 20.07961469],
				[105.42347975, 19.78551627],
				[104.37312824, 19.65947408],
				[103.32277673, 19.32336160],
				[102.48249552, 19.32336160],
				[101.64221431, 19.44940378],
				[100.75991904, 19.65947408],
				[99.66755347, 19.49141784],
				[98.40713166, 19.53343190],
				[97.60886451, 19.53343190],
				[96.85261143, 19.74350221],
				[96.22240052, 19.74350221],
				[95.08802089, 19.78551627],
				[94.28975374, 19.99558657],
				[93.49148660, 20.20565687],
				[92.69321945, 20.16364281],
				[91.97898042, 20.45774123],
				[91.30675546, 20.58378341],
				[90.34043207, 20.28968499],
				[89.41612274, 20.41572717],
				[88.44979935, 20.79385372],
				[87.10534942, 21.12996620],
				[86.43312445, 21.34003650],
				[85.46680106, 21.67614898],
				[84.71054797, 22.22233177],
				[83.78623864, 22.72650049],
				[83.28206992, 23.23066922],
				[82.65185901, 23.69282388],
				[82.27373247, 24.15497855],
				[81.55949344, 24.82720351],
				[81.13935284, 25.62547066],
				[80.63518412, 26.54977999],
				[80.17302945, 27.30603308],
				[80.00497321, 28.06228616],
				[79.83691697, 28.90256737],
				[79.54281855, 30.03694700],
				[79.45879042, 31.04528445],
				[79.37476230, 32.01160784],
				[79.29073418, 33.14598747],
				[79.37476230, 34.28036710],
				[79.79490291, 35.16266237],
				[80.50914193, 35.96092952],
				[81.34942314, 36.38107012],
				[82.31574653, 37.26336539],
				[83.45012616, 37.85156223],
				[84.20637925, 38.22968878],
				[85.34075888, 38.48177314],
				[86.01298385, 39.02795593],
				[86.97930723, 39.02795593],
				[87.73556032, 39.19601217],
				[89.08001025, 39.15399811],
				[90.29841801, 39.15399811],
				[91.43279764, 39.11198405],
				[92.14703666, 39.36406841],
				[93.15537411, 39.36406841],
				[94.33176780, 39.28004029],
				[95.25607713, 39.15399811],
				[96.39045676, 39.32205435],
				[97.39879421, 39.15399811],
				[98.65921602, 39.11198405],
				[99.54151129, 39.06996999],
				[100.67589092, 38.73385750],
				[101.64221431, 38.52378720],
				[102.90263612, 38.27170284],
				[104.07902981, 37.93559036],
				[105.08736726, 37.76753411],
				[106.01167659, 37.55746381],
				[106.97799998, 37.09530915],
				[107.60821089, 36.92725291],
				[108.40647804, 36.63315448],
				[109.12071706, 36.33905606],
				[109.83495609, 36.00294358],
				[110.42315293, 35.58280297]
			]

		}, {
			"svid": 59,
			"prn": 4,
			"position": [
				[110.92732166, 35.12064831],
				[111.34746226, 36.21301388],
				[112.06170129, 37.05329509],
				[112.69191220, 37.55746381],
				[113.78427777, 38.10364660],
				[114.96067146, 38.73385750],
				[115.71692454, 39.32205435],
				[116.85130417, 39.78420901],
				[117.56554320, 40.24636368],
				[118.57388065, 40.87657458],
				[119.75027434, 41.42275737],
				[120.84263991, 41.84289797],
				[121.72493518, 42.34706670],
				[122.52320233, 42.76720730],
				[123.90966632, 43.35540415],
				[125.29613031, 43.60748851],
				[126.55655212, 43.77554475],
				[127.48086145, 43.94360099],
				[128.65725514, 43.98561505],
				[130.08573320, 43.85957287],
				[131.38816907, 43.27137603],
				[132.06039404, 43.06130572],
				[132.81664712, 42.55713700],
				[133.86699863, 41.88491203],
				[134.41318142, 41.12865895],
				[134.83332202, 40.37240586],
				[135.54756105, 39.44809653],
				[135.84165947, 38.73385750],
				[136.09374383, 37.72552005],
				[136.38784226, 36.88523885],
				[136.68194068, 35.70884515],
				[136.84999692, 35.28870455],
				[136.80798286, 34.11231086],
				[136.89201098, 33.10397341],
				[136.89201098, 32.01160784],
				[136.72395474, 31.33938287],
				[136.38784226, 30.16298918],
				[135.88367353, 28.86055331],
				[135.88367353, 28.60846895],
				[135.50554699, 27.85221586],
				[135.04339232, 27.01193465],
				[134.41318142, 26.08762532],
				[133.36282991, 25.28935818],
				[132.39650652, 24.78518945],
				[131.43018313, 23.98692230],
				[130.75795816, 23.73483794],
				[129.87566290, 23.44073952],
				[128.11107236, 22.89455673],
				[125.50620062, 22.13830365],
				[123.95168038, 22.05427553],
				[122.69125857, 21.97024741],
				[121.01069615, 21.88621929],
				[119.49818998, 22.22233177],
				[118.57388065, 22.47441613],
				[117.14540260, 22.72650049],
				[115.96900891, 23.31469734],
				[114.62455897, 23.81886606],
				[113.95233401, 24.32303479],
				[113.23809498, 25.20533006],
				[112.64989813, 25.70949878],
				[112.01968723, 26.63380811],
				[111.89364505, 27.60013150],
				[111.51551850, 28.69249707],
				[111.17940602, 29.57479234],
				[111.17940602, 30.45708761],
				[111.09537790, 31.29736881],
				[110.88530760, 32.34772032],
				[110.92732166, 33.14598747],
				[110.71725136, 34.07029680],
				[110.96933572, 34.86856395],
				[111.13739196, 35.49877485]
			]
		}, {
			"svid": 59,
			"prn": 5,
			"position": [
				[106.43181720, 19.70148814],
				[107.60821089, 20.87788184],
				[108.65856240, 21.84420522],
				[109.66689985, 22.68448643],
				[110.59120918, 23.44073952],
				[111.80961693, 24.02893637],
				[113.40615122, 24.53310509],
				[115.12872770, 24.86921757],
				[116.97734636, 24.40706291],
				[118.61589471, 23.69282388],
				[120.00235870, 23.18865516],
				[121.26278052, 22.22233177],
				[122.06104766, 20.83586778],
				[122.69125857, 19.36537566],
				[123.36348354, 17.81085543],
				[123.69959602, 16.29834925],
				[124.24577880, 14.70181496],
				[124.58189129, 13.27333690],
				[124.83397565, 11.38270419],
				[125.08606001, 10.08026831],
				[125.08606001, 8.90387462],
				[125.17008813, 7.26532627],
				[124.79196159, 5.83684822],
				[124.24577880, 4.15628580],
				[123.48952572, 2.60176556],
				[122.81730075, 1.38335781],
				[121.43083676, 0.50106255],
				[120.33847119, -0.46526084],
				[118.99402125, -1.22151393],
				[117.56554320, -1.55762641],
				[116.34713545, -1.85172484],
				[114.96067146, -1.97776702],
				[114.03636213, -1.89373890],
				[112.94399656, -1.76769672],
				[111.85163099, -1.51561235],
				[110.50718105, -1.26352799],
				[109.03668894, -1.09547175],
				[107.77626713, -0.25519054],
				[106.26376096, 0.54307661],
				[105.63355005, 1.21530157],
				[105.00333914, 2.22363902],
				[104.37312824, 3.10593429],
				[104.16305794, 4.03024362],
				[104.12104388, 5.08059513],
				[103.86895951, 6.50907318],
				[103.78493139, 8.06359342],
				[103.99500169, 9.28200117],
				[103.86895951, 10.24832456],
				[104.03701575, 11.63478855],
				[104.33111418, 12.47506976],
				[104.33111418, 13.52542127],
				[104.49917042, 15.03792744],
				[104.96132508, 16.38237737],
				[105.25542351, 17.51675700],
				[105.92764847, 18.81919288]
			]
		}, {
			"svid": 59,
			"prn": 6,
			"position": [
				[120.88465397, 20.83586778],
				[121.59889300, 22.01226147],
				[122.60723045, 22.64247237],
				[123.86765226, 23.23066922],
				[125.00203189, 23.65080982],
				[126.72460837, 23.98692230],
				[128.15308642, 24.19699261],
				[129.70760665, 24.32303479],
				[131.55622531, 24.02893637],
				[132.94268930, 23.56678170],
				[133.69894239, 22.97858486],
				[135.21144857, 22.30635989],
				[136.47187038, 21.25600838],
				[137.43819377, 20.20565687],
				[138.69861558, 19.23933348],
				[139.70695303, 18.44106633],
				[140.75730454, 17.34870076],
				[141.42952950, 16.21432113],
				[142.14376853, 14.95389932],
				[143.02606380, 13.77750563],
				[143.69828877, 12.34902758],
				[144.11842937, 11.08860576],
				[144.16044343, 10.03825425],
				[144.41252779, 8.94588868],
				[144.03440125, 7.93755123],
				[143.86634501, 6.71914348],
				[143.48821846, 5.50073573],
				[142.68995132, 4.57642640],
				[141.93369823, 3.82017332],
				[140.71529048, 3.44204677],
				[139.66493897, 3.14794835],
				[138.53055934, 2.81183587],
				[137.22812346, 2.64377963],
				[136.13575789, 2.55975150],
				[135.16943451, 2.47572338],
				[133.95102675, 2.64377963],
				[132.48053464, 2.89586399],
				[131.22011283, 3.14794835],
				[130.12774726, 3.40003271],
				[129.03538169, 3.56808895],
				[128.23711454, 4.11427174],
				[127.10273491, 4.70246858],
				[126.22043964, 5.24865137],
				[125.38015843, 5.83684822],
				[124.41383504, 6.63511536],
				[123.74161008, 7.85352311],
				[122.94334293, 9.11394493],
				[122.64924451, 10.08026831],
				[122.31313203, 11.13061982],
				[122.06104766, 11.88687291],
				[121.85097736, 12.72715412],
				[121.55687894, 13.60944939],
				[121.26278052, 14.74382902],
				[121.09472427, 16.25633519],
				[120.63256961, 17.60078513],
				[120.80062585, 18.73516476],
				[120.59055555, 19.82753033]
			]
		}, {
			"svid": 60,
			"prn": 8,
			"position": [
				[87.21236762, 53.81300112],
				[87.27253623, 51.34608814],
				[87.03186180, 48.09698324],
				[86.61068153, 46.17158775],
				[85.58781517, 44.24619225],
				[84.74545464, 42.56147119],
				[83.84292551, 40.57590709],
				[82.88022776, 38.16916272],
				[81.37601253, 35.82258696],
				[79.93196591, 33.83702285],
				[78.36758207, 31.91162736],
				[76.14134352, 30.22690630],
				[72.53122697, 28.96336550],
				[69.22195346, 29.08370272],
				[66.99571492, 30.28707491],
				[64.88981360, 32.03196458],
				[63.68644141, 35.10056365],
				[63.68644141, 38.59034298],
				[63.68644141, 42.01995371],
				[63.98728446, 45.14872139],
				[64.46863333, 48.21732046],
				[64.88981360, 50.62406483],
				[65.49149969, 52.97064059],
				[66.51436605, 54.65536165],
				[67.71773823, 56.64092575],
				[69.52279651, 58.14514099],
				[71.74903505, 59.40868178],
				[74.69729690, 60.31121092],
				[77.40488432, 60.67222257],
				[79.87179730, 60.67222257],
				[81.91753001, 60.49171675],
				[83.78275690, 59.89003065],
				[85.52764656, 58.62648986],
				[86.73101875, 57.24261185],
				[87.39287345, 55.25704774]
			]
		}, {
			"svid": 60,
			"prn": 9,
			"position": [
				[88.63649964, 49.92447612],
				[89.76211724, 47.67324092],
				[91.84018050, 46.20127944],
				[93.57189989, 44.81590393],
				[96.25606493, 43.77687230],
				[98.85364401, 43.77687230],
				[101.88415294, 44.12321618],
				[104.74148992, 44.98907587],
				[106.90613915, 46.28786541],
				[109.33054629, 48.19275673],
				[111.66836746, 49.14520239],
				[114.00618863, 50.01106209],
				[115.91107996, 51.56960953],
				[118.07572919, 53.30132892],
				[120.50013633, 55.11963427],
				[122.23185571, 56.76476769],
				[125.26236464, 56.93793963],
				[127.34042790, 58.49648707],
				[129.50507713, 60.31479243],
				[131.49655442, 62.13309778],
				[133.05510187, 63.86481717],
				[133.74778963, 65.68312252],
				[133.31485978, 67.41484191],
				[131.06362458, 68.02094369],
				[128.37945953, 68.62704548],
				[125.43553658, 68.62704548],
				[124.05016107, 68.45387354],
				[122.14526974, 68.19411563],
				[119.20134679, 67.93435772],
				[116.69035368, 67.76118579],
				[113.65984476, 67.41484191],
				[111.49519553, 66.98191206],
				[109.33054629, 66.54898222],
				[106.64638125, 66.20263834],
				[103.87563023, 65.50995058],
				[101.88415294, 64.99043477],
				[100.15243355, 64.55750492],
				[98.33412820, 63.95140314],
				[96.86216672, 63.43188732],
				[95.30361927, 62.73919957],
				[93.74507183, 62.04651181],
				[91.84018050, 60.83430824],
				[90.71456290, 59.01600289],
				[89.58894530, 57.80379932],
				[89.24260142, 55.72573606],
				[88.46332770, 53.56108683],
				[88.37674173, 51.74278147]
			]
		}, {
			"svid": 60,
			"prn": 10,
			"position": [
				[87.27892184, 50.00429754],
				[88.75739634, 49.77328590],
				[90.00485920, 49.35746495],
				[91.71434534, 48.89544167],
				[92.86940355, 48.24860907],
				[93.74724778, 47.55557415],
				[94.80990133, 47.04734854],
				[95.73394789, 46.26190896],
				[96.61179213, 45.43026705],
				[97.48963636, 44.59862515],
				[98.27507594, 43.85938790],
				[99.19912251, 42.75053202],
				[99.70734812, 41.73408080],
				[100.21557373, 40.34801096],
				[100.72379933, 39.37776206],
				[100.86240632, 38.31510852],
				[100.77000166, 37.48346661],
				[100.58519235, 36.37461073],
				[100.53899002, 35.17335020],
				[100.21557373, 34.24930364],
				[99.98456208, 33.18665009],
				[99.43013415, 32.44741284],
				[99.33772949, 31.56956861],
				[98.87570621, 30.92273601],
				[98.36748060, 29.99868945],
				[98.04406430, 29.16704754],
				[97.39723171, 28.24300098],
				[96.79660144, 27.18034743],
				[96.19597118, 26.11769388],
				[95.68774557, 25.37845663],
				[94.85610366, 24.82402869],
				[93.93205710, 24.03858912],
				[93.14661752, 23.39175652],
				[92.26877328, 22.56011461],
				[91.06751275, 21.95948435],
				[89.49663359, 21.49746107],
				[88.48018237, 21.58986572],
				[87.55613581, 21.58986572],
				[86.03145898, 21.49746107],
				[85.06121009, 21.68227038],
				[83.95235421, 22.09809133],
				[82.88970067, 22.37530530],
				[81.91945177, 23.25314954],
				[81.27261918, 24.03858912],
				[80.53338193, 25.19364732],
				[79.84034701, 26.21009854],
				[79.60933537, 26.81072881],
				[79.28591907, 27.64237071],
				[78.96250277, 28.33540563],
				[78.68528880, 29.49046384],
				[77.99225388, 30.09109410],
				[77.48402827, 31.93918723],
				[77.16061197, 33.14044776],
				[77.11440965, 33.78728036],
				[77.29921896, 34.94233856],
				[76.79099335, 35.95878978],
				[76.83719568, 36.74422936],
				[76.69858869, 37.57587127],
				[76.69858869, 38.54612016],
				[76.79099335, 39.42396439],
				[77.02200499, 40.30180863],
				[77.16061197, 41.13345053],
				[77.43782594, 42.10369943],
				[77.53023060, 43.07394832],
				[77.80744457, 44.22900652],
				[78.36187251, 45.24545774],
				[79.05490743, 45.93849266],
				[79.88654933, 46.58532526],
				[81.08780987, 47.50937182],
				[81.78084479, 48.15620441],
				[82.84349834, 48.57202537],
				[83.90615188, 49.12645331],
				[85.06121009, 49.54227426],
				[85.80044734, 49.77328590],
				[86.53968459, 49.86569056]
			]
		}, {
			"svid": 60,
			"prn": 11,
			"position": [
				[104.00416463, 46.77013457],
				[103.63454601, 45.75368335],
				[102.80290410, 44.82963679],
				[102.15607151, 43.90559022],
				[101.55544124, 42.75053202],
				[100.95481098, 41.59547382],
				[100.35418071, 40.48661794],
				[99.98456208, 39.14675042],
				[100.12316907, 37.89928756],
				[100.16937140, 37.16005031],
				[100.07696674, 36.32840841],
				[100.49278769, 35.08094555],
				[101.23202494, 33.87968501],
				[102.10986918, 32.72462681],
				[103.21872506, 32.17019887],
				[104.55859257, 31.38475929],
				[106.03706707, 31.24615231],
				[107.23832761, 30.92273601],
				[108.71680211, 30.41451040],
				[110.70350222, 30.32210575],
				[112.22817905, 30.04489178],
				[113.70665355, 29.62907082],
				[116.24778160, 29.90628479],
				[117.72625610, 30.04489178],
				[119.06612361, 30.32210575],
				[120.17497949, 30.50691506],
				[121.69965632, 30.78412903],
				[123.36294013, 31.06134300],
				[124.70280765, 31.75437792],
				[125.76546120, 32.30880586],
				[126.92051940, 32.77082914],
				[128.72241020, 33.78728036],
				[129.92367073, 34.24930364],
				[130.61670565, 34.38791062],
				[131.81796619, 35.03474322],
				[133.06542905, 35.72777814],
				[134.49770122, 36.14359909],
				[135.46795011, 37.06764566],
				[136.53060366, 37.89928756],
				[137.54705488, 38.54612016],
				[138.05528049, 38.63852481],
				[138.84072007, 39.19295275],
				[139.85717129, 39.51636905],
				[140.78121785, 40.20940397],
				[141.89007373, 40.57902260],
				[143.04513193, 40.99484355],
				[144.24639246, 41.36446218],
				[145.63246231, 41.87268779],
				[147.34194845, 42.70432969],
				[148.95902993, 43.67457858],
				[150.02168348, 44.46001816],
				[151.08433703, 45.10685076],
				[152.37800222, 46.21570663],
				[153.20964412, 47.04734854],
				[154.13369069, 47.74038346],
				[155.19634424, 48.61822770],
				[156.39760477, 49.54227426],
				[157.50646064, 50.55872548],
				[158.33810255, 51.25176040],
				[159.40075610, 52.22200929],
				[160.37100499, 53.28466284],
				[160.41720732, 55.08655364],
				[160.32480266, 56.28781417],
				[160.00138636, 57.35046772],
				[159.58556541, 58.69033524],
				[159.12354213, 59.70678645],
				[158.24569789, 60.90804699],
				[157.36785366, 62.29411683],
				[155.88937916, 63.12575874],
				[153.90267905, 63.81879366],
				[152.28559756, 64.41942393],
				[150.48370676, 64.74284022],
				[148.58941131, 65.06625652],
				[146.74131818, 65.11245885],
				[145.30904601, 65.15866118],
				[142.90652494, 65.29726816],
				[141.24324113, 65.25106583],
				[139.85717129, 64.97385187],
				[138.65591075, 64.88144721],
				[136.99262694, 64.60423324],
				[135.56035477, 64.32701927],
				[133.89707095, 64.28081694],
				[132.41859645, 64.04980530],
				[131.21733592, 63.40297271],
				[130.06227772, 63.07955641],
				[128.58380322, 62.66373546],
				[127.29013803, 62.15550985],
				[126.18128215, 61.64728424],
				[124.98002162, 61.18526096],
				[123.82496341, 60.67703535],
				[122.62370288, 60.30741672],
				[121.74585865, 59.79919111],
				[120.77560976, 59.47577481],
				[119.85156319, 58.78273989],
				[118.74270732, 58.50552592],
				[117.40283980, 57.67388402],
				[116.29398392, 57.02705142],
				[115.13892572, 56.42642116],
				[114.58449778, 55.77958856],
				[113.84526053, 55.40996994],
				[112.92121397, 54.99414898],
				[112.04336973, 54.25491173],
				[110.93451386, 53.46947215],
				[109.96426497, 52.96124654],
				[108.99401608, 52.12960464],
				[108.06996951, 51.39036739],
				[107.33073226, 50.69733246],
				[106.54529268, 49.95809521],
				[105.94466242, 49.21885796],
				[105.15922284, 48.57202537],
				[104.78960421, 47.78658579]
			]
		}, {
			"svid": 60,
			"prn": 12,
			"position": [
				[101.77317106, 39.40261921],
				[102.76595311, 39.25219768],
				[103.63839795, 38.89118603],
				[104.48075848, 38.71068020],
				[105.47354053, 38.28949994],
				[106.49640688, 37.89840398],
				[107.66969476, 37.32680219],
				[108.81289834, 36.87553762],
				[109.71542748, 36.12343000],
				[110.58787231, 35.40140669],
				[111.46031715, 34.58913047],
				[112.24250907, 33.71668563],
				[112.81411085, 32.57348206],
				[113.62638708, 31.61078431],
				[114.13782026, 30.31715921],
				[114.40857900, 29.26420855],
				[114.52891622, 27.91041484],
				[114.46874761, 26.64687405],
				[114.31832609, 25.74434491],
				[114.19798887, 24.51088842],
				[113.74672430, 23.45793776],
				[113.44588125, 22.49524001],
				[112.75394225, 21.50245796],
				[111.97175033, 20.59992882],
				[111.24972701, 19.93807412],
				[110.31711357, 19.15588220],
				[109.68534317, 18.76478624],
				[108.81289834, 18.40377458],
				[107.82011629, 18.07284723],
				[106.55657549, 17.80208849],
				[105.41337192, 17.77200419],
				[104.20999973, 17.68175127],
				[103.09688046, 17.65166697],
				[101.83333967, 17.65166697],
				[100.47954596, 17.74191988],
				[99.51684821, 18.07284723],
				[98.49398186, 18.43385889],
				[97.71178994, 18.82495485],
				[96.74909219, 19.18596650],
				[95.90673166, 19.57706246],
				[94.70335947, 20.14866425],
				[93.98133616, 20.50967591],
				[93.16905994, 20.99102478],
				[92.38686802, 21.56262657],
				[91.63476040, 22.13422836],
				[91.12332722, 22.67574584],
				[90.31105100, 23.57827498],
				[89.73944921, 24.30029829],
				[89.19793173, 25.05240590],
				[88.74666716, 25.71426061],
				[88.29540259, 26.52653683],
				[87.81405372, 27.12822292],
				[87.48312636, 28.03075206],
				[87.12211471, 29.11378703],
				[87.12211471, 30.01631617],
				[86.82127166, 30.94892961],
				[86.82127166, 31.91162736],
				[86.88144027, 32.69381928],
				[87.09203040, 33.71668563],
				[87.24245193, 34.76963630],
				[88.11489676, 35.88275557],
				[88.77675146, 36.45435735],
				[89.31826895, 36.99587484],
				[90.13054517, 37.62764523],
				[90.94282140, 38.04882550],
				[91.90551914, 38.50009007],
				[92.65762676, 38.95135464],
				[93.71057742, 39.10177616],
				[94.67327517, 39.40261921],
				[95.54572000, 39.61320934],
				[96.38808053, 39.58312504],
				[97.59145272, 39.82379947],
				[98.67448768, 39.82379947],
				[99.78760695, 39.67337795],
				[100.50963027, 39.70346225],
				[101.14140066, 39.52295643]
			]
		}, {
			"svid": 60,
			"prn": 13,
			"position": [
				[114.52891622, 34.31837173],
				[113.74672430, 34.22811881],
				[112.96453238, 33.98744438],
				[112.00183463, 33.41584259],
				[111.24972701, 32.78407219],
				[110.37728218, 32.06204888],
				[109.65525887, 31.15951974],
				[108.54213960, 30.16673769],
				[107.88028490, 29.29429286],
				[107.09809298, 28.18117358],
				[106.55657549, 27.18839153],
				[106.13539523, 26.13544087],
				[105.65404636, 25.05240590],
				[105.68413066, 23.63844359],
				[106.22564814, 22.34481849],
				[107.27859880, 21.38212074],
				[108.48197099, 20.08849564],
				[109.35441582, 19.06562928],
				[110.67812523, 18.37369028],
				[111.70099158, 17.80208849],
				[112.72385794, 17.20040240],
				[114.01748304, 16.59871631],
				[115.22085522, 15.90677730],
				[116.63481754, 15.51568134],
				[117.98861125, 14.85382664],
				[119.67333231, 14.73348942],
				[121.50847489, 14.58306790],
				[122.89235290, 14.85382664],
				[124.57707396, 14.94407955],
				[126.08128919, 15.30509121],
				[127.91643177, 16.05719882],
				[129.57106853, 16.77922213],
				[131.28587389, 17.62158266],
				[133.57228104, 18.70461763],
				[135.22691780, 19.30630372],
				[136.55062720, 19.93807412],
				[137.96458952, 20.38933869],
				[139.22813031, 21.17153061],
				[140.40141819, 21.62279518],
				[141.63487468, 21.98380683],
				[142.83824686, 22.55540862],
				[144.13187196, 23.03675749],
				[145.63608719, 23.81894941],
				[146.83945938, 24.42063551],
				[148.10300017, 25.05240590],
				[149.24620375, 25.68417630],
				[149.96822706, 26.25577809],
				[150.93092481, 26.85746418],
				[152.16438130, 27.39898166],
				[153.78893375, 28.39176372],
				[155.02239024, 28.93328120],
				[156.07534090, 29.50488299],
				[157.27871308, 30.46758074],
				[158.63250679, 31.58070001],
				[159.35453010, 32.60356636],
				[159.35453010, 34.85988921],
				[159.17402427, 36.00309279],
				[158.06090500, 36.84545331],
				[157.60964043, 38.04882550],
				[156.52660547, 38.62042729],
				[155.59399202, 38.80093312],
				[154.08977679, 38.71068020],
				[151.89362256, 38.86110172],
				[150.20890150, 38.59034298],
				[147.89241004, 38.01874119],
				[146.08735176, 37.71789815],
				[144.40263071, 37.26663358],
				[143.10900561, 36.84545331],
				[141.27386302, 36.66494749],
				[140.22091236, 36.48444166],
				[139.04762448, 36.45435735],
				[137.72391508, 36.33402014],
				[136.09936263, 36.09334570],
				[134.68540031, 35.91283987],
				[133.36169091, 35.85267126],
				[132.33882455, 35.82258696],
				[131.55663263, 35.79250265],
				[130.83460932, 35.64208113],
				[129.78165866, 35.64208113],
				[128.63845508, 35.52174391],
				[127.40499860, 35.46157530],
				[126.14145780, 35.37132239],
				[124.96816992, 35.52174391],
				[123.70462913, 35.49165961],
				[122.20041390, 35.31115378],
				[120.87670449, 35.34123808],
				[119.52291078, 35.34123808],
				[118.34962290, 35.10056365],
				[117.32675655, 34.88997351],
				[116.27380589, 34.73955199],
				[115.19077092, 34.55904616]
			]
		}, {
			"svid": 61,
			"prn": 15,
			"position": [
				[73.0967808486386, 43.4468831382843],
				[71.8603596440327, 42.5370736449071],
				[71.1351351448313, 41.6006283582304],
				[70.9837356744135, 40.9090577013287],
				[70.8585036787537, 40.2828977230293],
				[70.8585036787537, 39.5315057490701],
				[70.8585036787537, 38.7801137751108],
				[70.9837356744135, 38.1539537968114],
				[71.2505260685847, 37.3888596412324],
				[71.4846636570530, 36.9016338402127],
				[71.9855916396926, 35.8997778749337],
				[72.4865196223321, 35.1483859009744],
				[72.9236944630086, 34.3886956236448],
				[73.6136075832709, 33.3951379617362],
				[74.1145355659104, 32.7689779834368],
				[75.1738174761993, 31.6770089154406],
				[76.2123357899796, 30.5807951397835],
				[76.8696394704277, 29.8886420832596],
				[77.7462634400468, 28.8867861179806],
				[78.6932406506771, 27.7537175078260],
				[79.3855861931973, 27.0036765034291],
				[80.5013673445641, 25.8812182221436],
				[81.6284553055030, 24.7541302612047],
				[82.9050093676751, 23.4265578670746],
				[83.8281367577020, 22.5034304770476],
				[84.6935686858523, 21.7533894726507],
				[85.7611111622789, 20.7467064000887],
				[87.2638951101974, 19.7448504348097],
				[88.2706873222068, 19.2147891500766],
				[89.1423750450955, 18.7429944695307],
				[91.2713189713134, 17.8663704999116],
				[92.6555424248349, 17.5416207556527],
				[93.9011908801708, 17.4906745129319],
				[95.4039748280893, 17.8663704999116],
				[97.0403975274629, 19.1570936881999],
				[98.4095427239263, 20.8719383957486],
				[99.3482160025303, 22.2726486295409],
				[100.162790663165, 24.0027382872455],
				[100.905993473201, 25.6189854183886],
				[101.656034477598, 27.9844993553327],
				[102.059902710735, 30.0038405210167],
				[102.416966585042, 31.7671220181578],
				[102.694552791378, 33.8117410048779],
				[102.867639177008, 35.1387366280417],
				[103.043126563342, 36.9016338402127],
				[102.983030100761, 38.8889416500262],
				[102.542198580702, 40.5333617143491],
				[101.916038602403, 41.9109136666077],
				[101.367557168214, 42.8122330576408],
				[100.213647930681, 44.6007923758180],
				[98.5347747195862, 46.2940335147034],
				[96.2326610611893, 47.4278700077756],
				[93.7759588845110, 48.1725134496015],
				[90.6451589930140, 48.4229774409213],
				[88.0152870841567, 48.2977454452614],
				[85.6166960758793, 48.0048246265424],
				[83.3817032447412, 47.6715854669620],
				[81.0010591257445, 47.0816972365155],
				[78.8086315744305, 46.3316562321186],
				[77.1201034617474, 45.5426415407441],
				[75.5776857093361, 44.8315742233248],
				[74.3660810099257, 44.1969241426812]
			]
		}, {
			"svid": 61,
			"prn": 16,
			"position": [
				[118.342546778974, 57.3703000715944],
				[115.990465302577, 57.0342884321091],
				[113.974395465664, 56.6422748527095],
				[112.185062246513, 56.1873611718336],
				[110.614279070811, 55.5782379943392],
				[109.214230572955, 54.9062147153685],
				[107.551478407097, 53.9331852499558],
				[106.674854437478, 53.3070252716564],
				[105.966118057930, 52.6101351788853],
				[105.294094778960, 51.8261080200861],
				[104.796374502580, 50.9276173541188],
				[104.006050160932, 49.5300284836029],
				[103.418822550321, 48.2977454452614],
				[103.054017182391, 46.8979373076343],
				[102.792662572022, 45.7931055320639],
				[102.542198580702, 44.5407855754651],
				[102.542198580702, 43.1632336232065],
				[102.718005542905, 41.1297374964691],
				[103.166021062219, 39.6176851187850],
				[103.544054545981, 38.6548817794509],
				[104.295446519941, 37.4025618228522],
				[105.294094778960, 35.7535512647035],
				[105.798230467859, 35.0231539053146],
				[106.974152976386, 33.7934833677056],
				[107.927174394077, 32.8942099790967],
				[109.680422333315, 32.0175860094775],
				[112.059830250853, 31.5166580268380],
				[113.938310185751, 31.5166580268380],
				[115.315862138010, 31.5166580268380],
				[118.196198038187, 32.0175860094775],
				[120.199909968745, 32.5185139921170],
				[122.878703912026, 33.3454678483918],
				[125.678800907738, 34.2975008269336],
				[128.214757690977, 35.1483859009744],
				[130.718975500018, 36.2015667840173],
				[132.679043397016, 37.2656036423876],
				[134.476357473971, 38.4044177881312],
				[136.354837408869, 39.9072017360497],
				[138.609013330746, 41.7856816709479],
				[139.959295585865, 43.1458073333812],
				[140.863189252624, 44.2903215841454],
				[141.865045217903, 45.5426415407441],
				[142.927398401319, 46.9539392475485],
				[143.655423620204, 48.2979858054899],
				[143.993989144121, 49.2996014105404],
				[143.993989144121, 50.8023853584589],
				[143.868757148461, 51.8042413237379],
				[143.543419740375, 52.5541332389711],
				[142.759392581576, 53.3941623376844],
				[141.364117235264, 54.3088812369354],
				[140.239305285436, 54.9622166552827],
				[138.609013330746, 55.5612011935342],
				[137.607157365467, 55.8116651848539],
				[136.375171431355, 56.1382573934815],
				[134.726821465290, 56.4378251631533],
				[133.349269513032, 56.6882891544731],
				[131.721253569453, 56.9387531457928],
				[130.594165608514, 57.1892171371126],
				[129.206923122334, 57.3703000715944],
				[127.588597712677, 57.5649131240922],
				[125.710117777779, 57.8153771154120],
				[122.704549881942, 57.8153771154120],
				[121.030639894857, 57.6503097711656],
				[119.573749990445, 57.5649131240922]
			]
		}, {
			"svid": 61,
			"prn": 17,
			"position": [
				[101.289878624103, 33.5203699573960],
				[100.288022658824, 32.5185139921170],
				[99.4810886512323, 31.3799638299684],
				[98.9343087590270, 30.3284640372658],
				[98.4716488502379, 29.2349042528552],
				[98.0338467369467, 28.1353941440214],
				[97.9086147412868, 27.6344661613819],
				[97.6581507499671, 26.5073782004430],
				[97.5463290326596, 25.1971450488772],
				[97.4201490575353, 23.9353452976341],
				[97.3780890658272, 22.3791256044343],
				[97.3780890658272, 21.0752658614831],
				[97.4201490575353, 19.6031661516995],
				[97.5463290326596, 18.2572464170402],
				[97.7145689994920, 16.7851467072565],
				[98.0338467369467, 15.3617305867141],
				[98.4095427239263, 14.1094106301153],
				[99.1609346978856, 12.3561626908770],
				[99.9016885683134, 11.0229278432464],
				[100.914182637124, 10.1019867689993],
				[101.794388195178, 9.84524807541947],
				[102.917894567682, 9.72629078201964],
				[103.794518537301, 9.85152277767951],
				[105.327427498659, 10.3920279676248],
				[106.967767175275, 11.2752877934950],
				[108.553334372376, 12.3561626908770],
				[109.701666636301, 13.2941673954840],
				[110.963466387545, 14.6400871301433],
				[112.183206147080, 16.1963068233431],
				[113.061686216132, 17.4906745129319],
				[113.687846194431, 18.3672984825511],
				[114.496505691025, 19.6452261434076],
				[115.295645533479, 21.0752658614831],
				[115.942022116309, 22.6251863349868],
				[116.220965351058, 23.7671053308017],
				[116.442950098948, 25.2550582438442],
				[116.431265309598, 26.8795447172014],
				[116.178905359349, 28.1834044601526],
				[115.691558124989, 29.5129460962800],
				[115.065398146690, 30.6400340572189],
				[114.439238168390, 31.6418900224979],
				[113.739425840279, 32.5576435977953],
				[112.811222224812, 33.5203699573960],
				[111.558902268213, 34.3969939270152],
				[110.458746487047, 35.0391831085734],
				[109.179494350676, 35.3988498922942],
				[107.301014415778, 35.6493138836139],
				[106.299158450499, 35.6493138836139],
				[104.990947564994, 35.3756630422383],
				[103.855327788875, 34.9550631251572],
				[102.509408054216, 34.3241632495357]
			]
		}, {
			"svid": 61,
			"prn": 18,
			"position": [
				[146.623861052979, 33.7708339487158],
				[146.122933070339, 35.1483859009744],
				[144.995845109400, 36.1502418662534],
				[143.223480027660, 37.0580627105624],
				[141.364117235264, 37.7782578098318],
				[139.610869296025, 38.2791857924713],
				[137.671561122190, 38.6142824037622],
				[135.652681520201, 38.9087023457190],
				[133.599733504351, 39.0305777664306],
				[132.096949556433, 39.0305777664306],
				[130.468933612855, 39.0305777664306],
				[128.881022855196, 38.8666423540109],
				[127.240683178580, 38.6142824037622],
				[125.710117777779, 38.2791857924713],
				[124.082101834201, 37.9034898054917],
				[122.319664148732, 37.3524826525191],
				[120.450373960064, 36.6511698488929],
				[119.323285999126, 36.0250098705936],
				[118.697126020826, 35.5240818879541],
				[116.943878081588, 34.1465299356954],
				[116.010665392517, 33.1885434734169],
				[115.211525550063, 32.3052836475467],
				[114.564470164050, 31.2661940355183],
				[114.188774177071, 30.1391060745794],
				[113.813078190091, 28.6363221266609],
				[113.562614198771, 27.0083061830825],
				[113.687846194431, 25.6307542308239],
				[114.286205732484, 24.1456452561747],
				[115.190630142350, 22.7504183306467],
				[115.716245450560, 22.0426456707695],
				[116.442950098948, 21.3728663783881],
				[117.444806064227, 20.4962424087690],
				[118.571894025166, 19.8700824304696],
				[120.450373960064, 19.4943864434900],
				[121.577461921003, 19.4943864434900],
				[123.080245868922, 19.4943864434900],
				[124.207333829861, 19.6196184391498],
				[127.212901725698, 20.2457784174492],
				[129.341845651916, 20.7467064000887],
				[131.572862324515, 21.4958657785641],
				[134.054401835293, 22.5053055795586],
				[136.241521404114, 23.4726853888450],
				[137.982853352447, 24.3784342742251],
				[138.734245326406, 24.8793622568646],
				[140.863189252624, 26.2569142091232],
				[142.466400176914, 27.3842646176986],
				[143.993989144121, 28.5110901310010],
				[145.158239646232, 29.9078641201848],
				[145.997701074679, 31.1409620398584],
				[146.504159380892, 32.3473436392548]
			]
		}, {
			"svid": 61,
			"prn": 19,
			"position": [
				[113.312150207452, 20.8719383957486],
				[112.141146155371, 20.1499460439048],
				[111.131706354377, 19.3087462097427],
				[110.290506520215, 18.5096063672888],
				[109.555190337655, 17.4906745129319],
				[108.902526793847, 16.0280668565107],
				[108.397806893350, 14.7242071135595],
				[108.052406389737, 13.6084826474758],
				[107.676710402757, 12.1056986995573],
				[107.472487075772, 10.2658479925005],
				[107.388367092356, 9.04610823296550],
				[107.301014415778, 7.84781084712150],
				[107.301014415778, 5.96933091222336],
				[107.472487075772, 4.25126917824171],
				[107.640727042604, 3.19976938553913],
				[107.927174394077, 2.08713904676721],
				[108.229566926518, 1.09676980013396],
				[108.553334372376, 0.0834271162092008],
				[123.080245868922, 0.0834271162092008],
				[124.296483759013, 1.13882979184206],
				[125.179743584884, 2.23238957625275],
				[125.584885782119, 3.46469099902585],
				[125.810643460505, 4.58774911190654],
				[125.960581769099, 5.59363492524374],
				[125.978883427337, 6.52250873047930],
				[125.978883427337, 7.40576855634947],
				[125.835349773439, 8.34873882976100],
				[125.459653786460, 9.97675477333939],
				[125.053563609759, 11.1911678100788],
				[124.675023684386, 12.4109075696138],
				[124.207333829861, 13.9841786344554],
				[123.875883841932, 15.0186270555162],
				[123.581173851561, 15.8626585693536],
				[122.955013873262, 17.1149785259523],
				[122.454085890622, 17.8663704999116],
				[121.730824264819, 18.7199063258293],
				[120.575605955724, 19.8700824304696],
				[119.448517994785, 20.6214744044288],
				[117.570038059887, 21.1224023870683],
				[115.816790120649, 21.3728663783881],
				[114.496505691025, 21.2435058283155]
			]
		}, {
			"svid": 61,
			"prn": 20,
			"position": [
				[128.796902871780, 23.4306253971369],
				[127.463365717018, 22.7504183306467],
				[126.399483344418, 22.0847056624776],
				[125.334421790800, 21.3728663783881],
				[124.833493808160, 20.9971703914085],
				[124.002063817056, 20.1920060356129],
				[123.205477864582, 19.1186904565103],
				[122.824384049229, 18.2151864253321],
				[122.454085890622, 17.2402105216122],
				[122.151424181900, 16.1963068233431],
				[121.953157907983, 15.1112665953943],
				[122.203621899303, 13.7337146431357],
				[122.782324057521, 12.1585476193652],
				[123.413223933143, 10.7285079012897],
				[124.082101834201, 9.72629078201964],
				[124.833493808160, 8.72443481674063],
				[125.584885782119, 7.84781084712150],
				[126.525663319543, 6.77486868072793],
				[127.829523062494, 5.59718891290104],
				[128.840917669276, 4.84224295128448],
				[129.848402664483, 4.16714919482552],
				[130.844629599834, 3.58992299468572],
				[131.971717560773, 3.08899501204622],
				[133.724965500011, 2.58806702940672],
				[134.977285456610, 2.58806702940672],
				[136.855765391508, 2.83853102072647],
				[138.734245326406, 3.46469099902585],
				[140.531640558341, 4.25126917824173],
				[141.990277213563, 5.21793893826411],
				[143.117365174502, 6.47025889486287],
				[144.369685131101, 8.22350683410113],
				[145.371541096380, 10.1019867689993],
				[145.999439480394, 11.4014677686193],
				[146.498629057319, 12.6066266821968],
				[147.092999264805, 14.1774272213541],
				[147.375253026938, 15.6121945780338],
				[147.261239231638, 17.4581065745862],
				[146.749093048638, 18.9934584608504],
				[146.209739438935, 20.1920060356129],
				[145.121077105060, 21.3728663783881],
				[143.242597170162, 22.6251863349868],
				[140.612725261304, 24.0027382872455],
				[138.302460997812, 24.8186051235043],
				[136.229605413209, 25.1298262481844],
				[134.390881768958, 25.0709650737529],
				[133.002902042590, 24.7765451317962],
				[131.488742341099, 24.4400651981314],
				[130.184882598148, 24.0194652810503]
			]
		}
	]
}
