{
"simollie/uicc_config.xml":"20220803105000",
"rollie/sa_dynamic_switch.xml":"20220609224500",
"rollie/net_predict.xml":"20210612105000",
"rollie/metro_map.xml":"20240411000000",
"rollie/cellular_map_config.xml":"20220719112616",
"rollie/scene_map_cell_info_crowdsourcing.xml":"20220809151521",
"rollie/highSpeedParameters.xml":"20221215143900",
"collie/CallRecoveryConfig.json":"20230701215501",
"collie/vonr_dynamic_switch.xml":"20230105215500",
"dollie/dsda_band.json":"20230627103000"
}
