{
    "transList": [
        {
            "srcState": [
                {
                    "camName": "main",
                    "prev": "true"
                },
                {
                    "camName": "wide"
                }
            ],
            "destState": [
                {
                    "camName": "main",
                    "prev": "true"
                }
            ],
            "actions": [
                {
                    "name": "StopSource",
                    "cameras": [
                        {
                            "camName": "wide"
                        }
                    ]
                }
            ]
        },
        {
            "srcState": [
                {
                    "camName": "main",
                    "prev": "true"
                }
            ],
            "destState": [
                {
                    "camName": "main",
                    "prev": "true"
                },
                {
                    "camName": "tele"
                }
            ],
            "actions": [
                {
                    "name": "StartSource",
                    "condWaiter": "DelayTelePrev",
                    "cameras": [
                        {
                            "camName": "tele"
                        }
                    ]
                }
            ]
        },
        {
            "srcState": [
                {
                    "camName": "main",
                    "prev": "true"
                },
                {
                    "camName": "tele"
                }
            ],
            "destState": [
                {
                    "camName": "main"
                },
                {
                    "camName": "tele",
                    "prev": "true"
                }
            ],
            "actions": [
                {
                    "name": "SwitchPrev",
                    "cameras": [
                        {
                            "camName": "tele"
                        }
                    ]
                }
            ]
        },
        {
            "srcState": [
                {
                    "camName": "main"
                },
                {
                    "camName": "tele",
                    "prev": "true"
                }
            ],
            "destState": [
                {
                    "camName": "main",
                    "prev": "true"
                },
                {
                    "camName": "tele"
                }
            ],
            "actions": [
                {
                    "name": "SwitchPrev",
                    "cameras": [
                        {
                            "camName": "main"
                        }
                    ]
                }
            ]
        },
        {
            "srcState": [
                {
                    "camName": "main",
                    "prev": "true"
                },
                {
                    "camName": "tele"
                }
            ],
            "destState": [
                {
                    "camName": "main",
                    "prev": "true"
                }
            ],
            "actions": [
                {
                    "name": "StopSource",
                    "cameras": [
                        {
                            "camName": "tele"
                        }
                    ]
                }
            ]
        },
        {
            "srcState": [
                {
                    "camName": "main",
                    "prev": "true"
                }
            ],
            "destState": [
                {
                    "camName": "main",
                    "prev": "true"
                },
                {
                    "camName": "wide"
                }
            ],
            "actions": [
                {
                    "name": "StartSource",
                    "cameras": [
                        {
                            "camName": "wide"
                        }
                    ]
                }
            ]
        }
    ]
}
