{
	"IQOFFSET": [-1,-1],
	"OBW": [-1,-1],
	"UPC_cal_delta_128bit": [3,3],
	"UPC_cal_delta_256bit": [3,3],
	"UPC_cal_delta_512bit": [3,3],
	"thermalTag": "pa_s",
	"T_fact": 35,
	"UPC_temp_Lf1": [-11,-11,-11,-11,-10,-9,-8,-6,-6,-5,-4,-2,-2,0,2,4,6,8,10,12,15,18,20],
	"UPC_temp_Lf2": [-11,-11,-11,-11,-10,-9,-8,-6,-6,-5,-4,-2,-2,0,2,4,6,8,10,12,15,18,20],
	"UPC_boost_128bit": [0,0],
	"UPC_boost_256bit": [5,5],
	"UPC_boost_512bit": [5,5],
	"UPC_max": [102,102],
	"batteryTypeTag": "/sys/class/hw_power/battery/battery_model/bat_cathode_type",
	"batteryCapacityTag": "/sys/class/power_supply/battery/capacity",
	"batteryThreshold": 5,
	"batteryStep": 5,
	"batteryTempTag" : "/sys/class/power_supply/battery/temp",
	"batteryTempThreshold": [-10,0],
	"batteryTempStep": 5,
	"UPC_backoff_graphite": [-20,-20,-10],
	"UPC_backoff_silicon": [-20,-20,-10],
	"TxPreOn": 1,
	"TxAftOn": 1,
	"PowerUnloadPercentage": 25
}
