[
    {
        "ZOOM_RATIO": ["MIN", "TELE_FOV"],
        "Output": ["@main", "wide"]
    },
    {
        "ZOOM_RATIO": ["TELE_FOV", "MAX"],
        "LUMINANCE": ["MIN", -35],
        "Output": ["@main", "wide"]
    },
    {
        "ZOOM_RATIO": ["TELE_FOV", "MAX"],
        "LUMINANCE": [5, "MAX"],
        "Output": ["main", "@tele"]
    }
]