[
    {
        "id": 0, // default
        "modelType": 0,
        "models": [
            {
                "modelId": 0,
                "npuFreq": 406,
                "modelInterVal": 2
            }
        ]
    },
    {
        "id": 1, // back4k30video
        "isoInfo": {
            "enableIso": 1,
            "isoLow": 0,
            "isoHigh": 4600
        },
        "modelType": 0,
        "models": [
            {
                "modelId": 0,
                "npuFreq": 850,
                "modelInterVal": 2
            }
        ]
    },
    {
        "id": 2, // normal cap preview
        "modelType": 0,
        "models": [
            {
                "modelId": 0,
                "npuFreq": 604,
                "modelInterVal": 2,
                "strategy": 1
            }
        ]
    },
    {
        "id": 3, // normal video except back4k30
        "modelType": 0,
        "models": [
            {
                "modelId": 0,
                "npuFreq": 850,
                "modelInterVal": 2
            }
        ]
    }
]
