[
    {
        "id": 0,
        "modelType": 0,
        "models": [
            {
                "modelId": 0,
                "npuFreq": 406,
                "multiFrameCnt": 2
            },
            {
                "modelId": 1,
                "npuFreq": 406,
                "multiFrameCnt": 2
            }
        ]
    },
    {
        "id": 1,
        "isoInfo": {
            "enableIso": 1,
            "isoLow": 0,
            "isoHigh": 4600
        },
        "modelType": 0,
        "models": [
            {
                "modelId": 0,
                "npuFreq": 850,
                "multiFrameCnt": 2
            }
        ]
    }
]