{
	"oz_demo_para_input": {
		"algo_close_flag": 0,
		"depth_map_info": {
			"confidence": 0,
			"depth_height": 360,
			"depth_stride": 480,
			"depth_width": 480,
			"disparity": 121995264,
			"x_map": 27328512,
			"y_map": 121470976
		},
		"face": {
			"IVP_FACE_MAX_NUM": 10,
			"face_info_0": {
				"blink_score": 0,
				"face_rect": {
					"bottom": 0,
					"left": 0,
					"right": 0,
					"top": 0
				},
				"id": 0,
				"left_eye_rect": {
					"bottom": 0,
					"left": 0,
					"right": 0,
					"top": 0
				},
				"right_eye_rect": {
					"bottom": 0,
					"left": 0,
					"right": 0,
					"top": 0
				},
				"smile_score": 0
			},
			"face_info_1": {
				"blink_score": 2,
				"face_rect": {
					"bottom": 0,
					"left": 0,
					"right": 0,
					"top": 0
				},
				"id": 1,
				"left_eye_rect": {
					"bottom": 1,
					"left": 0,
					"right": 2,
					"top": 0
				},
				"right_eye_rect": {
					"bottom": 1,
					"left": 0,
					"right": 0,
					"top": 0
				},
				"smile_score": 0
			},
			"face_info_2": {
				"blink_score": 0,
				"face_rect": {
					"bottom": 0,
					"left": 0,
					"right": 0,
					"top": 0
				},
				"id": 2,
				"left_eye_rect": {
					"bottom": 0,
					"left": 0,
					"right": 0,
					"top": 0
				},
				"right_eye_rect": {
					"bottom": 0,
					"left": 0,
					"right": 0,
					"top": 0
				},
				"smile_score": 0
			},
			"face_info_3": {
				"blink_score": 0,
				"face_rect": {
					"bottom": 0,
					"left": 0,
					"right": 0,
					"top": 0
				},
				"id": 3,
				"left_eye_rect": {
					"bottom": 0,
					"left": 0,
					"right": 0,
					"top": 0
				},
				"right_eye_rect": {
					"bottom": 0,
					"left": 0,
					"right": 0,
					"top": 0
				},
				"smile_score": 0
			},
			"face_info_4": {
				"blink_score": 0,
				"face_rect": {
					"bottom": 0,
					"left": 0,
					"right": 0,
					"top": 0
				},
				"id": 4,
				"left_eye_rect": {
					"bottom": 0,
					"left": 0,
					"right": 0,
					"top": 0
				},
				"right_eye_rect": {
					"bottom": 0,
					"left": 0,
					"right": 0,
					"top": 0
				},
				"smile_score": 0
			},
			"face_info_5": {
				"blink_score": 0,
				"face_rect": {
					"bottom": 0,
					"left": 0,
					"right": 0,
					"top": 0
				},
				"id": 5,
				"left_eye_rect": {
					"bottom": 0,
					"left": 0,
					"right": 0,
					"top": 0
				},
				"right_eye_rect": {
					"bottom": 0,
					"left": 0,
					"right": 0,
					"top": 0
				},
				"smile_score": 0
			},
			"face_info_6": {
				"blink_score": 0,
				"face_rect": {
					"bottom": 0,
					"left": 0,
					"right": 0,
					"top": 0
				},
				"id": 6,
				"left_eye_rect": {
					"bottom": 0,
					"left": 0,
					"right": 0,
					"top": 0
				},
				"right_eye_rect": {
					"bottom": 0,
					"left": 0,
					"right": 0,
					"top": 0
				},
				"smile_score": 0
			},
			"face_info_7": {
				"blink_score": 0,
				"face_rect": {
					"bottom": 0,
					"left": 0,
					"right": 0,
					"top": 0
				},
				"id": 7,
				"left_eye_rect": {
					"bottom": 0,
					"left": 0,
					"right": 0,
					"top": 0
				},
				"right_eye_rect": {
					"bottom": 0,
					"left": 0,
					"right": 0,
					"top": 0
				},
				"smile_score": 0
			},
			"face_info_8": {
				"blink_score": 0,
				"face_rect": {
					"bottom": 0,
					"left": 0,
					"right": 0,
					"top": 0
				},
				"id": 8,
				"left_eye_rect": {
					"bottom": 0,
					"left": 0,
					"right": 0,
					"top": 0
				},
				"right_eye_rect": {
					"bottom": 0,
					"left": 0,
					"right": 0,
					"top": 0
				},
				"smile_score": 0
			},
			"face_info_9": {
				"blink_score": 0,
				"face_rect": {
					"bottom": 0,
					"left": 0,
					"right": 0,
					"top": 0
				},
				"id": 9,
				"left_eye_rect": {
					"bottom": 0,
					"left": 0,
					"right": 0,
					"top": 0
				},
				"right_eye_rect": {
					"bottom": 0,
					"left": 0,
					"right": 0,
					"top": 0
				},
				"smile_score": 0
			},
			"face_num": 0
		},
		"final_SD_result": 0,
		"frame_idx": 3,
		"frame_info_main": {
			"frame_num": 4,
			"height": 1392,
			"image": 166920192,
			"iso": 20915,
			"raw_height": 2736,
			"raw_width": 3648,
			"stride": 1920,
			"width": 1856
		},
		"frame_info_sub": {
			"frame_num": 4,
			"height": 1952,
			"image": 196280320,
			"iso": 11419,
			"raw_height": 3840,
			"raw_width": 5120,
			"stride": 2688,
			"width": 2608
		},
		"fusion_type": 0,
		"gyro_info": {
			"gyro_x": 0,
			"gyro_y": 0,
			"gyro_z": 0
		},
		"height_result": 2736,
		"image_format": 1,
		"lens_compose": 9,
		"ois_info": {
			"hall_x": 0,
			"hall_y": 0
		},
		"reserve_data": "",
		"sr_scene": 0,
		"stride_result": 3712,
		"tele_zoom_ratio": 3,
		"width_result": 3648,
		"zoom_ratio": 1
	},
	"oz_para_output": {
		"base_idx": 0,
		"image_result": 204668928,
		"oz_stat_info": {
			"cfl": {
				"processTrace": "",
				"trace_length": 0
			},
			"csl": {
				"algo_csi": "",
				"algo_id": 0,
				"algo_result": 0,
				"algo_time": 0,
				"version": "",
				"yuv_snip_count": 0
			}
		},
		"reserve_data": "",
		"st_exif_info": {
			"color_SR_num": 1,
			"color_ghost_size_ratio": 2,
			"disparity_avg": 3,
			"disparity_var": 4,
			"far_sight_flag": 0,
			"gain_0": 0,
			"gain_1": 0,
			"gain_2": 0,
			"luma_ratio": 0,
			"mono_SR_num": 0,
			"mono_ghost_size_ratio": 0,
			"reserve_data": "",
			"router_result": 0,
			"small_disparity_ratio": 0,
			"tele_SR_num": 0,
			"tele_ghost_size_ratio": 0,
			"version": 0,
			"zoom_ratio": 0
		}
	}
}