{
    "effect": {
        "Link": [
            {
                "type": "3DScene",
                "zorder": 900,
                "path": "E12_3D_Scene_01/"
            },
            {
                "type":"Matting",
                "zorder":901,
                "path":"Matting_byTool_3/"
            }
        ]
    }, 
    "name": "E12_MagicSky_xk", 
    "version": "1.0"
}
