{
    "tag":"Matting_bytool_sky_seg_lzy",
    "content":{
        "mattingType":"MattingSkySeg",
        "reverseMask":true,
        "bgGamma":1,
        "bgBlendAlpha":1,
        "maskBlurIndensity":5,
        "fliter":{
            "intensity":0.8,
            "path":"Matting_wuyun/filter/lut.png"
        }
    },
    "version":"1.3",
    "requirement":{
        "skySegDetect":true
    }
}
