{
    "tag":"Matting_bytool_sky_seg_xk",
	"needblend": false,
    "content":{
        "mattingType":"MattingSkySeg",
        "reverseMask":true,
        "bgGamma":1.0,
        "bgBlendAlpha":1,
        "maskBlurIndensity":0.3,
        "fliter":{
            "intensity":0.7,
            "path":"Matting_byTool_3/filter/lut.png"
        }
    },
    "version":"1.3",
    "requirement":{
        "skySegDetect":true
    }
}
