{
	"centerX" : 0.5,
	"centerY" : 0.5,
	"angle" : 0,
	"scale" : 1,
	"width" : 174,
	"height" : 120,
	"contents" : [
		{
			"type" : "image",
			"resource" : {
				"type" : "static",
				"path" : "res/baby.png"
			},
			"centerX" : 0.5,
			"centerY" : 0.5,
			"width" : 174,
			"height" : 120,
			"angle" : 0,
			"zorder" : 1
		}
	]
}
