 "C-OTE" "C-OTE" "202" "01"
 "voda GR" "voda GR" "202" "05"
 "WIND" "WIND" "202" "09"
 "WIND" "WIND" "202" "10"
 "voda GR" "voda GR" "202" "14"
 "Tele2" "Tele2" "204" "02"
 "voda NL" "voda NL" "204" "04"
 "NL KPN" "NL KPN" "204" "08"
 "NL Tlfrt" "NL Tlfrt" "204" "12"
 "TMO NL" "TMO NL" "204" "16"
 "TMO NL" "TMO NL" "204" "20"
 "Proximus" "Proximus" "206" "01"
 "BASE" "BASE" "206" "05"
 "OBE" "OBE" "206" "10"
 "BASE" "BASE" "206" "20"
 "Orange" "Orange" "208" "01"
 "Contact" "Contact" "208" "02"
 "SFR" "SFR" "208" "09"
 "SFR" "SFR" "208" "10"
 "SFRFEMTO" "SFRFEMTO" "208" "11"
 "Contact" "Contact" "208" "13"
 "Free" "Free" "208" "15"
 "BYTEL" "BYTEL" "208" "20"
 "Contact" "Contact" "208" "88"
 "vala" "vala" "212" "01"
 "MONACO" "MONACO" "212" "02"
 "MONACO" "MONACO" "212" "10"
 "AndorraT" "AndorraT" "213" "03"
 "voda ES" "voda ES" "214" "01"
 "ESPRT" "ESPRT" "214" "03"
 "YOIGO" "YOIGO" "214" "04"
 "movistar" "movistar" "214" "05"
 "voda ES" "voda ES" "214" "06"
 "Movistar" "Movistar" "214" "07"
 "TelenorH" "TelenorH" "216" "01"
 "DIGI HU" "DIGI HU" "216" "03"
 "THU" "THU" "216" "30"
 "voda HU" "voda HU" "216" "70"
 "HTERONET" "HTERONET" "218" "03"
 "m:tel" "m:tel" "218" "05"
 "BHMOBILE" "BHMOBILE" "218" "90"
 "HT HR" "HT HR" "219" "01"
 "Tele2 HR" "Tele2 HR" "219" "02"
 "A1 HR" "A1 HR" "219" "10"
 "Telenor" "Telenor" "220" "01"
 "MTS" "MTS" "220" "03"
 "Vip SRB" "Vip SRB" "220" "05"
 "vala" "vala" "221" "01"
 "IPKO" "IPKO" "221" "02"
 "TIM" "TIM" "222" "01"
 "voda IT" "voda IT" "222" "10"
 "ILIAD" "ILIAD" "222" "50"
 "I WIND" "I WIND" "222" "88"
 "3 ITA" "3 ITA" "222" "99"
 "VF-RO" "VF-RO" "226" "01"
 "TELEKOM" "TELEKOM" "226" "03"
 "Digi" "Digi" "226" "05"
 "ORANGE" "ORANGE" "226" "10"
 "Swisscom" "Swisscom" "228" "01"
 "Sunrise" "Sunrise" "228" "02"
 "Salt" "Salt" "228" "03"
 "TMO CZ" "TMO CZ" "230" "01"
 "O2 - CZ" "O2 - CZ" "230" "02"
 "Vodafone" "Vodafone" "230" "03"
 "Orange" "Orange" "231" "01"
 "Telekom" "Telekom" "231" "02"
 "SWAN SK" "SWAN SK" "231" "03"
 "O2 - SK" "O2 - SK" "231" "06"
 "A1" "A1" "232" "01"
 "TMA" "TMA" "232" "03"
 "3 AT" "3 AT" "232" "05"
 "telering" "telering" "232" "07"
 "3 AT" "3 AT" "232" "10"
 "A1" "A1" "232" "11"
 "A1" "A1" "232" "12"
 "ATL-VOD" "ATL-VOD" "234" "03"
 "O2 - UK" "O2 - UK" "234" "10"
 "voda UK" "voda UK" "234" "15"
 "3 UK" "3 UK" "234" "20"
 "Truphone" "Truphone" "234" "25"
 "Marathon" "Marathon" "234" "28"
 "EE" "EE" "234" "30"
 "EE" "EE" "234" "33"
 "JT" "JT" "234" "50"
 "Sure" "Sure" "234" "55"
 "MANX" "MANX" "234" "58"
 "TDC" "TDC" "238" "01"
 "TelenoDK" "TelenoDK" "238" "02"
 "3 DK" "3 DK" "238" "06"
 "Telia" "Telia" "238" "20"
 "TT DK" "TT DK" "238" "66"
 "TelenoDK" "TelenoDK" "238" "77"
 "TELIA" "TELIA" "240" "01"
 "3 SE" "3 SE" "240" "02"
 "SWE" "SWE" "240" "04"
 "Sweden3G" "Sweden3G" "240" "05"
 "TelenorS" "TelenorS" "240" "06"
 "Tele2 SE" "Tele2 SE" "240" "07"
 "TelenorS" "TelenorS" "240" "08"
 "Tele2 SE" "Tele2 SE" "240" "10"
 "TDC" "TDC" "240" "14"
 "MobileS" "MobileS" "240" "24"
 "TelenorS" "TelenorS" "240" "42"
 "TELENOR" "TELENOR" "242" "01"
 "NetCom" "NetCom" "242" "02"
 "Mobile N" "Mobile N" "242" "05"
 "TDC" "TDC" "242" "08"
 "ice.net" "ice.net" "242" "14"
 "Tampnet" "Tampnet" "242" "99"
 "DNA" "DNA" "244" "03"
 "elisa" "elisa" "244" "05"
 "DNA" "DNA" "244" "12"
 "FI AMT" "FI AMT" "244" "14"
 "elisa" "elisa" "244" "21"
 "SuomenYV" "SuomenYV" "244" "36"
 "SONERA" "SONERA" "244" "91"
 "OMT" "OMT" "246" "01"
 "BITE" "BITE" "246" "02"
 "Tele2 LT" "Tele2 LT" "246" "03"
 "LMT" "LMT" "247" "01"
 "Tele2 LV" "Tele2 LV" "247" "02"
 "BITE LV" "BITE LV" "247" "05"
 "Telia" "Telia" "248" "01"
 "ELISA" "ELISA" "248" "02"
 "Tele2 EE" "Tele2 EE" "248" "03"
 "MTS RUS" "MTS RUS" "250" "01"
 "MegaFon" "MegaFon" "250" "02"
 "NTC" "NTC" "250" "16"
 "Tele2" "Tele2" "250" "20"
 "LETAI" "LETAI" "250" "27"
 "voda" "voda" "250" "28"
 "MOTIV" "MOTIV" "250" "35"
 "Beeline" "Beeline" "250" "47"
 "Beeline" "Beeline" "250" "99"
 "VODAFONE" "VODAFONE" "255" "01"
 "Beeline" "Beeline" "255" "02"
 "UA-KS" "UA-KS" "255" "03"
 "life:)" "life:)" "255" "06"
 "TriMob" "TriMob" "255" "07"
 "VELCOM" "VELCOM" "257" "01"
 "MTS BY" "MTS BY" "257" "02"
 "life:)BY" "life:)BY" "257" "04"
 "Orange" "Orange" "259" "01"
 "Moldcell" "Moldcell" "259" "02"
 "UNITE" "UNITE" "259" "05"
 "IDC" "IDC" "259" "15"
 "PLUS" "PLUS" "260" "01"
 "TM PL" "TM PL" "260" "02"
 "Orange" "Orange" "260" "03"
 "Play" "Play" "260" "06"
 "TDG" "TDG" "262" "01"
 "Vodafone" "Vodafone" "262" "02"
 "o2 - de" "o2 - de" "262" "03"
 "o2 - de" "o2 - de" "262" "07"
 "GIBTEL" "GIBTEL" "266" "01"
 "voda P" "voda P" "268" "01"
 "NOS" "NOS" "268" "03"
 "MEO" "MEO" "268" "06"
 "POST" "POST" "270" "01"
 "MTX" "MTX" "270" "02"
 "TANGO" "TANGO" "270" "77"
 "Orange" "Orange" "270" "99"
 "voda IE" "voda IE" "272" "01"
 "3" "3" "272" "02"
 "METEOR" "METEOR" "272" "03"
 "3" "3" "272" "05"
 "SIMINN" "SIMINN" "274" "01"
 "Vodafone" "Vodafone" "274" "02"
 "Viking" "Viking" "274" "04"
 "OnWaves" "OnWaves" "274" "08"
 "NOVA" "NOVA" "274" "11"
 "TAL" "TAL" "274" "12"
 "T.al" "T.al" "276" "01"
 "Voda AL" "Voda AL" "276" "02"
 "ATmobile" "ATmobile" "276" "03"
 "voda MT" "voda MT" "278" "01"
 "gomobile" "gomobile" "278" "21"
 "Melita" "Melita" "278" "77"
 "CytaVoda" "CytaVoda" "280" "01"
 "MTN" "MTN" "280" "10"
 "PrimeTel" "PrimeTel" "280" "20"
 "GCELL" "GCELL" "282" "01"
 "MAGTI" "MAGTI" "282" "02"
 "BEE" "BEE" "282" "04"
 "Beeline" "Beeline" "283" "01"
 "MTS Arm" "MTS Arm" "283" "05"
 "Ucom" "Ucom" "283" "10"
 "A1 BG" "A1 BG" "284" "01"
 "Vivacom" "Vivacom" "284" "03"
 "Telenor" "Telenor" "284" "05"
 "TCELL" "TCELL" "286" "01"
 "VF-TR" "VF-TR" "286" "02"
 "AVEA" "AVEA" "286" "03"
 "AVEA" "AVEA" "286" "04"
 "FT-GSM" "FT-GSM" "288" "01"
 "VODAFONE" "VODAFONE" "288" "02"
 "TELE GRL" "TELE GRL" "290" "01"
 "SMT" "SMT" "292" "01"
 "A1 SI" "A1 SI" "293" "40"
 "MOBITEL" "MOBITEL" "293" "41"
 "T-2" "T-2" "293" "64"
 "TELEMACH" "TELEMACH" "293" "70"
 "MKT MK" "MKT MK" "294" "01"
 "ONE" "ONE" "294" "02"
 "Vip MKD" "Vip MKD" "294" "03"
 "Swiss FL" "Swiss FL" "295" "01"
 "Salt.li" "Salt.li" "295" "02"
 "FL1" "FL1" "295" "05"
 "Cubic" "Cubic" "295" "06"
 "Alpmobil" "Alpmobil" "295" "77"
 "Telenor" "Telenor" "297" "01"
 "T.me" "T.me" "297" "02"
 "MTEL" "MTEL" "297" "03"
 "Xplore" "Xplore" "302" "130"
 "TELUS" "TELUS" "302" "220"
 "Eastlink" "Eastlink" "302" "270"
 "ETI" "ETI" "302" "340"
 "Fido" "Fido" "302" "370"
 "KNET" "KNET" "302" "380"
 "SSi" "SSi" "302" "480"
 "Freedom" "Freedom" "302" "490"
 "CANVT" "CANVT" "302" "500"
 "CANVT" "CANVT" "302" "520"
 "Bell" "Bell" "302" "610"
 "Ice" "Ice" "302" "620"
 "ROGERS" "ROGERS" "302" "720"
 "SaskTel" "SaskTel" "302" "780"
 "FastRoam" "FastRoam" "302" "880"
 "Wightman" "Wightman" "302" "940"
 "AMERIS" "AMERIS" "308" "01"
 "UnionTel" "UnionTel" "310" "020"
 "AT&T" "AT&T" "310" "030"
 "IT&E" "IT&E" "310" "032"
 "GCI" "GCI" "310" "050"
 "IT&E" "IT&E" "310" "110"
 "Sprint" "Sprint" "310" "120"
 "GTA" "GTA" "310" "140"
 "AT&T" "AT&T" "310" "150"
 "T-Mobile" "T-Mobile" "310" "160"
 "AT&T" "AT&T" "310" "170"
 "WCW" "WCW" "310" "180"
 "D-HARBOR" "D-HARBOR" "310" "190"
 "T-Mobile" "T-Mobile" "310" "200"
 "T-Mobile" "T-Mobile" "310" "210"
 "T-Mobile" "T-Mobile" "310" "220"
 "T-Mobile" "T-Mobile" "310" "230"
 "T-Mobile" "T-Mobile" "310" "240"
 "T-Mobile" "T-Mobile" "310" "250"
 "T-Mobile" "T-Mobile" "310" "260"
 "T-Mobile" "T-Mobile" "310" "270"
 "AT&T" "AT&T" "310" "280"
 "Big Sky" "Big Sky" "310" "300"
 "T-Mobile" "T-Mobile" "310" "310"
 "Cell" "Cell" "310" "320"
 "LMUSA" "LMUSA" "310" "340"
 "DOCOMO PACIFIC" "DOCOMO PACIFIC" "310" "370"
 "AT&T" "AT&T" "310" "380"
 "AT&T" "AT&T" "310" "410"
 "CBW" "CBW" "310" "420"
 "NECCI" "NECCI" "310" "450"
 "USA1L" "USA1L" "310" "460"
 "DOCOMO PACIFIC" "DOCOMO PACIFIC" "310" "470"
 "T-Mobile" "T-Mobile" "310" "490"
 "IWS" "IWS" "310" "530"
 "AT&T" "AT&T" "310" "560"
 "Cell One" "Cell One" "310" "570"
 "IC" "IC" "310" "58"
 "Verizon" "Verizon" "310" "590"
 "AMERLINK" "AMERLINK" "310" "630"
 "Jasper" "Jasper" "310" "650"
 "T-Mobile" "T-Mobile" "310" "660"
 "AT&T" "AT&T" "310" "680"
 "LMUSA" "LMUSA" "310" "690"
 "ASTAC" "ASTAC" "310" "710"
 "USCC" "USCC" "310" "730"
 "OTZ" "OTZ" "310" "740"
 "IWS" "IWS" "310" "770"
 "T-Mobile" "T-Mobile" "310" "800"
 "telna" "telna" "310" "840"
 "Verizon" "Verizon" "310" "890"
 "Evolve" "Evolve" "310" "990"
 "Indigo" "Indigo" "311" "030"
 "Commnet" "Commnet" "311" "040"
 "PINECell" "PINECell" "311" "080"
 "Tampnet" "Tampnet" "311" "170"
 "C1ECI" "C1ECI" "311" "190"
 "C Spire" "C Spire" "311" "230"
 "CWCI" "CWCI" "311" "240"
 "Verizon" "Verizon" "311" "270"
 "Commnet" "Commnet" "311" "320"
 "GCI" "GCI" "311" "370"
 "Verizon" "Verizon" "311" "480"
 "USANW" "USANW" "311" "530"
 "USCC" "USCC" "311" "580"
 "LMUSA" "LMUSA" "311" "600"
 "C Spire" "C Spire" "311" "630"
 "MPCS" "MPCS" "311" "660"
 "NEWN" "NEWN" "311" "710"
 "TCI" "TCI" "311" "740"
 "BW" "BW" "311" "810"
 "VTW" "VTW" "311" "990"
 "CvgCo" "CvgCo" "312" "060"
 "LMUSA" "LMUSA" "312" "180"
 "SRTW" "SRTW" "312" "230"
 "USACL" "USACL" "312" "260"
 "CNP" "CNP" "312" "280"
 "Strata" "Strata" "312" "290"
 "NTW" "NTW" "312" "420"
 "Nemont" "Nemont" "312" "480"
 "NetGenui" "NetGenui" "312" "630"
 "GigSky" "GigSky" "312" "870"
 "MNSHub" "MNSHub" "313" "070"
 "AT&T" "AT&T" "313" "100"
 "OptimERA" "OptimERA" "313" "380"
 "Sprint" "Sprint" "316" "010"
 "Claro" "Claro" "330" "110"
 "Open Mob" "Open Mob" "330" "120"
 "TELCEL" "TELCEL" "334" "020"
 "TEMM" "TEMM" "334" "03"
 "movistar" "movistar" "334" "030"
 "AT&T" "AT&T" "334" "050"
 "AT&T" "AT&T" "334" "070"
 "AT&T" "AT&T" "334" "90"
 "Digicel" "Digicel" "338" "050"
 "FLOW" "FLOW" "338" "180"
 "Orange" "Orange" "340" "01"
 "SFR" "SFR" "340" "02"
 "DAUPHIN" "DAUPHIN" "340" "08"
 "DigicelF" "DigicelF" "340" "20"
 "FLOW" "FLOW" "342" "600"
 "DIGICEL" "DIGICEL" "342" "750"
 "inet" "inet" "344" "30"
 "FLOW" "FLOW" "344" "920"
 "Cingular" "Cingular" "344" "930"
 "FLOW" "FLOW" "346" "140"
 "FLOW" "FLOW" "348" "170"
 "CCTBVI" "CCTBVI" "348" "570"
 "DIGICEL" "DIGICEL" "348" "770"
 "CELLONE" "CELLONE" "350" "000"
 "Cingular" "Cingular" "350" "010"
 "M3" "M3" "350" "02"
 "DIGICEL" "DIGICEL" "352" "030"
 "FLOW" "FLOW" "352" "110"
 "FLOW" "FLOW" "354" "860"
 "FLOW" "FLOW" "356" "110"
 "DIGICEL" "DIGICEL" "358" "050"
 "FLOW" "FLOW" "358" "110"
 "DIGICEL" "DIGICEL" "360" "070"
 "FLOW" "FLOW" "360" "110"
 "Telcell" "Telcell" "362" "51"
 "Digicel" "Digicel" "362" "69"
 "Kla" "Kla" "362" "78"
 "CHIPPIE" "CHIPPIE" "362" "91"
 "SETAR" "SETAR" "363" "01"
 "Digicel" "Digicel" "363" "02"
 "BTC" "BTC" "364" "39"
 "aliv" "aliv" "364" "49"
 "FLOW" "FLOW" "365" "840"
 "Cingular" "Cingular" "366" "020"
 "FLOW" "FLOW" "366" "110"
 "CUBACEL" "CUBACEL" "368" "01"
 "ALTICE" "ALTICE" "370" "01"
 "ClaroDOM" "ClaroDOM" "370" "02"
 "Viva" "Viva" "370" "04"
 "Wind" "Wind" "370" "05"
 "Natcom" "Natcom" "372" "03"
 "TSTT" "TSTT" "374" "12"
 "Digicel" "Digicel" "374" "130"
 "FLOW" "FLOW" "376" "350"
 "Azercell" "Azercell" "400" "01"
 "BAKCELL" "BAKCELL" "400" "02"
 "Nar" "Nar" "400" "04"
 "Beeline" "Beeline" "401" "01"
 "Kcell" "Kcell" "401" "02"
 "ALTEL" "ALTEL" "401" "07"
 "Tele2" "Tele2" "401" "77"
 "B-Mobile" "B-Mobile" "402" "11"
 "TASHICEL" "TASHICEL" "402" "77"
 "airtel" "airtel" "404" "02"
 "airtel" "airtel" "404" "03"
 "IDEA" "IDEA" "404" "04"
 "Vodafone" "Vodafone" "404" "05"
 "IDEA" "IDEA" "404" "07"
 "airtel" "airtel" "404" "10"
 "Vodafone" "Vodafone" "404" "11"
 "IDEA" "IDEA" "404" "12"
 "IDEA" "IDEA" "404" "14"
 "airtel" "airtel" "404" "16"
 "Aircel" "Aircel" "404" "17"
 "IDEA" "IDEA" "404" "19"
 "Vodafone" "Vodafone" "404" "20"
 "BPL MOBILE" "BPL MOBILE" "404" "21"
 "IDEA" "IDEA" "404" "22"
 "IDEA" "IDEA" "404" "24"
 "Aircel" "Aircel" "404" "25"
 "Vodafone" "Vodafone" "404" "27"
 "Aircel" "Aircel" "404" "28"
 "Aircel" "Aircel" "404" "29"
 "Vodafone" "Vodafone" "404" "30"
 "airtel" "airtel" "404" "31"
 "Aircel" "Aircel" "404" "33"
 "CellOne" "CellOne" "404" "34"
 "Aircel" "Aircel" "404" "35"
 "Aircel" "Aircel" "404" "37"
 "CellOne" "CellOne" "404" "38"
 "airtel" "airtel" "404" "40"
 "Aircel" "Aircel" "404" "41"
 "Aircel" "Aircel" "404" "42"
 "Vodafone" "Vodafone" "404" "43"
 "IDEA" "IDEA" "404" "44"
 "airtel" "airtel" "404" "45"
 "Vodafone" "Vodafone" "404" "46"
 "airtel" "airtel" "404" "49"
 "CellOne" "CellOne" "404" "51"
 "CellOne" "CellOne" "404" "53"
 "CellOne" "CellOne" "404" "54"
 "CellOne" "CellOne" "404" "55"
 "IDEA" "IDEA" "404" "56"
 "CellOne" "CellOne" "404" "57"
 "CellOne" "CellOne" "404" "58"
 "CellOne" "CellOne" "404" "59"
 "CellOne" "CellOne" "404" "62"
 "CellOne" "CellOne" "404" "64"
 "CellOne" "CellOne" "404" "66"
 "RELIANCE" "RELIANCE" "404" "67"
 "DOLPHIN" "DOLPHIN" "404" "68"
 "DOLPHIN" "DOLPHIN" "404" "69"
 "airtel" "airtel" "404" "70"
 "CellOne" "CellOne" "404" "71"
 "CellOne" "CellOne" "404" "72"
 "CellOne" "CellOne" "404" "73"
 "CellOne" "CellOne" "404" "74"
 "CellOne" "CellOne" "404" "75"
 "CellOne" "CellOne" "404" "76"
 "CellOne" "CellOne" "404" "77"
 "IDEA" "IDEA" "404" "78"
 "CellOne" "CellOne" "404" "79"
 "CellOne" "CellOne" "404" "80"
 "CellOne" "CellOne" "404" "81"
 "IDEA" "IDEA" "404" "82"
 "IDEA" "IDEA" "404" "87"
 "IDEA" "IDEA" "404" "89"
 "airtel" "airtel" "404" "90"
 "Aircel" "Aircel" "404" "91"
 "airtel" "airtel" "404" "92"
 "airtel" "airtel" "404" "93"
 "airtel" "airtel" "404" "94"
 "airtel" "airtel" "404" "95"
 "airtel" "airtel" "404" "96"
 "airtel" "airtel" "404" "97"
 "airtel" "airtel" "404" "98"
 "TATA DOCOMO" "TATA DOCOMO" "405" "025"
 "TATA DOCOMO" "TATA DOCOMO" "405" "027"
 "TATA DOCOMO" "TATA DOCOMO" "405" "029"
 "TATA DOCOMO" "TATA DOCOMO" "405" "030"
 "TATA DOCOMO" "TATA DOCOMO" "405" "031"
 "TATA DOCOMO" "TATA DOCOMO" "405" "032"
 "TATA DOCOMO" "TATA DOCOMO" "405" "034"
 "TATA DOCOMO" "TATA DOCOMO" "405" "035"
 "TATA DOCOMO" "TATA DOCOMO" "405" "036"
 "TATA DOCOMO" "TATA DOCOMO" "405" "037"
 "TATA DOCOMO" "TATA DOCOMO" "405" "038"
 "TATA DOCOMO" "TATA DOCOMO" "405" "039"
 "TATA DOCOMO" "TATA DOCOMO" "405" "041"
 "TATA DOCOMO" "TATA DOCOMO" "405" "042"
 "TATA DOCOMO" "TATA DOCOMO" "405" "043"
 "TATA DOCOMO" "TATA DOCOMO" "405" "044"
 "TATA DOCOMO" "TATA DOCOMO" "405" "045"
 "TATA DOCOMO" "TATA DOCOMO" "405" "046"
 "TATA DOCOMO" "TATA DOCOMO" "405" "047"
 "airtel" "airtel" "405" "51"
 "airtel" "airtel" "405" "52"
 "airtel" "airtel" "405" "53"
 "airtel" "airtel" "405" "54"
 "airtel" "airtel" "405" "55"
 "airtel" "airtel" "405" "56"
 "IDEA" "IDEA" "405" "70"
 "IDEA" "IDEA" "405" "799"
 "Aircel" "Aircel" "405" "800"
 "Aircel" "Aircel" "405" "801"
 "Aircel" "Aircel" "405" "802"
 "Aircel" "Aircel" "405" "803"
 "Aircel" "Aircel" "405" "804"
 "Aircel" "Aircel" "405" "805"
 "Aircel" "Aircel" "405" "806"
 "Aircel" "Aircel" "405" "807"
 "Aircel" "Aircel" "405" "808"
 "Aircel" "Aircel" "405" "809"
 "Aircel" "Aircel" "405" "810"
 "Aircel" "Aircel" "405" "811"
 "Aircel" "Aircel" "405" "812"
 "Telenor" "Telenor" "405" "818"
 "Telenor" "Telenor" "405" "819"
 "VIDEOCON" "VIDEOCON" "405" "823"
 "VIDEOCON" "VIDEOCON" "405" "824"
 "VIDEOCON" "VIDEOCON" "405" "825"
 "VIDEOCON" "VIDEOCON" "405" "827"
 "VIDEOCON" "VIDEOCON" "405" "828"
 "VIDEOCON" "VIDEOCON" "405" "829"
 "VIDEOCON" "VIDEOCON" "405" "830"
 "VIDEOCON" "VIDEOCON" "405" "831"
 "VIDEOCON" "VIDEOCON" "405" "832"
 "VIDEOCON" "VIDEOCON" "405" "833"
 "VIDEOCON" "VIDEOCON" "405" "834"
 "VIDEOCON" "VIDEOCON" "405" "835"
 "VIDEOCON" "VIDEOCON" "405" "836"
 "VIDEOCON" "VIDEOCON" "405" "837"
 "VIDEOCON" "VIDEOCON" "405" "838"
 "VIDEOCON" "VIDEOCON" "405" "839"
 "JIO" "JIO" "405" "840"
 "VIDEOCON" "VIDEOCON" "405" "841"
 "VIDEOCON" "VIDEOCON" "405" "842"
 "VIDEOCON" "VIDEOCON" "405" "843"
 "IDEA" "IDEA" "405" "845"
 "IDEA" "IDEA" "405" "846"
 "IDEA" "IDEA" "405" "848"
 "IDEA" "IDEA" "405" "849"
 "IDEA" "IDEA" "405" "850"
 "IDEA" "IDEA" "405" "852"
 "IDEA" "IDEA" "405" "853"
 "JIO" "JIO" "405" "854"
 "JIO" "JIO" "405" "855"
 "JIO" "JIO" "405" "856"
 "JIO" "JIO" "405" "857"
 "JIO" "JIO" "405" "858"
 "JIO" "JIO" "405" "859"
 "JIO" "JIO" "405" "860"
 "JIO" "JIO" "405" "861"
 "JIO" "JIO" "405" "862"
 "JIO" "JIO" "405" "863"
 "JIO" "JIO" "405" "864"
 "JIO" "JIO" "405" "865"
 "JIO" "JIO" "405" "866"
 "JIO" "JIO" "405" "867"
 "JIO" "JIO" "405" "868"
 "JIO" "JIO" "405" "869"
 "JIO" "JIO" "405" "870"
 "JIO" "JIO" "405" "871"
 "JIO" "JIO" "405" "872"
 "JIO" "JIO" "405" "873"
 "JIO" "JIO" "405" "874"
 "Telenor" "Telenor" "405" "875"
 "Telenor" "Telenor" "405" "876"
 "Telenor" "Telenor" "405" "879"
 "Telenor" "Telenor" "405" "927"
 "Telenor" "Telenor" "405" "929"
 "Jazz" "Jazz" "410" "01"
 "UFONE" "UFONE" "410" "03"
 "ZONG" "ZONG" "410" "04"
 "SCOM" "SCOM" "410" "05"
 "TELENOR" "TELENOR" "410" "06"
 "AWCC" "AWCC" "412" "01"
 "ROSHAN" "ROSHAN" "412" "20"
 "MTN" "MTN" "412" "40"
 "Etisalat" "Etisalat" "412" "50"
 "Mobitel" "Mobitel" "413" "01"
 "DIALOG" "DIALOG" "413" "02"
 "Etisalat" "Etisalat" "413" "03"
 "Airtel" "Airtel" "413" "05"
 "Hutch" "Hutch" "413" "08"
 "MPTGSM" "MPTGSM" "414" "01"
 "Ooredoo" "Ooredoo" "414" "05"
 "TNM" "TNM" "414" "06"
 "MYTEL" "MYTEL" "414" "09"
 "alfa" "alfa" "415" "01"
 "touch" "touch" "415" "03"
 "OM" "OM" "415" "05"
 "Zain JO" "Zain JO" "416" "01"
 "UMNIAH" "UMNIAH" "416" "03"
 "OrangeJO" "OrangeJO" "416" "77"
 "SYRIATEL" "SYRIATEL" "417" "01"
 "MTN" "MTN" "417" "02"
 "ASIACELL" "ASIACELL" "418" "05"
 "zain IQ" "zain IQ" "418" "20"
 "IRAQNA" "IRAQNA" "418" "30"
 "KOREK" "KOREK" "418" "40"
 "zain KW" "zain KW" "419" "02"
 "Ooredoo" "Ooredoo" "419" "03"
 "VIVA" "VIVA" "419" "04"
 "STC" "STC" "420" "01"
 "Mobily" "Mobily" "420" "03"
 "Zain KSA" "Zain KSA" "420" "04"
 "STC" "STC" "420" "05"
 "Mobily" "Mobily" "420" "060"
 "SABAFON" "SABAFON" "421" "01"
 "MTN" "MTN" "421" "02"
 "Y" "Y" "421" "04"
 "Omantel" "Omantel" "422" "02"
 "Ooredoo" "Ooredoo" "422" "03"
 "ETISALAT" "ETISALAT" "424" "02"
 "du" "du" "424" "03"
 "Partner" "Partner" "425" "01"
 "Cellcom" "Cellcom" "425" "02"
 "PCL" "PCL" "425" "03"
 "JAWWAL" "JAWWAL" "425" "05"
 "Ooredoo" "Ooredoo" "425" "06"
 "HOT IL" "HOT IL" "425" "07"
 "Golan T" "Golan T" "425" "08"
 "Cellcom" "Cellcom" "425" "15"
 "Israel" "Israel" "425" "28"
 "BATELCO" "BATELCO" "426" "01"
 "Zain BH" "Zain BH" "426" "02"
 "VIVA BH" "VIVA BH" "426" "04"
 "BATELCO" "BATELCO" "426" "05"
 "Ooredoo" "Ooredoo" "427" "01"
 "VF-QA" "VF-QA" "427" "02"
 "Skytel" "Skytel" "428" "01"
 "UNTLMN" "UNTLMN" "428" "88"
 "MobiCom" "MobiCom" "428" "99"
 "NT" "NT" "429" "01"
 "Ncell" "Ncell" "429" "02"
 "ST" "ST" "429" "04"
 "IR-TCI" "IR-TCI" "432" "11"
 "Taliya" "Taliya" "432" "32"
 "Irancell" "Irancell" "432" "35"
 "Beeline" "Beeline" "434" "04"
 "Ucell" "Ucell" "434" "05"
 "UMS" "UMS" "434" "07"
 "UzMobile" "UzMobile" "434" "08"
 "TCELL" "TCELL" "436" "01"
 "TCELL" "TCELL" "436" "02"
 "MegaFon" "MegaFon" "436" "03"
 "Babilon" "Babilon" "436" "04"
 "BEELINE" "BEELINE" "436" "05"
 "Beeline" "Beeline" "437" "01"
 "MegaCom" "MegaCom" "437" "05"
 "O!" "O!" "437" "09"
 "MTS TM" "MTS TM" "438" "01"
 "TM CELL" "TM CELL" "438" "02"
 "Ymobile" "Ymobile" "440" "00"
 "NTT DOCOMO" "NTT DOCOMO" "440" "10"
 "SoftBank" "SoftBank" "440" "20"
 "KDDI" "KDDI" "440" "50"
 "KDDI" "KDDI" "440" "51"
 "SKT" "SKT" "450" "05"
 "LG U+" "LG U+" "450" "06"
 "KT" "KT" "450" "08"
 "LG U+" "LG U+" "450" "10"
 "Mobifone" "Mobifone" "452" "01"
 "GPC" "GPC" "452" "02"
 "VIETTEL" "VIETTEL" "452" "04"
 "VNMOBILE" "VNMOBILE" "452" "05"
 "Gmobile" "Gmobile" "452" "07"
 "CSL" "CSL" "454" "00"
 "CSL" "CSL" "454" "02"
 "3" "3" "454" "03"
 "3" "3" "454" "04"
 "SMC HK" "SMC HK" "454" "06"
 "CSL" "CSL" "454" "10"
 "CMHK" "CMHK" "454" "12"
 "CMHK" "CMHK" "454" "13"
 "SMC HK" "SMC HK" "454" "15"
 "CSL" "CSL" "454" "16"
 "SMC HK" "SMC HK" "454" "17"
 "CSL" "CSL" "454" "18"
 "CSL" "CSL" "454" "19"
 "CSL" "CSL" "454" "20"
 "SMC MAC" "SMC MAC" "455" "00"
 "CTM" "CTM" "455" "01"
 "3 Macau" "3 Macau" "455" "03"
 "CTM" "CTM" "455" "04"
 "Cellcard" "Cellcard" "456" "01"
 "Hello" "Hello" "456" "02"
 "qb" "qb" "456" "04"
 "SMART" "SMART" "456" "05"
 "SMART" "SMART" "456" "06"
 "Metfone" "Metfone" "456" "08"
 "SEATEL" "SEATEL" "456" "11"
 "LAO GSM" "LAO GSM" "457" "01"
 "ETLMNW" "ETLMNW" "457" "02"
 "UNITEL" "UNITEL" "457" "03"
 "BEELINE" "BEELINE" "457" "08"
 "CMCC" "CMCC" "460" "00"
 "UNICOM" "UNICOM" "460" "01"
 "CMCC" "CMCC" "460" "02"
 "CT" "CT" "460" "03"
 "CMCC" "CMCC" "460" "04"
 "UNICOM" "UNICOM" "460" "06"
 "CMCC" "CMCC" "460" "07"
 "CMCC" "CMCC" "460" "08"
 "UNICOM" "UNICOM" "460" "09"
 "CT" "CT" "460" "11"
 "CMCC" "CMCC" "460" "13"
 "FET" "FET" "466" "01"
 "APT" "APT" "466" "05"
 "APT" "APT" "466" "12"
 "KGT" "KGT" "466" "88"
 "T Star" "T Star" "466" "89"
 "Chunghwa" "Chunghwa" "466" "92"
 "TW MOB" "TW MOB" "466" "93"
 "TWM" "TWM" "466" "97"
 "TWM TAT" "TWM TAT" "466" "99"
 "grameen" "grameen" "470" "01"
 "robi" "robi" "470" "02"
 "BL" "BL" "470" "03"
 "bMobile" "bMobile" "470" "04"
 "Airtel" "Airtel" "470" "07"
 "BIEL 4G" "BIEL 4G" "470" "09"
 "DHIRAAGU" "DHIRAAGU" "472" "01"
 "Ooredoo" "Ooredoo" "472" "02"
 "MY MAXIS" "MY MAXIS" "502" "12"
 "CELCOM" "CELCOM" "502" "13"
 "Yes 4G" "Yes 4G" "502" "152"
 "unifi" "unifi" "502" "153"
 "ALTEL" "ALTEL" "502" "156"
 "Digi 4G+" "Digi 4G+" "502" "16"
 "U MOBILE" "U MOBILE" "502" "18"
 "CELCOM" "CELCOM" "502" "19"
 "Telstra" "Telstra" "505" "01"
 "Optus" "Optus" "505" "02"
 "voda AU" "voda AU" "505" "03"
 "3TELSTRA" "3TELSTRA" "505" "06"
 "NT" "NT" "505" "10"
 "Pivotel" "Pivotel" "505" "50"
 "Telstra" "Telstra" "505" "71"
 "Telstra" "Telstra" "505" "72"
 "INDOSAT" "INDOSAT" "510" "01"
 "Axis" "Axis" "510" "08"
 "SF" "SF" "510" "09"
 "T-SEL" "T-SEL" "510" "10"
 "XL" "XL" "510" "11"
 "INDOSAT" "INDOSAT" "510" "21"
 "SF" "SF" "510" "28"
 "3" "3" "510" "89"
 "TCEL" "TCEL" "514" "01"
 "TT" "TT" "514" "02"
 "GLOBE" "GLOBE" "515" "02"
 "SMART" "SMART" "515" "03"
 "SUN" "SUN" "515" "05"
 "TH 3G+" "TH 3G+" "520" "00"
 "AIS" "AIS" "520" "01"
 "AIS" "AIS" "520" "03"
 "TRUE-H" "TRUE-H" "520" "04"
 "dtac" "dtac" "520" "05"
 "TOT" "TOT" "520" "15"
 "DTAC" "DTAC" "520" "18"
 "TOT" "TOT" "520" "47"
 "TRUE-H" "TRUE-H" "520" "99"
 "Singtel" "Singtel" "525" "01"
 "Singtel" "Singtel" "525" "02"
 "M1" "M1" "525" "03"
 "StarHub" "StarHub" "525" "05"
 "CallZone" "CallZone" "525" "07"
 "StarHub" "StarHub" "525" "08"
 "TPG SG" "TPG SG" "525" "10"
 "DSTCom" "DSTCom" "528" "01"
 "PCSB" "PCSB" "528" "02"
 "DSTCom" "DSTCom" "528" "11"
 "voda NZ" "voda NZ" "530" "01"
 "Spark NZ" "Spark NZ" "530" "05"
 "2degrees" "2degrees" "530" "24"
 "bmobile" "bmobile" "537" "01"
 "TM" "TM" "537" "02"
 "DIGICEL" "DIGICEL" "537" "03"
 "U-CALL" "U-CALL" "539" "01"
 "Digicel" "Digicel" "539" "88"
 "Telekom" "Telekom" "540" "01"
 "bmobile" "bmobile" "540" "02"
 "SMILE" "SMILE" "541" "01"
 "Digicel" "Digicel" "541" "05"
 "VODAFONE" "VODAFONE" "542" "01"
 "DIGICEL" "DIGICEL" "542" "02"
 "Manuia" "Manuia" "543" "01"
 "BLUESKY" "BLUESKY" "544" "110"
 "Kiribati" "Kiribati" "545" "01"
 "MOBNCL" "MOBNCL" "546" "01"
 "VODAFONE" "VODAFONE" "547" "15"
 "VINI" "VINI" "547" "20"
 "KOKANET" "KOKANET" "548" "01"
 "DIGICEL" "DIGICEL" "549" "00"
 "Bluesky" "Bluesky" "549" "27"
 "FSM Tele" "FSM Tele" "550" "01"
 "PalauCel" "PalauCel" "552" "01"
 "PLWPMC" "PLWPMC" "552" "80"
 "PLWPMC" "PLWPMC" "552" "88"
 "TTOK" "TTOK" "554" "01"
 "Orange" "Orange" "602" "01"
 "voda EG" "voda EG" "602" "02"
 "Etisalat" "Etisalat" "602" "03"
 "we" "we" "602" "04"
 "Mobilis" "Mobilis" "603" "01"
 "Djezzy" "Djezzy" "603" "02"
 "Ooredoo" "Ooredoo" "603" "03"
 "Orange" "Orange" "604" "00"
 "IAM" "IAM" "604" "01"
 "inwi" "inwi" "604" "02"
 "OrangeTN" "OrangeTN" "605" "01"
 "TUNTEL" "TUNTEL" "605" "02"
 "TUNISIAN" "TUNISIAN" "605" "03"
 "Libyana" "Libyana" "606" "00"
 "Al Madar" "Al Madar" "606" "01"
 "GAMCEL" "GAMCEL" "607" "01"
 "AFRICELL" "AFRICELL" "607" "02"
 "GMCOMIUM" "GMCOMIUM" "607" "03"
 "QC" "QC" "607" "04"
 "OrangeSN" "OrangeSN" "608" "01"
 "SENTEL" "SENTEL" "608" "02"
 "Expresso" "Expresso" "608" "03"
 "MATTEL" "MATTEL" "609" "01"
 "EMR" "EMR" "609" "02"
 "MAURITEL" "MAURITEL" "609" "10"
 "MALITEL" "MALITEL" "610" "01"
 "OML" "OML" "610" "02"
 "TELECEL" "TELECEL" "610" "03"
 "ORANGEGN" "ORANGEGN" "611" "01"
 "LAGUI" "LAGUI" "611" "02"
 "GNAreeba" "GNAreeba" "611" "04"
 "Cellcom" "Cellcom" "611" "05"
 "MOOV" "MOOV" "612" "02"
 "Orange" "Orange" "612" "03"
 "KoZ" "KoZ" "612" "04"
 "MTN CI" "MTN CI" "612" "05"
 "ONATEL" "ONATEL" "613" "01"
 "Orange" "Orange" "613" "02"
 "Airtel" "Airtel" "614" "02"
 "ETISALAT" "ETISALAT" "614" "03"
 "Orange" "Orange" "614" "04"
 "TGCELL" "TGCELL" "615" "01"
 "ETISALAT" "ETISALAT" "615" "03"
 "ETISALAT" "ETISALAT" "616" "02"
 "MTNBENIN" "MTNBENIN" "616" "03"
 "my.t" "my.t" "617" "01"
 "MTML" "MTML" "617" "03"
 "EMTEL" "EMTEL" "617" "10"
 "LoneStar" "LoneStar" "618" "01"
 "Novafone" "Novafone" "618" "04"
 "Orange L" "Orange L" "618" "07"
 "OrangeSL" "OrangeSL" "619" "01"
 "Africell" "Africell" "619" "05"
 "MTN" "MTN" "620" "01"
 "Vodafone" "Vodafone" "620" "02"
 "ATL-TIGO" "ATL-TIGO" "620" "03"
 "ATL-TIGO" "ATL-TIGO" "620" "06"
 "GloGhana" "GloGhana" "620" "07"
 "Airtel" "Airtel" "621" "20"
 "MTN-NG" "MTN-NG" "621" "30"
 "ntel" "ntel" "621" "40"
 "glo" "glo" "621" "50"
 "9mobile" "9mobile" "621" "60"
 "Airtel" "Airtel" "622" "01"
 "Tigo" "Tigo" "622" "03"
 "ETISALAT" "ETISALAT" "623" "01"
 "Telecel" "Telecel" "623" "02"
 "Orange" "Orange" "623" "03"
 "MTN CAM" "MTN CAM" "624" "01"
 "Orange" "Orange" "624" "02"
 "Nexttel" "Nexttel" "624" "04"
 "CVMOVEL" "CVMOVEL" "625" "01"
 "UnitelT+" "UnitelT+" "625" "02"
 "CSTmovel" "CSTmovel" "626" "01"
 "Unitel" "Unitel" "626" "02"
 "GETESA" "GETESA" "627" "01"
 "Muni-GQ" "Muni-GQ" "627" "03"
 "LIBERTIS" "LIBERTIS" "628" "01"
 "ETISALAT" "ETISALAT" "628" "02"
 "Airtel" "Airtel" "628" "03"
 "AZUR" "AZUR" "628" "04"
 "Airtel" "Airtel" "629" "01"
 "Airtel" "Airtel" "629" "07"
 "MTN-CG" "MTN-CG" "629" "10"
 "VODACOM" "VODACOM" "630" "01"
 "Airtel" "Airtel" "630" "02"
 "Orange" "Orange" "630" "86"
 "TIGO" "TIGO" "630" "89"
 "AFRICELL" "AFRICELL" "630" "90"
 "UNITEL" "UNITEL" "631" "02"
 "AGOMV" "AGOMV" "631" "04"
 "MTN" "MTN" "632" "02"
 "OrangeGB" "OrangeGB" "632" "03"
 "C&W SEY" "C&W SEY" "633" "01"
 "Airtel" "Airtel" "633" "10"
 "Zain SD" "Zain SD" "634" "01"
 "MTN" "MTN" "634" "02"
 "MTN" "MTN" "635" "10"
 "TIGO RW" "TIGO RW" "635" "13"
 "Airtel" "Airtel" "635" "14"
 "ET-MTN" "ET-MTN" "636" "01"
 "Tele" "Tele" "637" "01"
 "Golis" "Golis" "637" "30"
 "Hormuud" "Hormuud" "637" "50"
 "EVATIS" "EVATIS" "638" "01"
 "SAF-COM" "SAF-COM" "639" "02"
 "Airtel" "Airtel" "639" "03"
 "yu" "yu" "639" "05"
 "Telkom" "Telkom" "639" "07"
 "FAIBA" "FAIBA" "639" "10"
 "TIGO" "TIGO" "640" "02"
 "ZANTEL" "ZANTEL" "640" "03"
 "VodaCom" "VodaCom" "640" "04"
 "Airtel" "Airtel" "640" "05"
 "Airtel" "Airtel" "641" "01"
 "TANG" "TANG" "641" "04"
 "MTN-UG" "MTN-UG" "641" "10"
 "UTL" "UTL" "641" "11"
 "AUL" "AUL" "641" "14"
 "suretel" "suretel" "641" "18"
 "Airtel" "Airtel" "641" "22"
 "EWB" "EWB" "642" "01"
 "ONATEL" "ONATEL" "642" "03"
 "SMART" "SMART" "642" "07"
 "BDITL" "BDITL" "642" "82"
 "mCel" "mCel" "643" "01"
 "MOVITEL" "MOVITEL" "643" "03"
 "VodaCom" "VodaCom" "643" "04"
 "Airtel" "Airtel" "645" "01"
 "MTN ZM" "MTN ZM" "645" "02"
 "ZAMTEL" "ZAMTEL" "645" "03"
 "Airtel" "Airtel" "646" "01"
 "Orange" "Orange" "646" "02"
 "TELMA" "TELMA" "646" "04"
 "Bip" "Bip" "646" "05"
 "Orange" "Orange" "647" "00"
 "MMOBILE" "MMOBILE" "647" "01"
 "TELCO OI" "TELCO OI" "647" "02"
 "FREE RE" "FREE RE" "647" "03"
 "ZEOP" "ZEOP" "647" "04"
 "NETONE" "NETONE" "648" "01"
 "TELECEL" "TELECEL" "648" "03"
 "ECONET" "ECONET" "648" "04"
 "MTCNAM" "MTCNAM" "649" "01"
 "tnmobile" "tnmobile" "649" "03"
 "TNM" "TNM" "650" "01"
 "Airtel" "Airtel" "650" "10"
 "VODACOM" "VODACOM" "651" "01"
 "ETL" "ETL" "651" "02"
 "MASCOM" "MASCOM" "652" "01"
 "Orange" "Orange" "652" "02"
 "beMOBILE" "beMOBILE" "652" "04"
 "Swazi Mo" "Swazi Mo" "653" "02"
 "SwaziMTN" "SwaziMTN" "653" "10"
 "HURI" "HURI" "654" "01"
 "COMTM" "COMTM" "654" "02"
 "Vodacom" "Vodacom" "655" "01"
 "Telkom" "Telkom" "655" "02"
 "Telkom" "Telkom" "655" "05"
 "Cell C" "Cell C" "655" "07"
 "MTN" "MTN" "655" "10"
 "rain" "rain" "655" "38"
 "Sure" "Sure" "658" "01"
 "MTN" "MTN" "659" "02"
 "ZAIN SS" "ZAIN SS" "659" "06"
 "BTL" "BTL" "702" "67"
 "Smart" "Smart" "702" "69"
 "CLAROGTM" "CLAROGTM" "704" "01"
 "TIGO" "TIGO" "704" "02"
 "CLAROGTM" "CLAROGTM" "704" "03"
 "ClaroSLV" "ClaroSLV" "706" "01"
 "DIGICEL" "DIGICEL" "706" "02"
 "Tigo" "Tigo" "706" "03"
 "Movistar" "Movistar" "706" "04"
 "ClaroHND" "ClaroHND" "708" "001"
 "TIGO" "TIGO" "708" "02"
 "HT - 200" "HT - 200" "708" "030"
 "DIGICEL" "DIGICEL" "708" "040"
 "ClaroNIC" "ClaroNIC" "710" "21"
 "Movistar" "Movistar" "710" "300"
 "ClaroNIC" "ClaroNIC" "710" "73"
 "I.C.E." "I.C.E." "712" "01"
 "I.C.E." "I.C.E." "712" "02"
 "CLARO CR" "CLARO CR" "712" "03"
 "Movistar" "Movistar" "712" "04"
 "PANCW" "PANCW" "714" "01"
 "Movistar" "Movistar" "714" "020"
 "CLARO PA" "CLARO PA" "714" "03"
 "DIGICEL" "DIGICEL" "714" "04"
 "MOVISTAR" "MOVISTAR" "716" "06"
 "ClaroPER" "ClaroPER" "716" "10"
 "VTP" "VTP" "716" "15"
 "Entel" "Entel" "716" "17"
 "TEFMVNO" "TEFMVNO" "722" "010"
 "Movistar" "Movistar" "722" "07"
 "CLARO AR" "CLARO AR" "722" "310"
 "AR TP" "AR TP" "722" "34"
 "AR TP" "AR TP" "722" "36"
 "TIM" "TIM" "724" "02"
 "TIM" "TIM" "724" "03"
 "TIM" "TIM" "724" "04"
 "Claro" "Claro" "724" "05"
 "VIVO" "VIVO" "724" "06"
 "VIVO" "VIVO" "724" "10"
 "VIVO" "VIVO" "724" "11"
 "SCTL" "SCTL" "724" "15"
 "Oi" "Oi" "724" "16"
 "VIVO" "VIVO" "724" "23"
 "Oi" "Oi" "724" "24"
 "Oi" "Oi" "724" "31"
 "Algar" "Algar" "724" "32"
 "Algar" "Algar" "724" "33"
 "Algar" "Algar" "724" "34"
 "Nextel" "Nextel" "724" "39"
 "ENTEL" "ENTEL" "730" "01"
 "Movistar" "Movistar" "730" "02"
 "ClaroCHL" "ClaroCHL" "730" "03"
 "Movistar" "Movistar" "730" "07"
 "WOM" "WOM" "730" "09"
 "ENTEL" "ENTEL" "730" "10"
 "Claro" "Claro" "732" "101"
 "TIGO" "TIGO" "732" "103"
 "TIGO" "TIGO" "732" "111"
 "Movistar" "Movistar" "732" "123"
 "Avantel" "Avantel" "732" "130"
 "ETB" "ETB" "732" "187"
 "DIGITEL" "DIGITEL" "734" "02"
 "Movistar" "Movistar" "734" "04"
 "Movilnet" "Movilnet" "734" "06"
 "VIVA" "VIVA" "736" "01"
 "EMOVIL" "EMOVIL" "736" "02"
 "TIGO" "TIGO" "736" "03"
 "GTT+" "GTT+" "738" "002"
 "Digicel" "Digicel" "738" "01"
 "Movistar" "Movistar" "740" "00"
 "CLARO" "CLARO" "740" "01"
 "CNT" "CNT" "740" "02"
 "HPGYSA" "HPGYSA" "744" "01"
 "CLARO PY" "CLARO PY" "744" "02"
 "TIGO" "TIGO" "744" "04"
 "Personal" "Personal" "744" "05"
 "TeleG" "TeleG" "746" "02"
 "DIGICEL" "DIGICEL" "746" "03"
 "Antel" "Antel" "748" "01"
 "Movistar" "Movistar" "748" "07"
 "CLARO UY" "CLARO UY" "748" "10"
 "Sure" "Sure" "750" "001"
 "Tele2" "Tele2" "777" "77"
 "Thuraya" "Thuraya" "901" "05"
 "INX" "INX" "901" "11"
 "TelenorM" "TelenorM" "901" "12"
 "AeroMob" "AeroMob" "901" "14"
 "OnAir" "OnAir" "901" "15"
 "Jasper" "Jasper" "901" "16"
 "AT&T" "AT&T" "901" "18"
 "MLTMA" "MLTMA" "901" "19"
 "TIM@sea" "TIM@sea" "901" "26"
 "voda MT" "voda MT" "901" "28"
 "Orange" "Orange" "901" "31"
 "MTX" "MTX" "901" "39"
 "TDG" "TDG" "901" "40"
 "AT&T" "AT&T" "901" "44"
 "AISatSea" "AISatSea" "901" "45"
 "T26" "T26" "901" "46"
 "EML" "EML" "901" "50"
 "Test Name" "Test Name" "999" "99"