{
  "version": "1.2",
  "materials": [
    {
      "name": "mat-0",
      "techniques": [
        {
          "name": "microfacet",
          "passes": [
            {
              "name": "microfacet",
              "depthTest": true,
              "blend": true,
              "depthWrite": false,
              "cullFace": false,
              "depthFunc": "DF_LEQUAL",
              "blend_src_factor": "BF_ONE",
              "blend_dst_factor": "BF_ONE_MINUS_SRC_ALPHA",
              "uniforms": {
			    "bonesMat": "BT_BONE_MATRIXES",
                "mvpMat": "BT_MODEL_VIEW_PROJECTION_MATRIX",
                "modelMat": "BT_MODEL_MATRIX",
                "normalMat": "BT_NORMAL_WORLD_MATRIX",
                "viewPos": "BT_CAMERA_WORLD_POS",
                "uOffset": 0,
                "vOffset": 0,
                "uvColumnNum": 1,
                "uvRowNum": 1,
                "ambient": [
                  0,
                  0,
                  0
                ],
                "ambientLight": [
                  0,
                  0,
                  0
                ],
                "diffuse": [
                  1,
                  1,
                  1
                ],
                "specular": [
                  1,
                  1,
                  1
                ],
                "ka": 1,
                "ke": 1,
                "ks": 0.05,
                "kd": 0.8,
                "kr": 3,
                "glossy": 0.3,
                "alpha": 1,
                "uOffset": 0,
                "vOffset": 0,
                "uvColumnNum": 1,
                "uvRowNum": 1,
                "envRotationX": 0,
                "envRotationY": 0,
                "diffuseMap": {
                  "type": "2d_texture",
                  "source": [
                    "diffuseMap4.png"
                  ],
                  "wrap": "WM_CLAMP",
                  "filter": "FM_LINEAR"
                }
              },
              "shaders": [
                {
                  "type": "VERTEX_SHADER",
                  "defination": ["USE_BONE_ANIMATION"],
                  "source": "amaz_render_test.vs"
                },
                {
                  "type": "FRAGMENT_SHADER",
                  "defination": [
                    "USE_DIFFUSE_MAP"
                  ],
                  "source": "amaz_render_test.fs"
                }
              ]
            }
          ]
        }
      ]
    }
  ]
}
