{
    "version": "1.0.0",
    "uid_name": "rebootsys",
    "rebootsys": {
        "VmReboot": [
            {
                "rule_prio":0,
                "featureid":"070100000",
                "EventInfoParam":{
                    "PNAME": "BasicParam.s_process",
                    "SIGMSG": "SignalParam.s_sigmsg:SignalParam.s_sicode",
                    "REASON": "BasicParam.s_reason",
                    "SYSVMTYPE": "BasicParam.s_sysvmtype",
                    "TRUSTSTACK": "MainCallTrace.s_trace"
                }
            }
        ],
        "VmWatchdog": [
            {
                "rule_prio":0,
                "featureid":"070100010",
                "EventInfoParam":{
                    "PNAME": "BasicParam.s_block_reason",
                    "SYSVMTYPE": "BasicParam.s_sysvmtype",
                    "TRUSTSTACK": "MainCallTrace.s_trace"
                }
            }
        ],
        "Panic": [
           {
                "rule_prio":0,
                "featureid":"040100020",
                "EventInfoParam":{
                    "PNAME": "HungtaskParam.s_taskName"
                }
            },
            {
                "rule_prio":1,
                "featureid":"040100021",
                "EventInfoParam":{
                    "F1NAME": "NocTrace.s_errcode+NocTrace.s_master+NocTrace.s_slave+NocTrace.s_address+NocTrace.s_user_signal+NocTrace.s_security",
                    "F3NAME": "BasicParam.s_noc",
                    "TRUSTSTACK": "MainCallTrace.s_trace"
                }
            },
            {
                "rule_prio":2,
                "featureid":"040100022",
                "EventInfoParam":{
                    "PNAME": "HungtaskParam.s_taskName"
                }
            },
            {
                "rule_prio":3,
                "featureid":"020100020",
                "EventInfoParam":{
                    "F1NAME": "BasicParam.s_f1",
                    "F2NAME": "BasicParam.s_f2",
                    "F3NAME": "BasicParam.s_f3",
                    "TRUSTSTACK": "MainCallTrace.s_trace"
                }
            },
            {
                "rule_prio":4,
                "featureid":"020100021",
                "EventInfoParam":{
                    "F1NAME": "BasicParam.s_f1",
                    "F2NAME": "BasicParam.s_f2",
                    "F3NAME": "BasicParam.s_f3",
                    "TRUSTSTACK": "MainCallTrace.s_trace"
                }
            },
            {
                "rule_prio":5,
                "featureid":"040100021",
                "EventInfoParam":{
                    "PNAME": "BasicParam.s_pname",
                    "F1NAME": "BasicParam.s_f1",
                    "F3NAME": "BasicParam.s_cause"
                }
            },
            {
                "rule_prio":5,
                "featureid":"010100020",
                "EventInfoParam":{
                    "PNAME": "BasicParam.s_pname",
                    "F1NAME": "BasicParam.s_f1",
                    "F2NAME": "BasicParam.s_f2",
                    "F3NAME": "BasicParam.s_f3"
                }
            }
        ],
        "ModemReboot": [
            {
                "rule_prio":0,
                "featureid":"040100090",
                "EventInfoParam":{
                    "F1NAME": "BasicParam.s_f1",
                    "F2NAME": "BasicParam.s_f2",
                    "F3NAME": "BasicParam.s_f3"
                }
            },
            {
                "rule_prio":1,
                "featureid":"040100091",
                "EventInfoParam":{
                    "TRUSTSTACK": "MainCallTrace.s_trace"
                }
            }
        ],
        "HwWatchdog": [
            {
                "rule_prio":0,
                "featureid":"040100030",
                "EventInfoParam":{
                    "PNAME": "BasicParam.s_pname",
                    "F1NAME": "BasicParam.s_f1",
                    "TRUSTSTACK": "MainCallTrace.s_trace"
                }
            }
        ],
        "HardwareFault": [
            {
                "rule_prio":0,
                "featureid":"040100050",
                "EventInfoParam":{
                    "F1NAME": "BasicParam.s_subType"
                }
            },
            {
                "rule_prio":1,
                "featureid":"040100051",
                "EventInfoParam":{
                    "F1NAME": "DdrcParam.s_master+DdrcParam.s_op+DdrcParam.s_subMaster+DdrcParam.s_port"
                }
            },
            {
                "rule_prio":2,
                "featureid":"020100050",
                "EventInfoParam":{
                    "F2NAME": "BasicParam.s_pg_sdn_sts0+BasicParam.s_pg_sdn_sts1",
                    "F3NAME": "BasicParam.s_oc_sdn_sts0+BasicParam.s_oc_sdn_sts1"
                }
            }
        ]
    }
}
