(ao3)^(yi4)^(xiao3)^(yi4)	小艺小艺
(ei1)^(shen1)^(sao3)^(yi1)^(sao3)	微信扫一扫
(ei1)^(shen1)^(sao3)^(yi2)^(sao3)	微信扫一扫
(ei1)^(shen1)^(sao4)^(yi1)^(sao3)	微信扫一扫
(ei1)^(shen1)^(sao4)^(yi2)^(sao3)	微信扫一扫
(ei1)^(shen1)^(zhi1)^(fu4)	微信支付
(ei1)^(xin4)^(sao3)^(yi1)^(sao3)	微信扫一扫
(ei1)^(xin4)^(sao3)^(yi2)^(sao3)	微信扫一扫
(ei1)^(xin4)^(sao4)^(yi1)^(sao3)	微信扫一扫
(ei1)^(xin4)^(sao4)^(yi2)^(sao3)	微信扫一扫
(ei1)^(xin4)^(zhi1)^(fu4)	微信支付
(ei2)^(shen1)^(sao3)^(yi1)^(sao3)	微信扫一扫
(ei2)^(shen1)^(sao3)^(yi2)^(sao3)	微信扫一扫
(ei2)^(shen1)^(sao4)^(yi1)^(sao3)	微信扫一扫
(ei2)^(shen1)^(sao4)^(yi2)^(sao3)	微信扫一扫
(ei2)^(shen1)^(zhi1)^(fu4)	微信支付
(ei2)^(xin4)^(sao3)^(yi1)^(sao3)	微信扫一扫
(ei2)^(xin4)^(sao3)^(yi2)^(sao3)	微信扫一扫
(ei2)^(xin4)^(sao4)^(yi1)^(sao3)	微信扫一扫
(ei2)^(xin4)^(sao4)^(yi2)^(sao3)	微信扫一扫
(ei2)^(xin4)^(zhi1)^(fu4)	微信支付
(ei3)^(shen1)^(sao3)^(yi1)^(sao3)	微信扫一扫
(ei3)^(shen1)^(sao3)^(yi2)^(sao3)	微信扫一扫
(ei3)^(shen1)^(sao4)^(yi1)^(sao3)	微信扫一扫
(ei3)^(shen1)^(sao4)^(yi2)^(sao3)	微信扫一扫
(ei3)^(shen1)^(zhi1)^(fu4)	微信支付
(ei3)^(xin4)^(sao3)^(yi1)^(sao3)	微信扫一扫
(ei3)^(xin4)^(sao3)^(yi2)^(sao3)	微信扫一扫
(ei3)^(xin4)^(sao4)^(yi1)^(sao3)	微信扫一扫
(ei3)^(xin4)^(sao4)^(yi2)^(sao3)	微信扫一扫
(ei3)^(xin4)^(zhi1)^(fu4)	微信支付
(ei4)^(shen1)^(sao3)^(yi1)^(sao3)	微信扫一扫
(ei4)^(shen1)^(sao3)^(yi2)^(sao3)	微信扫一扫
(ei4)^(shen1)^(sao4)^(yi1)^(sao3)	微信扫一扫
(ei4)^(shen1)^(sao4)^(yi2)^(sao3)	微信扫一扫
(ei4)^(shen1)^(zhi1)^(fu4)	微信支付
(ei4)^(xin4)^(sao3)^(yi1)^(sao3)	微信扫一扫
(ei4)^(xin4)^(sao3)^(yi2)^(sao3)	微信扫一扫
(ei4)^(xin4)^(sao4)^(yi1)^(sao3)	微信扫一扫
(ei4)^(xin4)^(sao4)^(yi2)^(sao3)	微信扫一扫
(ei4)^(xin4)^(zhi1)^(fu4)	微信支付
(fu4)^(bao3)^(sao3)^(yi1)^(sao3)	支付宝扫一扫
(fu4)^(bao3)^(sao3)^(yi1)^(sao4)	支付宝扫一扫
(fu4)^(bao3)^(sao3)^(yi2)^(sao3)	支付宝扫一扫
(fu4)^(bao3)^(sao3)^(yi2)^(sao4)	支付宝扫一扫
(fu4)^(bao3)^(sao4)^(yi1)^(sao3)	支付宝扫一扫
(fu4)^(bao3)^(sao4)^(yi1)^(sao4)	支付宝扫一扫
(fu4)^(bao3)^(sao4)^(yi2)^(sao3)	支付宝扫一扫
(fu4)^(bao3)^(sao4)^(yi2)^(sao4)	支付宝扫一扫
(fu4)^(bao3)^(zhi1)^(fu4)	支付宝支付
(hao3)^(you1)^(you1)	你好悠悠
(hao4)^(you1)^(you1)	你好悠悠
(ni3)^(hao3)^(you1)^(you1)	你好悠悠
(ni3)^(hao4)^(you1)^(you1)	你好悠悠
(ri4)^(fu4)^(bao3)^(sao3)^(yi1)^(sao3)	支付宝扫一扫
(ri4)^(fu4)^(bao3)^(sao3)^(yi1)^(sao4)	支付宝扫一扫
(ri4)^(fu4)^(bao3)^(sao3)^(yi2)^(sao3)	支付宝扫一扫
(ri4)^(fu4)^(bao3)^(sao3)^(yi2)^(sao4)	支付宝扫一扫
(ri4)^(fu4)^(bao3)^(sao4)^(yi1)^(sao3)	支付宝扫一扫
(ri4)^(fu4)^(bao3)^(sao4)^(yi1)^(sao4)	支付宝扫一扫
(ri4)^(fu4)^(bao3)^(sao4)^(yi2)^(sao3)	支付宝扫一扫
(ri4)^(fu4)^(bao3)^(sao4)^(yi2)^(sao4)	支付宝扫一扫
(ri4)^(fu4)^(bao3)^(zhi1)^(fu4)	支付宝支付
(shen1)^(sao3)^(yi1)^(sao3)	微信扫一扫
(shen1)^(sao3)^(yi1)^(sao4)	微信扫一扫
(shen1)^(sao3)^(yi2)^(sao3)	微信扫一扫
(shen1)^(sao3)^(yi2)^(sao4)	微信扫一扫
(shen1)^(sao4)^(yi1)^(sao3)	微信扫一扫
(shen1)^(sao4)^(yi1)^(sao4)	微信扫一扫
(shen1)^(sao4)^(yi2)^(sao3)	微信扫一扫
(shen1)^(sao4)^(yi2)^(sao4)	微信扫一扫
(shen1)^(zhi1)^(fu4)	微信支付
(wei1)^(shen1)^(sao3)^(yi1)^(sao3)	微信扫一扫
(wei1)^(shen1)^(sao3)^(yi1)^(sao4)	微信扫一扫
(wei1)^(shen1)^(sao3)^(yi2)^(sao3)	微信扫一扫
(wei1)^(shen1)^(sao3)^(yi2)^(sao4)	微信扫一扫
(wei1)^(shen1)^(sao4)^(yi1)^(sao3)	微信扫一扫
(wei1)^(shen1)^(sao4)^(yi1)^(sao4)	微信扫一扫
(wei1)^(shen1)^(sao4)^(yi2)^(sao3)	微信扫一扫
(wei1)^(shen1)^(sao4)^(yi2)^(sao4)	微信扫一扫
(wei1)^(shen1)^(zhi1)^(fu4)	微信支付
(wei1)^(xin4)^(sao3)^(yi1)^(sao3)	微信扫一扫
(wei1)^(xin4)^(sao3)^(yi1)^(sao4)	微信扫一扫
(wei1)^(xin4)^(sao3)^(yi2)^(sao3)	微信扫一扫
(wei1)^(xin4)^(sao3)^(yi2)^(sao4)	微信扫一扫
(wei1)^(xin4)^(sao4)^(yi1)^(sao3)	微信扫一扫
(wei1)^(xin4)^(sao4)^(yi1)^(sao4)	微信扫一扫
(wei1)^(xin4)^(sao4)^(yi2)^(sao3)	微信扫一扫
(wei1)^(xin4)^(sao4)^(yi2)^(sao4)	微信扫一扫
(wei1)^(xin4)^(zhi1)^(fu4)	微信支付
(xi1)^(shen1)^(sao3)^(yi1)^(sao3)	微信扫一扫
(xi1)^(shen1)^(sao3)^(yi2)^(sao3)	微信扫一扫
(xi1)^(shen1)^(sao4)^(yi1)^(sao3)	微信扫一扫
(xi1)^(shen1)^(sao4)^(yi2)^(sao3)	微信扫一扫
(xi1)^(shen1)^(zhi1)^(fu4)	微信支付
(xi1)^(xin4)^(sao3)^(yi1)^(sao3)	微信扫一扫
(xi1)^(xin4)^(sao3)^(yi2)^(sao3)	微信扫一扫
(xi1)^(xin4)^(sao4)^(yi1)^(sao3)	微信扫一扫
(xi1)^(xin4)^(sao4)^(yi2)^(sao3)	微信扫一扫
(xi1)^(xin4)^(zhi1)^(fu4)	微信支付
(xiao3)^(yi4)^(xiao3)^(yi4)	小艺小艺
(xin4)^(sao3)^(yi1)^(sao3)	微信扫一扫
(xin4)^(sao3)^(yi1)^(sao4)	微信扫一扫
(xin4)^(sao3)^(yi2)^(sao3)	微信扫一扫
(xin4)^(sao3)^(yi2)^(sao4)	微信扫一扫
(xin4)^(sao4)^(yi1)^(sao3)	微信扫一扫
(xin4)^(sao4)^(yi1)^(sao4)	微信扫一扫
(xin4)^(sao4)^(yi2)^(sao3)	微信扫一扫
(xin4)^(sao4)^(yi2)^(sao4)	微信扫一扫
(xin4)^(zhi1)^(fu4)	微信支付
(yao3)^(yi4)^(xiao3)^(yi4)	小艺小艺
(yi3)^(hao3)^(you1)^(you1)	你好悠悠
(yi3)^(hao4)^(you1)^(you1)	你好悠悠
(yi4)^(xiao3)^(yi4)	小艺小艺
(zhi1)^(fu4)^(bao3)^(sao3)^(yi1)^(sao3)	支付宝扫一扫
(zhi1)^(fu4)^(bao3)^(sao3)^(yi1)^(sao4)	支付宝扫一扫
(zhi1)^(fu4)^(bao3)^(sao3)^(yi2)^(sao3)	支付宝扫一扫
(zhi1)^(fu4)^(bao3)^(sao3)^(yi2)^(sao4)	支付宝扫一扫
(zhi1)^(fu4)^(bao3)^(sao4)^(yi1)^(sao3)	支付宝扫一扫
(zhi1)^(fu4)^(bao3)^(sao4)^(yi1)^(sao4)	支付宝扫一扫
(zhi1)^(fu4)^(bao3)^(sao4)^(yi2)^(sao3)	支付宝扫一扫
(zhi1)^(fu4)^(bao3)^(sao4)^(yi2)^(sao4)	支付宝扫一扫
(zhi1)^(fu4)^(bao3)^(zhi1)^(fu4)	支付宝支付
一个	一个
一几	一几
一定	一定
一条	一条
一组	一组
一起	一起
七七	七七
七日	七日
万	万
万	莫
万	陌
三九	三九
三围	三围
三年	三年
三级	三级
不	不
不	步
不及	不及
不同	不同
不听	不听
不够	不够
不如	不如
不对	不对
不得	不得
不愿	不愿
不接	不接
不清	不清
不爱	不爱
不睡	不睡
不许	不许
不该	不该
不靠	不靠
丑	丑
专业	专业
专卖	专卖
专用	专用
业	业
业	喝
东	东
东北	东北
丝	丝
丢	丢
两	两
两	俩
严	严
严	言
中央	中央
中心	中心
中考	中考
为啥	为啥
为我	为我
主	主
主	属
主义	主义
主人	主人
主席	主席
主持	主持
主流	主流
主演	主演
丽	丽
丽	利
丽	力
丽	离
丽	立
义乌	义乌
义乌	食物
之	之
之类	之类
之际	之际
乌	乌
乌	屋
乔	乔
乔	桥
乖	乖
九七	九七
九五	九五
九百	九百
也会	也会
也会	也快
也好	也好
也就	也就
也很	也很
也快	也会
也快	也快
也想	也想
也没	也没
也要	也要
习近平	习近平
乡	乡
乡	相
乡	箱
乡	香
书	书
书	叔
书	输
书店	书店
书记	书记
买票	买票
乱	乱
事件	事件
事吧	事吧
事成	事成
事我	事我
事都	事都
二七	二七
二五	二五
二六	二六
二百	二百
云	云
互	互
五七	五七
五三	五三
五六	五六
五十	五十
五四	五四
五天	五天
五日	五日
五百	五百
亚	亚
交	交
交	教
交流	交流
交通	交通
亦菲	亦菲
产品	产品
京	京
京	精
亲亲	亲亲
人不	人不
人也	人也
人人	人人
人们	人们
人体	人体
人员	人员
人呢	人呢
人多	人多
人心	人心
人民	人民
人睡	人睡
人睡	人说
人类	人类
人要	人要
人说	人睡
人说	人说
人都	人都
人间	人间
今儿	今儿
今天	今天
今日	今日
介意	介意
从	从
从事	从事
他不	他不
他们	他们
他在	他在
他在	她在
他看	他看
他说	他说
付款	付款
仙	仙
仙	先
仙	西安
代表	代表
以后	以后
们	们
价格	价格
价钱	价钱
任	任
任	认
份	份
份	分
份	滨
企业	企业
优惠	优惠
会不	会不
会儿	会儿
会吗	会吗
会在	会在
会很	会很
会来	会来
会玩	会玩
会用	会用
会让	会让
伞	伞
伤感	伤感
伦敦	伦敦
似	似
似	室
似	寺
似	式
似	试
位于	位于
住宿	住宿
体会	体会
体育	体育
体重	体重
何处	何处
何必	何必
作业	作业
作品	作品
作用	作用
你一个	你一个
你们	你们
你又	你又
你啊	你啊
你开	你开
你比	你比
你看	你看
你觉得	你觉得
你这	你这
你那	你那
佳	佳
佳	家
使	使
使	史
侦探	侦探
俄	俄
俄	哦
俄	额
俊杰	俊杰
俩	两
俩	俩
修改	修改
值	值
值	直
假如	假如
假日	假日
假期	假期
做到	做到
做呢	做呢
做过	做过
停止播放	停止播放
催眠	催眠
傻子	傻子
像我	像我
僵尸	僵尸
允许	允许
元	元
元	原
元	园
元	圆
元	媛
元	源
元旦	元旦
兆	兆
先	仙
先	先
先	西安
光	光
光明	光明
光棍	光棍
克	克
克	客
克力	克力
兔子	兔子
入	入
全	全
全球	全球
全部	全部
八五	八五
公	公
公	共
公	龚
公主	公主
公交	公交
公共	公共
公司	公司
公园	公园
公安	公安
公安	工厂
六九	六九
六分	六分
六十	六十
六日	六日
共	公
共	共
共	龚
共产	共产
关于	关于
关心	关心
关掉	关掉
关键	关键
关闭	关闭
其	其
其	奇
其实	其实
其实	几时
养	养
内容	内容
再过	再过
军	军
军事	军事
军训	军训
农历	农历
冬季	冬季
冰	冰
冰	并
冰冰	冰冰
决不	决不
决定	决定
决赛	决赛
冷	冷
冻	冻
准时	准时
准确	准确
凌晨	凌晨
减	减
减肥	减肥
几年	几年
几度	几度
几日	几日
几时	其实
几时	几时
几条	几条
几次	几次
几种	几种
几种	期中
凡	凡
分	份
分	分
分数	分数
切糕	切糕
切都	切都
刚从	刚从
刚刚	刚刚
初	初
初三	初三
初中	初中
删除	删除
利	丽
利	利
利	力
利	立
利亚	利亚
利用	利用
别说	别说
到来	到来
刺激	刺激
前	前
前台	前台
前面	前面
剧	剧
剧	句
副	副
副	富
副	屁
力	丽
力	利
力	力
力	立
办公	办公
功能	功能
加入	加入
动力	动力
动听	动听
动漫	动漫
助理	助理
勇士	勇士
勇气	勇气
十二	十二
十元	十元
十天	十天
十年	十年
十日	十日
千年	千年
千里	千里
升	升
升	生
升起	升起
午夜	午夜
半	半
卓	卓
卓	着
单位	单位
单机	单机
卖	卖
南	南
南	那
南昌	南昌
南站	南站
卫生	卫生
危害	危害
厉害	厉害
厕所	厕所
厘米	厘米
厚	厚
原	元
原	原
原	园
原	圆
原	媛
原	源
原则	原则
原来	原来
去做	去做
县	县
又没	又没
又没	有没
友谊	友谊
双节	双节
反	反
反正	反正
发来	发来
发言	发言
叔	书
叔	叔
叔	输
叔叔	叔叔
取消	取消
变成	变成
古	古
古代	古代
古诗	古诗
句	剧
句	句
另	另
只在	只在
只要	只要
叫他	叫他
叫做	叫做
可怕	可怕
可惜	可惜
史	使
史	史
司机	司机
各位	各位
各种	各种
合肥	合肥
合适	合适
吉林	吉林
同事	同事
同学	同学
同样	同样
名单	名单
名叫	名叫
名称	名称
后台	后台
后就	后就
后面	后面
吗	吗
吗	码
吧	吧
含	含
听听	听听
启动	启动
吹	吹
呃	呃
呃	饿
呆	呆
呆	待
员工	员工
周	周
周	粥
周五	周五
周六	周六
周围	周围
周年	周年
周日	周日
周星	周星
周边	周边
命	命
咋办	咋办
和谁	和谁
哇	哇
哈	哈
哈喽	哈喽
哦	俄
哦	哦
哦	额
唐诗	唐诗
售价	售价
唱吧	唱吧
商丘	商丘
商务	商务
商品	商品
商城	商城
啊	啊
啥	啥
喂	喂
喂	未
喊我	喊我
喜不	喜不
喝	业
喝	喝
喝多	喝多
喝醉	喝醉
喽	喽
嘻嘻	嘻嘻
四五	四五
四分	四分
四四	四四
四川	四川
四年	四年
四日	四日
四百	四百
四级	四级
团	团
园	元
园	原
园	园
园	圆
园	媛
园	源
国	国
国庆	国庆
国荣	国荣
国语	国语
圆	元
圆	原
圆	园
圆	圆
圆	媛
圆	源
土	土
在	在
地	地
地	得
地	的
地址	地址
地理	地理
地铁	地铁
地震	地震
场	场
坏人	坏人
坐	坐
坑	坑
块	块
型	型
城	城
城	成
城	盛
城	诚
培训	培训
基金	基金
堵车	堵车
复习	复习
复活	复活
外星	外星
夜班	夜班
大	大
大	待
大	戴
大概	大概
天可	天可
天天	天天
天来	天来
天水	天水
天河	天河
天涯	天涯
天然	天然
太不	太不
太冷	太冷
太多	太多
太笨	太笨
太累	太累
夫妻	夫妻
失眠	失眠
失败	失败
头	头
奇	其
奇	奇
奇迹	奇迹
套	套
女友	女友
女士	女士
女子	女子
女孩	女孩
女朋友	女朋友
女生	女生
她在	他在
她在	她在
如	如
如此	如此
妹子	妹子
姐姐	姐姐
姑娘	姑娘
姓	姓
姓	性
姓名	姓名
委屈	委屈
姨妈	姨妈
威	威
婚前	婚前
媛	元
媛	原
媛	园
媛	圆
媛	媛
媛	源
媛	远
嫉妒	嫉妒
子书	子书
子座	子座
子都	子都
孕妇	孕妇
字母	字母
存	存
存在	存在
季节	季节
孤单	孤单
学习	学习
学会	学会
学校	学校
宇	宇
宇	羽
宇宙	宇宙
安全	安全
宋词	宋词
完全	完全
完美	完美
实力	实力
实在	实在
实验	实验
宠物	宠物
客	克
客	客
客气	客气
客运	客运
室	似
室	室
室	式
室	试
家	佳
家	家
容易	容易
宽带	宽带
寂寞	寂寞
寄	寄
密码	密码
富	副
富	富
寝室	寝室
对我	对我
对面	对面
寺	似
寺	寺
寻找	寻找
小^V^小^V	小V小V
就像	就像
就在	就在
就够	就够
就得	就得
就想	就想
就来	就来
就没	就没
就算	就算
就能	就能
尽快	尽快
尾巴	尾巴
局	局
屁	副
屁	屁
居然	居然
屋	乌
屋	屋
属	主
属	属
属	数
属于	属于
山区	山区
山市	山市
山西	山西
岳阳	岳阳
峰	峰
峰	疯
川	川
工具	工具
工厂	公安
工厂	工厂
工程	工程
工资	工资
左右	左右
巧	巧
己	己
巴马	巴马
市区	市区
市场	市场
希	希
希	西
带来	带来
常州	常州
平平	平平
平方	平方
平洋	平洋
平顶	平顶
年级	年级
并	冰
并	并
并	病
并不	并不
幽默	幽默
广元	广元
店里	店里
康	康
式	似
式	室
式	式
式	试
张翰	张翰
张雨	张雨
当兵	当兵
当前	当前
形成	形成
彩	彩
往	往
往	网
待	呆
待	大
待	待
待	戴
很不	很不
很久	很久
很多	很多
很忙	很忙
徐州	徐州
得	地
得	得
得	的
得多	得多
心	心
心	新
心	欣
心中	心中
心如	心如
心疼	心疼
心都	心都
忍	忍
忍者	忍者
忙吗	忙吗
快快	快快
快捷	快捷
快递	快递
快速	快速
怕	怕
怕我	怕我
思考	思考
性	姓
性	性
性格	性格
怪	怪
总	总
总会	总会
总理	总理
总统	总统
恐龙	恐龙
恭喜	恭喜
悟空	悟空
情	情
情侣	情侣
情绪	情绪
惠	惠
惠	汇
想买	想买
想吃	想吃
想干	想干
想睡	想睡
想过	想过
惹	惹
愉快	愉快
愚人	愚人
感冒	感冒
感动	感动
懂	懂
懒	懒
成	城
成	成
成	盛
成	诚
成年	成年
成语	成语
成都	成都
我	我
我一会	我一会
我买	我买
我从	我从
我们就	我们就
我写	我写
我到	我到
我妈	我妈
我干	我干
我很	我很
我得	我得
我心	我心
我怕	我怕
我拿	我拿
我没	我没
我生	我生
我用	我用
我的爱	我的爱
我看	我看
我请	我请
战士	战士
戴	大
戴	待
戴	戴
户口	户口
房产	房产
所谓	所谓
才不	才不
打成	打成
扣	扣
扣扣	扣扣
扫描	扫描
扬州	扬州
批发	批发
承德	承德
承认	承认
把他	把他
抢	抢
抢	枪
抽烟	抽烟
拒绝	拒绝
招	招
招	着
拜托	拜托
拯救	拯救
挂	挂
指	指
指	纸
按	按
据说	据说
排骨	排骨
接到	接到
控制	控制
推荐	推荐
提前	提前
提高	提高
搬	搬
摄像	摄像
摩托	摩托
摸	摸
操作	操作
收	收
收入	收入
改成	改成
政局	政局
政策	政策
故	故
敏	敏
敏感	敏感
教	交
教	教
教	觉
教学	教学
数	属
数	数
数字	数字
敷衍	敷衍
文学	文学
文明	文明
文章	文章
断	断
新	心
新	新
新	欣
新加	新加
新娘	新娘
新婚	新婚
新年	新年
新的	新的
新闻	新闻
旅游	旅游
旅行	旅行
无敌	无敌
无论	无论
既然	既然
日	日
日元	日元
日前	日前
日文	日文
日期	日期
日来	日来
日程	日程
日记	日记
日语	日语
早晨	早晨
早睡	早睡
早起	早起
早饭	早饭
时	时
时	石
时尚	时尚
时就	时就
时间	时间
明日	明日
明明	明明
明星	明星
星级	星级
春	春
春节	春节
昨	昨
晓得	晓得
晕	晕
晕	运
普通	普通
晴天	晴天
智商	智商
暖	暖
暖文	暖文
更新	更新
曾	曾
替我	替我
最后	最后
最快	最快
最新	最新
最火	最火
最炫	最炫
最爱	最爱
最贵	最贵
有	有
有些	有些
有人	有人
有关	有关
有在	有在
有多	有多
有害	有害
有无	有无
有没	又没
有没	有没
有流	有流
有病	有病
有看	有看
有种	有种
有空	有空
有缘	有缘
有过	有过
有雨	有雨
服务	服务
服装	服装
朝阳	朝阳
期中	几种
期中	期中
期待	期待
期末	期末
期间	期间
木	木
木	莫
未	喂
未	未
未来	未来
本事	本事
本来	本来
朱	朱
朱	熟
朱	猪
朱	珠
机会	机会
机器	机器
机好	机好
机票	机票
机能	机能
机里	机里
杀	杀
杀	沙
李	李
李	理
李白	李白
材料	材料
条路	条路
来吃	来吃
来着	来着
来自	来自
杨幂	杨幂
杰	杰
杰	结
杰	觉
杰克	杰克
杰克	节课
松	松
板	板
果	果
枝花	枝花
枪	抢
枪	枪
某	某
柯南	柯南
柳	柳
柳州	柳州
柴油	柴油
校区	校区
校园	校园
样子	样子
样的	样的
根	根
格式	格式
桌	桌
桌面	桌面
桥	乔
桥	桥
梁静	梁静
梅	梅
梦想	梦想
检查	检查
植物	植物
欠	欠
欠费	欠费
次	次
欣	心
欣	新
欣	欣
欺负	欺负
正常	正常
此	此
步	不
步	步
步骤	步骤
武汉	武汉
死	死
死人	死人
每	每
每	美
每天	每天
比我	比我
比赛	比赛
毕业	毕业
毕竟	毕竟
毛球	毛球
民兵	民兵
气冷	气冷
气象	气象
水平	水平
永恒	永恒
永远	永远
求	求
汇	惠
汇	汇
江南	江南
汤圆	汤圆
汽	汽
汽油	汽油
汽车	汽车
沈	沈
沙	杀
沙	沙
没事	没事
没到	没到
没吃	没吃
没来	没来
河南	河南
油	油
油	邮
油性皮肤	油性皮肤
治疗	治疗
泉州	泉州
泡	泡
泪	泪
泰州	泰州
泽东	泽东
洋	洋
洋	羊
洋	阳
洋洋	洋洋
洗完	洗完
活	活
活动	活动
派	派
流氓	流氓
浏览	浏览
浙江	浙江
浩特	浩特
浪	浪
浪漫	浪漫
浪费	浪费
海口	海口
海阔	海阔
消息	消息
深圳	深圳
混	混
混蛋	混蛋
添加	添加
清理	清理
清除	清除
温	温
温度	温度
温暖	温暖
游记	游记
湖人	湖人
湘潭	湘潭
源	元
源	原
源	园
源	圆
源	媛
源	源
滋味	滋味
滚	滚
滚蛋	滚蛋
满	满
滨	份
滨	滨
演唱	演唱
漫游	漫游
激动	激动
火影	火影
火星	火星
火线	火线
灯	灯
灵	灵
炒	炒
炫	炫
烦恼	烦恼
然后	然后
熟	朱
熟	熟
熟悉	熟悉
燕子	燕子
爱人	爱人
爱我	爱我
父亲	父亲
父母	父母
爸	爸
牙	牙
牛奶	牛奶
牛肉	牛肉
牡丹	牡丹
物流	物流
特	特
特产	特产
特曼	特曼
状况	状况
狗狗	狗狗
狮	狮
猛烈	猛烈
猪	朱
猪	猪
猪	珠
猪头	猪头
猪猪	猪猪
玉	玉
玉	粥
玉	预
玩吧	玩吧
环境	环境
现在	现在
现场	现场
珠	朱
珠	猪
珠	珠
珠海	珠海
球队	球队
理	李
理	理
理我	理我
琴	琴
琴	秦
瑞	瑞
瓜	瓜
瓶子	瓶子
生	升
生	生
生产	生产
生人	生人
生气	生气
生病	生病
用卡	用卡
用我	用我
用手	用手
甲	甲
男友	男友
男女	男女
疯	峰
疯	疯
疼	疼
疼	腾
病	并
病	病
病毒	病毒
痛	痛
登陆	登陆
白痴	白痴
百度	百度
百科	百科
的	地
的	得
的	的
的心	的心
盐城	盐城
盘	盘
盛	城
盛	成
盛	盛
盛	诚
直	值
直	直
直接	直接
相	乡
相	相
相	箱
相	香
相关	相关
相片	相片
相遇	相遇
看一下	看一下
看书	看书
看来	看来
真实	真实
真心	真心
真正	真正
真的很	真的很
真诚	真诚
眼光	眼光
眼睛	眼睛
眼里	眼里
着	卓
着	招
着	着
着呢	着呢
着急	着急
睡吧	睡吧
睡着	睡着
瞎	瞎
石	时
石	石
石	蛋
码	吗
码	码
破	破
确实	确实
社	社
社	舍
社	设
祝您	祝您
祝福	祝福
福利	福利
离	丽
离	离
离我	离我
秀	秀
秋	秋
秋天	秋天
种人	种人
科学	科学
科技	科技
科比	科比
租	租
租车	租车
秦	琴
秦	秦
称呼	称呼
移动	移动
穷	穷
空	空
空间	空间
穿哪套	穿哪套
穿梭	穿梭
突然	突然
窗	窗
窝里	窝里
立	丽
立	利
立	力
立	立
站到	站到
竟然	竟然
章	章
章节	章节
笑	笑
笨	笨
笨蛋	笨蛋
第几	第几
第十	第十
第四	第四
等级	等级
算	算
管理	管理
箱	乡
箱	相
箱	箱
箱	香
篮球	篮球
米	米
类型	类型
粉	粉
粤语	粤语
粥	周
粥	玉
粥	粥
粥	预
精	京
精	精
精彩	精彩
精灵	精灵
精神	精神
糊涂	糊涂
糟	糟
系列	系列
素	素
索尼	索尼
纠结	纠结
红柿	红柿
约会	约会
纸	指
纸	纸
纽约	纽约
练习	练习
组	组
组织	组织
终极	终极
经历	经历
经过	经过
经验	经验
结	杰
结	结
结	觉
结果	结果
绝对	绝对
维修	维修
绵阳	绵阳
编码	编码
缘分	缘分
网	往
网	网
网吧	网吧
网游	网游
羊	洋
羊	羊
羊	阳
美	每
美	美
美元	美元
美国	美国
美图	美图
美容	美容
羽	宇
羽	羽
羽绒	羽绒
翅膀	翅膀
翻	翻
考	考
而	而
耍	耍
耳机	耳机
耽误	耽误
聊聊	聊聊
联播	联播
联通	联通
聚会	聚会
聪明	聪明
肚子	肚子
股份	股份
股票	股票
肯德	肯德
肺	肺
肺	费
胜利	胜利
胡	胡
胸罩	胸罩
胸部	胸部
能	能
能不	能不
能不	能否
能吃	能吃
能否	能不
能否	能否
能干	能干
能让	能让
脑	脑
脚	脚
脱	脱
脱掉	脱掉
脾气	脾气
腾	疼
腾	腾
自	自
自动	自动
自助	自助
自由	自由
自知	自知
自私	自私
至	至
至	致
致	至
致	致
舍	社
舍	舍
舍	设
舍得	舍得
舞	舞
良心	良心
色情	色情
色球	色球
节奏	节奏
节日	节日
节目	节目
节课	杰克
节课	节课
芜湖	芜湖
苍井	苍井
茶	茶
草	草
药	药
莫	万
莫	木
莫	莫
莫	陌
葡萄	葡萄
蓝	蓝
蓝牙	蓝牙
蓝色	蓝色
蘑菇	蘑菇
虹桥	虹桥
虽然	虽然
蛋	石
蛋	蛋
蛮	蛮
蜜	蜜
衣服	衣服
补偿	补偿
表	表
表白	表白
表示	表示
装	装
装备	装备
襄樊	襄樊
西	希
西	西
西南	西南
西安	仙
西安	先
西安	西安
西游	西游
西班	西班
西站	西站
西路	西路
要买	要买
要再	要再
要到	要到
要听	要听
要对	要对
要带	要带
要我	要我
要脸	要脸
要跟	要跟
见到	见到
见识	见识
见面	见面
观看	观看
规则	规则
视频	视频
觉	教
觉	杰
觉	结
觉	觉
觉觉	觉觉
解决	解决
言	严
言	言
计算	计算
订票	订票
订购	订购
认	任
认	认
认真	认真
讨厌	讨厌
讨论	讨论
让人	让人
让你	让你
记忆	记忆
许嵩	许嵩
设	社
设	舍
设	设
设定	设定
评价	评价
评论	评论
识别	识别
试	似
试	室
试	式
试	试
诚	城
诚	成
诚	盛
诚	诚
说不	说不
说些	说些
说他	说他
说呢	说呢
说对	说对
说明	说明
说错	说错
请假	请假
请我	请我
诺	诺
谁在	谁在
谁能	谁能
谈过	谈过
谱	谱
负责	负责
责任	责任
货	货
购买	购买
购物	购物
贵州	贵州
贵阳	贵阳
费	肺
费	费
资格	资格
赚钱	赚钱
赢	赢
赶紧	赶紧
起	起
趟	趟
足彩	足彩
足球	足球
距离	距离
跟他	跟他
跟着	跟着
路由	路由
跳舞	跳舞
蹲	蹲
身	身
身材	身材
身高	身高
躺	躺
躺在	躺在
车站	车站
轩	轩
轻	轻
轻松	轻松
输	书
输	叔
输	输
输入	输入
辽宁	辽宁
过我	过我
过节	过节
运	晕
运	运
运会	运会
还在	还在
还有	还有
还要	还要
这个	这个
这样	这样
进来	进来
远	媛
远	远
违章	违章
迷茫	迷茫
追求	追求
送	送
送到	送到
送我	送我
途	途
道为	道为
遵义	遵义
避孕	避孕
邓	邓
邓丽	邓丽
那	南
那	那
那不	那不
那个	那个
那也	那也
那就	那就
邮	油
邮	邮
邮局	邮局
邮编	邮编
郁闷	郁闷
郑	郑
部分	部分
郭	郭
都听	都听
都市	都市
都睡	都睡
鄙视	鄙视
酒	酒
酒吧	酒吧
酒泉	酒泉
酱油	酱油
里来	里来
重庆	重庆
重要	重要
野	野
金	金
金刚	金刚
金牛	金牛
针	针
钢琴	钢琴
铁	铁
错	错
错过	错过
长城	长城
长得	长得
长期	长期
长江	长江
长流	长流
长途	长途
门市	门市
门票	门票
问	问
问道	问道
闯	闯
阅兵	阅兵
阳	洋
阳	羊
阳	阳
陌	万
陌	莫
陌	陌
陕西	陕西
陪我	陪我
陪着	陪着
随	随
随时	随时
雅人	雅人
集合	集合
集团	集团
零三	零三
零五	零五
零四	零四
零零	零零
霆锋	霆锋
非常	非常
面	面
面子	面子
面对	面对
面积	面积
面试	面试
鞍山	鞍山
项目	项目
顺便	顺便
顾问	顾问
预	玉
预	粥
预	预
预报	预报
预防	预防
领	领
领导	领导
频道	频道
题	题
颜色	颜色
额	俄
额	哦
额	额
风流	风流
飞	飞
飞车	飞车
食品	食品
食物	义乌
食物	食物
餐馆	餐馆
饭馆	饭馆
饿	呃
饿	饿
香	乡
香	相
香	箱
香	香
香港	香港
香烟	香烟
香蕉	香蕉
驰	驰
驾驶	驾驶
骂	骂
骂人	骂人
验证	验证
骑士	骑士
骗	骗
骗人	骗人
骗子	骗子
骗我	骗我
高跟	高跟
鬼	鬼
魅力	魅力
魔女	魔女
鸡鸡	鸡鸡
麦当劳	麦当劳
黑色	黑色
鼻子	鼻子
鼻涕	鼻涕
龙岗	龙岗
龙江	龙江
龚	公
龚	共
龚	龚
