{
  "version": "1.2",
  "materials": [
    {
      "name": "mat-0",
      "techniques": [
        {
          "name": "microfacet",
          "passes": [
            {
              "name": "microfacet",
              "depthTest": false,
              "blend": true,
              "depthWrite": true,
              "cullFace": false,
              "depthFunc": "DF_LEQUAL",
              "blend_src_factor": "BF_SRC_ALPHA",
              "blend_dst_factor": "BF_ONE",
              "uniforms": {
                "mvpMat": "BT_MODEL_VIEW_PROJECTION_MATRIX",
                "diffuseMap": {
                  "type": "2d_texture",
                  "source": [
                    "fire1.png"
                  ],
                  "wrap": "WM_CLAMP",
                  "filter": "FM_LINEAR"
                }
              },
              "shaders": [
                {
                  "type": "VERTEX_SHADER",
                  "defination": [],
                  "source": "particle3.vs"
                },
                {
                  "type": "FRAGMENT_SHADER",
                  "defination": [],
                  "source": "particle3.fs"
                }
              ]
            }
          ]
        }
      ]
    }
  ]
}