{
    "tag": "3DScene_01_xmm",
    "version": "1.2",
	"needblend": false,
    "requirement": {},
    "content": {
        "light": [
                  {
                  "type": "point",
                  "pos": [
                          -30,
                          -330,
                          -500
                          ],
                  "direction": [
                                0,
                                0,
                                -1
                                ],
                  "color": [
                            1,
                            1,
                            1,
                            1
                            ],
                  "intensity": 0.5,
                  "attenuation_range": 0.5,
                  "attenuation_range_inverse": 2.3,
                  "shadow_enabled": true,
                  "shadow_resolution": [
                                        0.7,
                                        1.8
                                        ],
                  "shadow_bias": 1.7,
                  "shadow_strength": 1.8,
                  "shadow_softness": 1.9,
                  "use_soft_shadow": false
                  },
                  {
                  "type": "dir",
                  "pos": [
                          20,
                          20,
                          20
                          ],
                  "direction": [
                                0,
                                1,
                                1
                                ],
                  "color": [
                            1,
                            1,
                            1,
                            1
                            ],
                  "intensity": 0,
                  "attenuation_range": 0.5,
                  "attenuation_range_inverse": 2.3,
                  "shadow_enabled": true,
                  "shadow_resolution": [
                                        0.7,
                                        1.8
                                        ],
                  "shadow_bias": 1.7,
                  "shadow_strength": 1.8,
                  "shadow_softness": 1.9,
                  "use_soft_shadow": false,
                  "shadow_cascade_level_scale": [
                                                 3.1,
                                                 3.2,
                                                 3.3,
                                                 3.4
                                                 ],
                  "shadow_cascade_count": 100
                  },
                  {
                  "type": "spot",
                  "pos": [
                          20,
                          20,
                          20
                          ],
                  "direction": [
                                0,
                                0,
                                1
                                ],
                  "color": [
                            1,
                            1,
                            1,
                            1
                            ],
                  "intensity": 0,
                  "attenuation_range": 0.5,
                  "attenuation_range_inverse": 2.3,
                  "shadow_enabled": true,
                  "shadow_resolution": [
                                        0.7,
                                        1.8
                                        ],
                  "shadow_bias": 1.7,
                  "shadow_strength": 1.8,
                  "shadow_softness": 1.9,
                  "use_soft_shadow": false,
                  "inner_angle": 5,
                  "outer_angle": 10
                  }
                  ],
        "models": [

                   {
                   "id": 1,
                   "name": "sky",
                   "type": 2,
                   "attachType": 1,
                   "modelPath": "E12_3D_Scene_03/Headwear_mao/model.fbx",
                   "material": "E12_3D_Scene_03/Headwear_mao/material.mtl",
                   "modelType": 1,
                   "animations": [
                                  {
                                  "name": "UV-test",
                                  "type": "uv",
                                  "triggerDelay": 0,
                                  "count": 1,
                                  "columnNum": 1,
                                  "rowNum": 1,
                                  "duration": 5000,
                                  "triggerLoop": true,
                                  "triggerStop": true,
                                  "triggerType": 0,
                                  "textureInfo": {
                                    "textureSamplerName": "diffuseMap",
                                    "texturePathFormat": "E12_3D_Scene_03/Headwear_mao/sky%d.png",
                                    "textureNum": 1
                                  }

                                  }
                                ]
                   },
                   {
                   "id": 2,
                   "name": "skypart7",
                   "type": 2,
                   "attachType": 1,
                   "modelPath": "E12_3D_Scene_03/skypart7/model.fbx",
                   "material": "E12_3D_Scene_03/skypart7/material.mtl",
                   "modelType": 1,
                   "animations": [
                                  {
                                  "name": "UV-test",
                                  "type": "uv",
                                  "triggerDelay": 0,
                                  "count": 25,
                                  "columnNum": 5,
                                  "rowNum": 5,
                                  "duration": 3000,
                                  "triggerLoop": true,
                                  "triggerStop": true,
                                  "triggerType": 0
                                  }
                                  ]
                   },
                   {
                   "id": 3,
                   "name": "skypart8",
                   "type": 2,
                   "attachType": 1,
                   "modelPath": "E12_3D_Scene_03/skypart8/model.fbx",
                   "material": "E12_3D_Scene_03/skypart8/material.mtl",
                   "modelType": 1,
                   "animations": [{
                                  "name": "UV-test",
                                  "type": "uv",
                                  "triggerDelay": 0,
                                  "count": 25,
                                  "columnNum": 5,
                                  "rowNum": 5,
                                  "duration": 3000,
                                  "triggerLoop": true,
                                  "triggerStop": true,
                                  "triggerType": 0
                                  }
                                  ]
                   },
                   {
                   "id": 4,
                   "name": "skypart9",
                   "type": 2,
                   "attachType": 1,
                   "modelPath": "E12_3D_Scene_03/skypart9/model.fbx",
                   "material": "E12_3D_Scene_03/skypart9/material.mtl",
                   "modelType": 1,
                   "animations": [
                                  {
                                  "name": "UV-test",
                                  "type": "uv",
                                  "triggerDelay": 0,
                                  "count": 25,
                                  "columnNum": 5,
                                  "rowNum": 5,
                                  "duration": 3000,
                                  "triggerLoop": true,
                                  "triggerStop": true,
                                  "triggerType": 0
                                  },{
				"triggerDelay": 0,
				"triggerLoop": false,
				"triggerStop": true,
				"name": "Take 001",
				"type": "bone",
				"triggerType": 0
			}
                   ]
                   }
                   ],
        "particles": [
                      {
                      "id": 2,
                      "name": "particle3",
                      "attachType": 1,
                      "position": [
                                   -0.0003,
                                   -5.677,
                                   1.37
                                   ],
                      "rotation": [
                                   1,
                                   2,
                                   3,
                                   4
                                   ],
                      "textureBlockSize": 5,
                      "triggerType": 0,
                      "positionType": 4,
                      "enable": true,
                      "triggerStop": true,
                      "particlePath": "E12_3D_Scene_03/P_glod_a01_mao/particle3.particle",
                      "renderer": {
                      "type": "quat",
                      "material": "E12_3D_Scene_03/P_glod_a01_mao/particle3_material.mtl"
                      }
                      }
                      ]
    }
}
