{
  "parts" : {
    "rainy" : {
      "enable" : true,
      "blendMode" : 0,
      "scale" : {
        "scaleX" : {
          "pointB" : [
            {
              "index" : 107,
              "x" : 599.35390625000002,
              "y" : -0.65540540540559178
            }
          ],
          "pointA" : [
            {
              "index" : 106,
              "x" : 0,
              "y" : -0.65540540540559178
            }
          ]
        },
        "scaleY" : {
          "pointB" : [

          ],
          "pointA" : [

          ]
        }
      },
      "position" : {
        "positionY" : [

        ],
        "positionX" : [
          {
            "index" : 106,
            "x" : 0,
            "y" : -0.65540540540559178
          },
          {
            "index" : 107,
            "x" : 599.35390625000002,
            "y" : -0.65540540540559178
          }
        ]
      },
      "triggerDisappear" : false,
      "width" : 600,
      "positionType" : 1,
      "triggerDelay" : 0,
      "frameCount" : 38,
      "rotateCenter" : [
        {
          "index" : 46,
          "x" : 271.83887004852301,
          "y" : 440.42201471070968
        }
      ],
      "positionRelationType" : 1,
      "height" : 1067,
      "triggerType" : 0,
      "zPosition" : 1,
      "triggerStop" : false,
      "triggerLoop" : 0
    }
  },
  "version" : "1.1"
}