{
	"centerX" : 0.5,
	"centerY" : 0.5,
	"angle" : 0,
	"scale" : 1,
	"width" : 98,
	"height" : 121,
	"contents" : [{
			"type" : "image",
			"resource" : {
				"type" : "static",
				"path" : "res/line.png"
			},
			"centerX" : 0.5,
			"centerY" : 0.05,
			"width" : 98,
			"height" : 3,
			"angle" : 0,
			"zorder" : 1
		},
		{
            "type": "text",
            "centerX": 0.5,
            "centerY": 0.15,
            "width": 80,
            "height": 14,
            "angle": 0,
            "color": "#ffffffff",
            "isVertical": 0,
			"alignment": 0,
            "text": "{yyyy-MM}",
            "zorder": 2
        },{
			"type" : "image",
			"resource" : {
				"type" : "static",
				"path" : "res/line.png"
			},
			"centerX" : 0.5,
			"centerY" : 0.25,
			"width" : 98,
			"height" : 3,
			"angle" : 0,
			"zorder" : 1
		},{
            "type": "text",
            "centerX": 0.5,
            "centerY": 0.45,
            "width": 45,
            "height": 45,
            "angle": 0,
            "color": "#ffffffff",
            "isVertical": 0,
			"alignment": 0,
            "text": "{dd}",
            "zorder": 2
        },{
            "type": "text",
            "centerX": 0.5,
            "centerY": 0.75,
            "width": 60,
            "height": 13,
            "angle": 0,
            "color": "#ffffffff",
            "isVertical": 0,
			"alignment": 0,
            "text": "{a}",
            "zorder": 2
        },{
            "type": "text",
            "centerX": 0.5,
            "centerY": 0.85,
			"width": 60,
            "height": 13,
            "angle": 0,
            "color": "#ffffffff",
            "isVertical": 0,
			"alignment": 0,
            "text": "{hh:mm}",
            "zorder": 2
		},
		{
			"type" : "image",
			"resource" : {
				"type" : "static",
				"path" : "res/line.png"
			},
			"centerX" : 0.5,
			"centerY" : 0.95,
			"width" : 98,
			"height" : 3,
			"angle" : 0,
			"zorder" : 1
		}
	]
}
