#,version,,,,,,,,,,,,,
2019,8,13,1,,,,,,,,,,,
#,row_col_num,,,,,,,,,,,,,
33,15,,,,,,,,,,,,,
#,noise,,,,,,,,,,,,,
-350,350,,,,,,,,,,,,,
#,raw_max,,,,,,,,,,,,,
3694,5417,5447,5448,5418,5401,4899,3782,5290,5744,5749,5818,5845,5796,4773
5167,5525,5462,5464,5413,5421,5440,5299,5624,5639,5630,5682,5696,5747,5582
5356,5546,5477,5477,5425,5429,5464,5460,5625,5630,5627,5676,5688,5743,5647
5349,5531,5459,5464,5412,5416,5447,5451,5605,5614,5614,5665,5679,5727,5610
5333,5512,5442,5442,5395,5399,5432,5435,5588,5597,5600,5650,5662,5719,5576
5340,5521,5452,5457,5405,5410,5443,5446,5600,5608,5610,5660,5673,5724,5571
5358,5534,5463,5467,5417,5425,5457,5461,5618,5624,5624,5674,5687,5741,5576
5350,5528,5457,5465,5413,5420,5453,5457,5613,5621,5621,5676,5684,5735,5561
5342,5520,5447,5456,5403,5411,5443,5450,5605,5614,5615,5673,5676,5729,5546
5353,5529,5456,5466,5413,5419,5452,5457,5615,5627,5625,5674,5688,5739,5548
5351,5524,5452,5460,5406,5413,5447,5453,5613,5618,5623,5675,5685,5742,5537
5363,5534,5462,5470,5415,5421,5455,5461,5622,5630,5633,5685,5697,5750,5548
5390,5562,5487,5499,5443,5448,5482,5487,5655,5657,5662,5712,5726,5779,5563
5384,5558,5490,5493,5439,5444,5478,5483,5647,5655,5661,5711,5721,5774,5556
5395,5569,5494,5513,5453,5459,5493,5496,5666,5671,5677,5729,5739,5789,5562
5416,5588,5513,5533,5474,5481,5514,5517,5688,5696,5710,5753,5757,5813,5580
5429,5602,5526,5557,5490,5497,5533,5535,5709,5723,5722,5775,5774,5829,5594
5448,5624,5548,5582,5515,5530,5555,5559,5732,5744,5751,5801,5798,5854,5612
5444,5619,5543,5584,5516,5524,5559,5566,5741,5747,5757,5805,5800,5854,5609
5483,5660,5587,5648,5567,5575,5611,5613,5798,5806,5816,5862,5851,5908,5652
5486,5663,5591,5663,5577,5584,5620,5621,5810,5816,5827,5875,5859,5915,5660
5558,5747,5665,5784,5672,5686,5717,5719,5918,5926,5939,5984,5949,6004,5740
5520,5702,5623,5741,5631,5638,5676,5678,5874,5883,5895,5940,5907,5960,5698
5537,5715,5643,5788,5663,5670,5708,5708,5914,5919,5932,5978,5929,5982,5714
5615,5798,5722,5930,5777,5781,5818,5818,6032,6042,6055,6098,6024,6073,5797
5639,5820,5747,5998,5815,5825,5862,5862,6086,6092,6108,6150,6063,6107,5829
5639,5821,5747,6039,5835,5844,5891,5883,6112,6120,6136,6177,6074,6116,5833
5661,5842,5767,6103,5879,5888,5927,5933,6164,6174,6193,6234,6112,6153,5866
5652,5830,5754,6101,5870,5880,5923,5920,6161,6168,6189,6232,6113,6152,5868
5679,5864,5785,6182,5922,5933,5973,5972,6225,6231,6261,6299,6165,6204,5908
5699,5881,5804,6246,5960,5971,6009,6010,6278,6280,6303,6351,6211,6254,5957
5676,5905,5842,6345,6018,6029,6068,6068,6365,6353,6376,6421,6284,6331,6027
5081,6010,5981,6392,6080,6090,6119,6118,6408,6385,6401,6430,6414,6371,5468
#,raw_min,,,,,,,,,,,,,
1000,2102,2154,2170,2202,2228,2002,500,2223,2457,2559,2579,2617,2585,1000
1934,2205,2197,2200,2230,2273,2305,2244,2436,2449,2538,2558,2598,2622,2464
2074,2235,2223,2220,2249,2291,2346,2383,2469,2457,2546,2567,2606,2633,2532
2083,2232,2218,2215,2243,2283,2340,2390,2464,2450,2539,2559,2596,2627,2521
2079,2224,2211,2207,2233,2272,2330,2383,2456,2440,2529,2550,2589,2616,2501
2105,2251,2236,2233,2260,2299,2357,2411,2485,2469,2559,2581,2619,2646,2522
2126,2274,2259,2256,2283,2320,2379,2434,2506,2493,2584,2607,2644,2671,2539
2129,2278,2263,2260,2286,2324,2383,2437,2512,2496,2589,2613,2649,2678,2540
2159,2309,2296,2292,2318,2357,2416,2466,2545,2529,2622,2645,2683,2712,2568
2147,2296,2285,2282,2306,2345,2404,2456,2535,2521,2611,2634,2671,2701,2554
2190,2343,2330,2327,2355,2392,2452,2504,2585,2569,2661,2683,2723,2756,2602
2200,2356,2342,2338,2367,2406,2465,2517,2602,2583,2677,2699,2737,2768,2617
2207,2361,2350,2343,2372,2413,2473,2525,2613,2594,2688,2710,2748,2779,2624
2264,2419,2408,2399,2429,2469,2529,2582,2672,2653,2749,2771,2813,2846,2683
2288,2443,2432,2422,2452,2493,2553,2607,2697,2681,2776,2798,2846,2874,2712
2322,2478,2467,2455,2485,2525,2587,2640,2737,2716,2817,2836,2880,2914,2748
2353,2510,2499,2483,2516,2555,2617,2673,2771,2753,2848,2870,2918,2952,2780
2389,2545,2534,2510,2548,2591,2652,2705,2812,2785,2885,2907,2960,2995,2822
2424,2580,2568,2539,2578,2619,2682,2739,2842,2820,2919,2944,2996,3033,2858
2485,2644,2629,2591,2636,2677,2740,2795,2908,2883,2983,3010,3067,3103,2928
2532,2691,2675,2629,2677,2720,2784,2840,2958,2933,3034,3060,3121,3159,2978
2598,2763,2741,2669,2731,2777,2840,2895,3021,2993,3095,3124,3199,3238,3056
2655,2819,2801,2731,2791,2835,2900,2956,3089,3060,3163,3193,3268,3305,3121
2721,2884,2866,2783,2849,2895,2962,3019,3154,3129,3234,3264,3350,3386,3201
2792,2956,2937,2823,2908,2954,3023,3080,3228,3197,3306,3338,3439,3479,3293
2854,3019,2999,2877,2964,3011,3081,3139,3294,3265,3374,3409,3518,3556,3369
2958,3126,3104,2975,3068,3119,3191,3246,3415,3382,3493,3529,3645,3682,3492
3031,3202,3181,3052,3145,3195,3265,3330,3505,3469,3581,3618,3739,3775,3582
3077,3249,3230,3106,3197,3248,3317,3379,3563,3526,3640,3677,3797,3833,3646
3170,3344,3322,3216,3300,3353,3428,3487,3682,3648,3766,3798,3913,3951,3752
3267,3438,3415,3338,3411,3465,3543,3600,3806,3773,3889,3924,4025,4063,3853
3328,3535,3515,3486,3543,3600,3680,3738,3971,3929,4049,4086,4166,4204,3977
2927,3629,3635,3613,3666,3719,3796,3842,4075,4030,4139,4157,4268,4238,3525
#,raw_row_delta_max,,,,,,,,,,,,,
2000,517,441,440,425,446,867,2000,707,373,361,357,351,425,2000
563,437,432,432,429,428,450,567,444,423,428,427,425,428,486
390,391,387,395,392,390,391,404,399,398,401,404,402,401,384
374,379,381,383,383,382,386,388,391,389,392,394,394,397,375
410,421,418,426,420,422,424,426,433,432,433,436,435,434,417
406,412,410,413,414,416,418,418,428,425,425,428,427,428,412
388,397,396,403,401,402,404,404,410,411,413,416,411,414,400
481,493,491,497,492,496,499,500,510,508,513,516,512,516,498
477,487,485,491,488,491,494,494,504,507,505,503,507,509,492
497,507,504,510,508,509,514,516,526,523,529,532,532,539,515
406,414,412,419,414,415,416,418,426,425,427,429,428,427,422
492,504,500,506,501,503,508,509,525,520,523,525,525,528,506
509,522,522,524,519,521,524,526,537,538,543,545,544,549,530
412,420,412,426,419,422,424,424,434,434,436,437,439,438,424
427,434,431,438,433,435,437,437,448,448,456,452,446,453,438
424,434,431,442,435,435,438,439,450,455,447,455,452,455,440
430,439,436,443,438,445,442,443,456,450,459,460,459,464,448
412,420,418,425,420,418,425,429,437,437,440,441,439,441,428
459,470,467,485,472,474,477,475,494,492,496,498,495,498,483
432,439,437,450,441,441,446,446,459,459,463,465,462,465,452
562,583,572,612,586,593,594,596,619,617,624,626,613,616,596
505,513,512,545,526,524,532,534,551,550,555,558,546,546,533
458,461,462,494,471,476,479,481,496,496,499,501,493,494,483
566,582,578,640,606,605,610,612,637,636,642,646,622,626,609
451,460,457,513,472,477,480,483,501,500,506,510,492,492,479
468,479,472,531,500,502,509,506,527,526,530,533,513,514,499
454,469,462,541,493,495,494,506,524,522,528,530,501,504,486
425,433,432,503,459,460,465,461,483,481,487,491,466,465,458
467,480,473,575,521,524,528,528,552,552,562,562,522,527,503
556,568,564,713,633,637,640,642,677,672,674,682,625,630,603
432,483,487,628,551,553,556,560,604,590,599,602,557,555,529
-75,521,551,602,555,551,548,543,559,548,541,525,565,486,-69
#,raw_row_delta_min,,,,,,,,,,,,,
449,-307,-384,-393,-403,-381,-24,476,-160,-486,-501,-513,-520,-437,115
-233,-386,-390,-399,-398,-402,-385,-267,-411,-425,-423,-424,-424,-421,-352
-388,-410,-411,-413,-410,-411,-414,-406,-423,-420,-421,-422,-420,-423,-432
-394,-405,-405,-413,-409,-410,-412,-412,-417,-417,-416,-419,-418,-416,-429
-378,-385,-383,-385,-384,-385,-387,-388,-391,-390,-393,-395,-394,-399,-401
-367,-377,-376,-380,-378,-379,-381,-380,-388,-386,-386,-388,-387,-386,-391
-393,-399,-398,-401,-402,-403,-405,-405,-409,-411,-411,-407,-410,-413,-413
-460,-470,-469,-473,-470,-473,-476,-477,-485,-482,-486,-487,-486,-487,-485
-478,-490,-487,-492,-489,-494,-497,-497,-505,-502,-505,-513,-507,-511,-504
-455,-466,-463,-471,-467,-469,-471,-472,-478,-483,-480,-483,-483,-480,-478
-385,-392,-391,-398,-393,-393,-395,-397,-400,-399,-401,-403,-401,-408,-396
-458,-470,-466,-472,-467,-470,-472,-475,-480,-483,-484,-486,-485,-489,-485
-458,-469,-461,-474,-468,-468,-472,-474,-485,-480,-483,-485,-484,-486,-478
-377,-384,-385,-384,-381,-383,-384,-386,-390,-390,-391,-392,-388,-394,-389
-373,-381,-377,-385,-379,-381,-383,-382,-387,-388,-383,-390,-394,-390,-383
-380,-389,-386,-390,-388,-388,-389,-390,-395,-391,-404,-399,-397,-400,-393
-375,-382,-379,-391,-382,-378,-385,-387,-392,-397,-393,-396,-393,-396,-389
-382,-390,-388,-394,-388,-395,-390,-389,-397,-398,-400,-401,-401,-402,-395
-358,-365,-362,-368,-363,-365,-367,-372,-371,-371,-372,-374,-372,-375,-370
-382,-389,-387,-398,-389,-389,-392,-394,-398,-398,-401,-402,-400,-403,-395
-424,-426,-431,-451,-437,-435,-442,-443,-447,-448,-452,-453,-445,-447,-438
-486,-502,-495,-526,-507,-513,-512,-514,-527,-527,-530,-532,-519,-523,-511
-374,-383,-377,-395,-381,-383,-385,-388,-391,-391,-392,-393,-390,-392,-386
-417,-428,-428,-457,-433,-436,-439,-441,-446,-444,-448,-451,-438,-442,-434
-364,-374,-369,-391,-379,-377,-378,-379,-380,-382,-384,-387,-374,-380,-372
-364,-371,-368,-394,-375,-374,-371,-378,-381,-381,-383,-386,-375,-379,-372
-359,-373,-365,-398,-373,-375,-383,-373,-381,-381,-383,-384,-369,-373,-363
-389,-398,-397,-451,-416,-415,-418,-425,-429,-429,-430,-434,-407,-408,-392
-347,-352,-351,-384,-365,-366,-367,-368,-369,-367,-365,-373,-356,-358,-356
-439,-457,-451,-527,-485,-486,-489,-491,-501,-498,-509,-505,-466,-467,-454
-394,-361,-349,-381,-361,-360,-360,-363,-351,-361,-366,-370,-343,-338,-335
-1500,-323,-292,-428,-369,-373,-381,-389,-412,-415,-427,-444,-333,-412,-1500
#,raw_col_delta_max,,,,,,,,,,,,,
2500,612,596,593,593,313,52,2500,995,663,637,628,557,14,
893,537,583,580,609,617,499,850,603,648,626,614,631,448,
749,533,577,578,605,634,601,705,589,645,622,615,636,505,
737,529,580,574,603,633,610,688,586,645,622,614,632,489,
736,531,583,577,603,632,613,690,585,646,620,612,635,472,
737,529,586,574,605,634,613,691,583,645,620,611,631,461,
735,535,579,575,605,636,613,690,585,647,622,612,634,453,
733,537,578,574,613,640,616,695,587,648,625,608,634,443,
734,535,580,580,615,633,609,690,584,646,624,606,633,435,
737,533,582,575,601,633,611,691,586,645,619,610,634,432,
735,530,582,574,601,634,611,694,583,648,618,609,636,422,
727,528,577,575,602,633,610,695,586,652,622,613,633,421,
729,529,579,576,602,634,611,702,577,650,620,612,634,414,
730,528,573,576,600,632,610,700,582,651,619,611,635,408,
737,526,581,575,602,634,610,702,582,651,620,616,631,405,
740,529,582,577,607,636,609,704,581,658,613,610,635,402,
736,526,586,583,617,638,614,709,587,649,621,611,638,400,
733,528,582,584,614,632,614,710,582,655,620,613,637,397,
731,531,597,588,613,640,615,709,581,656,620,613,638,392,
735,526,599,591,644,654,613,722,581,657,621,619,641,388,
734,526,605,587,624,643,611,732,583,661,621,616,639,387,
744,525,638,591,619,651,616,744,581,665,623,621,643,385,
737,528,633,591,617,648,615,737,582,666,624,625,650,387,
743,520,649,597,613,650,614,754,588,670,631,636,645,393,
738,526,702,609,610,648,634,758,586,671,632,641,641,378,
740,528,735,608,610,647,620,762,589,677,626,646,637,377,
748,515,778,619,611,667,615,776,595,679,628,656,637,375,
740,521,818,616,620,651,625,798,591,685,629,657,636,369,
747,523,825,611,615,651,628,795,589,690,631,661,636,378,
746,520,885,608,616,651,619,798,589,693,627,663,638,366,
750,520,926,599,621,659,629,815,586,692,633,656,645,363,
790,533,991,588,622,656,623,845,575,702,638,632,650,351,
1500,564,912,586,620,652,616,840,573,705,625,681,564,-100,
#,raw_col_delta_min,,,,,,,,,,,,,
345,-570,-581,-586,-589,-1032,-2500,168,-323,-554,-550,-559,-632,-2500,
-309,-648,-582,-598,-562,-564,-697,-368,-587,-566,-553,-557,-553,-758,
-438,-655,-587,-598,-563,-539,-568,-487,-607,-557,-552,-559,-551,-690,
-448,-654,-584,-596,-564,-540,-557,-490,-604,-555,-550,-558,-550,-700,
-451,-654,-593,-592,-565,-539,-558,-494,-605,-551,-548,-557,-547,-717,
-445,-660,-590,-594,-567,-541,-557,-493,-603,-551,-547,-556,-550,-724,
-447,-661,-585,-594,-565,-542,-555,-490,-604,-553,-549,-557,-552,-737,
-447,-661,-580,-596,-574,-546,-559,-493,-607,-553,-545,-559,-551,-742,
-447,-661,-582,-603,-574,-539,-552,-487,-603,-549,-543,-559,-548,-750,
-452,-657,-582,-599,-561,-539,-555,-486,-600,-554,-547,-555,-549,-759,
-448,-654,-584,-596,-563,-538,-554,-484,-605,-548,-544,-555,-543,-769,
-440,-652,-581,-596,-561,-538,-553,-481,-609,-552,-549,-558,-546,-763,
-442,-654,-582,-597,-562,-537,-555,-478,-607,-549,-547,-557,-547,-776,
-441,-646,-586,-595,-559,-536,-553,-476,-605,-549,-546,-554,-545,-780,
-447,-653,-580,-599,-560,-537,-554,-474,-605,-549,-546,-553,-550,-786,
-451,-655,-582,-600,-566,-538,-553,-470,-606,-541,-552,-555,-544,-790,
-447,-653,-580,-609,-577,-539,-557,-469,-602,-554,-546,-558,-546,-796,
-441,-657,-581,-606,-563,-543,-558,-464,-608,-547,-547,-557,-544,-802,
-439,-659,-596,-608,-570,-540,-552,-464,-610,-546,-547,-560,-544,-803,
-440,-655,-589,-618,-601,-554,-556,-459,-610,-545,-547,-565,-546,-809,
-446,-656,-593,-615,-582,-536,-555,-461,-613,-547,-547,-562,-542,-813,
-437,-666,-609,-630,-570,-551,-558,-455,-613,-550,-548,-571,-547,-820,
-441,-661,-603,-630,-572,-543,-556,-444,-616,-548,-548,-573,-558,-824,
-436,-663,-609,-641,-568,-541,-557,-451,-622,-551,-554,-586,-555,-836,
-436,-665,-635,-659,-567,-540,-577,-434,-621,-548,-554,-598,-553,-827,
-437,-666,-638,-685,-559,-539,-561,-423,-625,-549,-548,-606,-554,-831,
-431,-669,-654,-706,-557,-548,-568,-421,-630,-549,-551,-624,-558,-836,
-442,-667,-653,-725,-567,-539,-557,-433,-628,-550,-549,-636,-559,-837,
-441,-665,-644,-726,-560,-539,-572,-411,-631,-548,-551,-638,-561,-837,
-435,-665,-640,-756,-557,-536,-560,-393,-629,-540,-557,-660,-560,-847,
-433,-666,-613,-779,-560,-543,-571,-385,-629,-546,-552,-673,-565,-857,
-399,-666,-573,-819,-557,-536,-564,-361,-643,-554,-556,-670,-566,-867,
140,-636,-569,-808,-561,-542,-567,-362,-655,-574,-577,-580,-637,-1500,
