{
    "priority_install": [
        "Framework-common",
        "Framework-manager",
        "Framework-runtime",
        "Framework-ui",
        "Framework-privacy",
        "Framework-kitstore",
        "Framework-webapp"
    ],
    "kits": [
        {
            "version_code": "50001302",
            "kit_type": "app",
            "kit_name": "realname",
            "api_level": "1",
            "pkg_name": "com.huawei.hms.realname",
            "apk_name": "RealName-core.apk",
            "minSdkVersion": "19",
            "kit_lib": "armeabi-v7a,arm64-v8a",
            "dependencies": "hmscore,1;huawei_module_dynamicloader,8",
            "main_entry": "com.huawei.hms.realname.MainEntry"
        },
        {
            "version_code": "60400305",
            "kit_type": "sdk",
            "kit_name": "huawei_module_huaweimaps",
            "api_level": "14",
            "pkg_name": "com.huawei.hms.maps.provider.huawei",
            "apk_name": "Map-HuaweiProvider.apk",
            "minSdkVersion": "19",
            "kit_loader": "huawei_module_huaweimaps:huawei_module_dynamicloader",
            "kit_lib": "armeabi-v7a,arm64-v8a",
            "dependencies": "hmscore,1;huawei_module_dynamicloader,8;location,1",
            "main_entry": ""
        },
        {
            "version_code": "60400305",
            "kit_type": "app;loader",
            "kit_name": "huawei_route_maps;huawei_module_maps",
            "api_level": "14;14",
            "pkg_name": "com.huawei.hms.maps.maproute",
            "apk_name": "Map-Route.apk",
            "minSdkVersion": "19",
            "kit_lib": "armeabi-v7a,arm64-v8a",
            "dependencies": "hmscore,1;huawei_module_dynamicloader,8",
            "main_entry": "com.huawei.hms.maps.maproute.hmsclient.MainEntry;"
        },
        {
            "version_code": "30500303",
            "kit_type": "sdk",
            "kit_name": "huawei_module_mlkit_ocr",
            "api_level": "5",
            "pkg_name": "com.huawei.hms.mlkit.ocr",
            "apk_name": "ML-ocr.apk",
            "minSdkVersion": "19",
            "kit_lib": "armeabi-v7a,arm64-v8a",
            "dependencies": "huawei_module_dynamicloader,8;hmscore,1",
            "main_entry": ""
        },
        {
            "version_code": "60400323",
            "kit_type": "app",
            "kit_name": "nearby",
            "api_level": "128",
            "pkg_name": "com.huawei.hms.nearby",
            "apk_name": "Nearby.apk",
            "minSdkVersion": "21",
            "kit_lib": "armeabi-v7a,arm64-v8a",
            "dependencies": "huawei_module_networkkit,8;fwcom-grs,1;fwcom-util,7;fwui,7;hmscore,10;huawei_module_dynamicloader,6;runtime,23;kpms,12;measurement,1;kams,11;apptouch,3",
            "main_entry": "com.huawei.hms.nearby.MainEntry"
        },
        {
            "version_code": "50002309",
            "kit_type": "app;sdk",
            "kit_name": "panorama;huawei_module_panorama",
            "api_level": "8;8",
            "pkg_name": "com.huawei.hms.panorama",
            "apk_name": "Panorama.apk",
            "minSdkVersion": "19",
            "dependencies": "fwcom-grs,1;fwcom-util,10;fwui,7;huawei_module_dynamicloader,8;hmscore,14;kpms,14;runtime,25;kams,13",
            "main_entry": "com.huawei.hms.panorama.MainEntry;"
        },
        {
            "version_code": "60300310",
            "kit_type": "app",
            "kit_name": "findnetwork",
            "api_level": "5",
            "pkg_name": "com.huawei.hms.findnetwork",
            "apk_name": "FindNetwork.apk",
            "minSdkVersion": "21",
            "kit_lib": "armeabi-v7a,arm64-v8a",
            "dependencies": "hmscore,10;runtime,19;location,1;nearby,125;measurement,1",
            "main_entry": "com.huawei.hms.findnetwork.MainEntry"
        }
    ]
}