{
    "imports" : [
		"/system/lib/libhwfilter_mtk.so"
	],
	
    "filters" :
    [
        {
            "id" : "ppsource",
            "type" : "ppsource",
            "captureTotal" : 3
        },

        {
            "id" : "encoder",
            "type" : "mtk_filter_jpeg"
        },
		
		{
            "id" : "writer",
            "type" : "filewriter"
        },
        
        {
            "id" : "hdr",
            "type" : "HDR"
        },

        {
            "id" : "thumbnail",
            "type" : "quickthumbnail"
        },

        {
            "id" : "notifier",
            "type" : "thumbnail-notifier"
        },
		
        {
            "id" : "peek",
            "type" : "peek"
        },

        {
            "id" : "Davinci",
            "type" : "Davinci"
        },

        {
            "id" : "peekMeta",
            "type" : "peek"
        }
    ],

    "connections" :
    [
        {
            "from" :
            {
                "filter" : "ppsource",
                "port" : "out0"
            },

            "to" :
            {
                "filter" : "hdr",
                "port" : "inMain"
            }
        },

        {
            "from" :
            {
                "filter" : "hdr",
                "port" : "OutDestyuv"
            },

            "to" :
            {
                "filter" : "Davinci",
                "port" : "inMain"
            }
        },

        {
            "from" :
            {
                "filter" : "Davinci",
                "port" : "OutDestyuv"
            },

            "to" :
            {
                "filter" : "encoder",
                "port" : "inMain"
            }
        },

		{
			"from" :
            {
                "filter" : "encoder",
                "port" : "jpeg"
            },

            "to" :
            {
                "filter" : "writer",
                "port" : "in"
            }
	    },

        {
            "from" :
            {
                "filter" : "hdr",
                "port" : "OutQuickThumbnailyuv"
            },

            "to" :
            {
                "filter" : "thumbnail",
                "port" : "inMain"
            }
        },
		
		{
            "from" :
            {
                "filter" : "thumbnail",
                "port" : "outThumbnail"
            },

            "to" :
            {
                "filter" : "notifier",
                "port" : "in"
            }
        },
	
        {
            "from" :
            {
                "filter" : "ppsource",
                "port" : "out_meta"
            },
			
	    "to" :
            {
                "filter" : "peekMeta",
                "port" : "in"
            }
	},

	{
	    "from" :
            {
                "filter" : "peekMeta",
                "port" : "out"
            },

            "to" :
            {
                "filter" : "hdr",
                "port" : "inMeta"
            }
        },

        {
            "from" :
            {
                "filter" : "hdr",
                "port" : "OutMeta"
            },

            "to" :
            {
                "filter" : "Davinci",
                "port" : "inMeta"
            }
        },

        {
            "from" :
            {
                "filter" : "Davinci",
                "port" : "OutMeta"
            },

           "to" :
           {
                "filter" : "encoder",
                "port" : "inMeta"
           }
        },

	{
            "from" :
            {
                "filter" : "peekMeta",
                "port" : "peek0"
            },

            "to" :
            {
                "filter" : "thumbnail",
                "port" : "inMeta"
            }
        }
    ]
}

