{
    "version": "1.0.0",
    "delay" : 10,
    "schedule_time" : 10,
    "sensor" : {
        "name": "system_h",
        "accuracy": 1
    },
    "temp_level" : {
        "comments" : "low_threshold, high_threshold, hysteresis_value, unit is millicentigrade",
        "table" : [
            [41000, 42000, 2000],
            [42000, 43000, 2000],
            [43000, 44000, 1000],
            [44000, 45000, 1000],
            [45000, 46000, 1000],
            [46000, 47000, 1000],
            [47000, 53000, 1000],
            [53000, 99000, 2000]
        ]
    },
    "current_limit" : {
        "comments" : "scale1, scale2, scale3, scale4, scale5, scale6, scale7, scale8",
        "ucurrent" : {
            "channel" : 0,
            "prefix" : "dcp ",
            "limit" : [1500, 1200,1080, 1080, 900,900,500,100]
        },
       "wlcurrent_5v" : {
            "channel" : 0,
            "prefix" : "dcp 2#",
            "limit" : [0,0,0,1200, 1200, 1000, 1000, 300]
        },
        "wlcurrent_9v" : {
            "channel" : 0,
            "prefix" : "dcp 3#",
            "limit": [0,0,0,1200, 1200, 700, 700, 200]
        },
        "wlcurrent_sc" : {
            "channel" : 0,
            "prefix" : "wl_sc 0#",
            "limit" : [0,0,0,2200, 1800, 1300, 1000, 600]
        },
        "direct_charger" : {
            "channel" : 1,
            "prefix" : "lvc ",
            "limit": [ 4000,3600,3200, 2600, 2000, 2000, 1500, 1500]
        },
        "direct_charger_sc" : {
            "channel" : 0,
            "prefix" : "sc 0#",
            "limit": [7000, 5200, 4500,3000, 2000, 2000, 1500, 1500]
        }
    },
    "su_version": "1.0.0",
    "su_delay" : 1,
    "su_current_limit" : {
        "comments" : "hota, normal",
        "wcurrent_5v" : {
            "channel" : 0,
            "prefix" : "dcp 0#",
            "limit" : [900, 1300]
        },
        "wcurrent_9v" : {
            "channel" : 0,
            "prefix" : "dcp 1#",
            "limit": [900, 1300]
        },
        "direct_charger" : {
            "channel" : 1,
            "prefix" : "lvc ",
            "limit": [1500, 1500]
        },
        "direct_charger_sc" : {
            "channel" : 0,
            "prefix" : "sc 0#",
            "limit": [1500, 1500]
        },
        "direct_charger_duo_sc" : {
            "channel" : 0,
            "prefix" : "sc 1#",
            "limit": [1500, 1500]
        }

    }
}
