{
    "asset": {
        "generator": "FBX2glTF",
        "version": "2.0"
    },
    "scene": 0,
    "buffers": [
        {
            "byteLength": 190196,
            "uri": "buffer.bin"
        }
    ],
    "bufferViews": [
        {
            "buffer": 0,
            "byteLength": 772,
            "byteOffset": 0
        },
        {
            "buffer": 0,
            "byteLength": 2316,
            "byteOffset": 772
        },
        {
            "buffer": 0,
            "byteLength": 3088,
            "byteOffset": 3088
        },
        {
            "buffer": 0,
            "byteLength": 2316,
            "byteOffset": 6176
        },
        {
            "buffer": 0,
            "byteLength": 3088,
            "byteOffset": 8492
        },
        {
            "buffer": 0,
            "byteLength": 2316,
            "byteOffset": 11580
        },
        {
            "buffer": 0,
            "byteLength": 3088,
            "byteOffset": 13896
        },
        {
            "buffer": 0,
            "byteLength": 2316,
            "byteOffset": 16984
        },
        {
            "buffer": 0,
            "byteLength": 2316,
            "byteOffset": 19300
        },
        {
            "buffer": 0,
            "byteLength": 3088,
            "byteOffset": 21616
        },
        {
            "buffer": 0,
            "byteLength": 2316,
            "byteOffset": 24704
        },
        {
            "buffer": 0,
            "byteLength": 4398,
            "byteOffset": 27020,
            "target": 34963
        },
        {
            "buffer": 0,
            "byteLength": 26388,
            "byteOffset": 31420,
            "target": 34962
        },
        {
            "buffer": 0,
            "byteLength": 26388,
            "byteOffset": 57808,
            "target": 34962
        },
        {
            "buffer": 0,
            "byteLength": 35184,
            "byteOffset": 84196,
            "target": 34962
        },
        {
            "buffer": 0,
            "byteLength": 17592,
            "byteOffset": 119380,
            "target": 34962
        },
        {
            "buffer": 0,
            "byteLength": 17592,
            "byteOffset": 136972,
            "target": 34962
        },
        {
            "buffer": 0,
            "byteLength": 35184,
            "byteOffset": 154564,
            "target": 34962
        },
        {
            "buffer": 0,
            "byteLength": 448,
            "byteOffset": 189748
        }
    ],
    "scenes": [
        {
            "name": "Root Scene",
            "nodes": [
                0
            ]
        }
    ],
    "accessors": [
        {
            "componentType": 5126,
            "type": "SCALAR",
            "count": 193,
            "bufferView": 0,
            "byteOffset": 0,
            "min": [
                0.0
            ],
            "max": [
                8.0
            ]
        },
        {
            "componentType": 5126,
            "type": "VEC3",
            "count": 193,
            "bufferView": 1,
            "byteOffset": 0
        },
        {
            "componentType": 5126,
            "type": "VEC4",
            "count": 193,
            "bufferView": 2,
            "byteOffset": 0
        },
        {
            "componentType": 5126,
            "type": "VEC3",
            "count": 193,
            "bufferView": 3,
            "byteOffset": 0
        },
        {
            "componentType": 5126,
            "type": "VEC4",
            "count": 193,
            "bufferView": 4,
            "byteOffset": 0
        },
        {
            "componentType": 5126,
            "type": "VEC3",
            "count": 193,
            "bufferView": 5,
            "byteOffset": 0
        },
        {
            "componentType": 5126,
            "type": "VEC4",
            "count": 193,
            "bufferView": 6,
            "byteOffset": 0
        },
        {
            "componentType": 5126,
            "type": "VEC3",
            "count": 193,
            "bufferView": 7,
            "byteOffset": 0
        },
        {
            "componentType": 5126,
            "type": "VEC3",
            "count": 193,
            "bufferView": 8,
            "byteOffset": 0
        },
        {
            "componentType": 5126,
            "type": "VEC4",
            "count": 193,
            "bufferView": 9,
            "byteOffset": 0
        },
        {
            "componentType": 5126,
            "type": "VEC3",
            "count": 193,
            "bufferView": 10,
            "byteOffset": 0
        },
        {
            "componentType": 5123,
            "type": "SCALAR",
            "count": 2199,
            "bufferView": 11,
            "byteOffset": 0
        },
        {
            "componentType": 5126,
            "type": "VEC3",
            "count": 2199,
            "bufferView": 12,
            "byteOffset": 0,
            "min": [
                -9.30288791656494,
                -9.57998085021973,
                -13.8225193023682
            ],
            "max": [
                8.99650192260742,
                8.54734325408936,
                12.8156967163086
            ]
        },
        {
            "componentType": 5126,
            "type": "VEC3",
            "count": 2199,
            "bufferView": 13,
            "byteOffset": 0
        },
        {
            "componentType": 5126,
            "type": "VEC4",
            "count": 2199,
            "bufferView": 14,
            "byteOffset": 0
        },
        {
            "componentType": 5126,
            "type": "VEC2",
            "count": 2199,
            "bufferView": 15,
            "byteOffset": 0
        },
        {
            "componentType": 5123,
            "type": "VEC4",
            "count": 2199,
            "bufferView": 16,
            "byteOffset": 0
        },
        {
            "componentType": 5126,
            "type": "VEC4",
            "count": 2199,
            "bufferView": 17,
            "byteOffset": 0
        },
        {
            "componentType": 5126,
            "type": "MAT4",
            "count": 7,
            "bufferView": 18,
            "byteOffset": 0
        }
    ],
    "images": [
        {
            "name": "Map #2137835585",
            "uri": "Hair.png"
        }
    ],
    "samplers": [
        {}
    ],
    "textures": [
        {
            "name": "Map #2137835585",
            "sampler": 0,
            "source": 0
        }
    ],
    "materials": [
        {
            "name": "Material #2",
            "alphaMode": "OPAQUE",
            "pbrMetallicRoughness": {
                "baseColorTexture": {
                    "index": 0,
                    "texCoord": 0
                },
                "baseColorFactor": [
                    1.0,
                    1.0,
                    1.0,
                    1.0
                ],
                "metallicFactor": 0.400000005960464,
                "roughnessFactor": 0.600000023841858
            }
        }
    ],
    "meshes": [
        {
            "name": "HAIR_W01",
            "primitives": [
                {
                    "material": 0,
                    "mode": 4,
                    "attributes": {
                        "JOINTS_0": 16,
                        "NORMAL": 13,
                        "POSITION": 12,
                        "TANGENT": 14,
                        "TEXCOORD_0": 15,
                        "WEIGHTS_0": 17
                    },
                    "indices": 11
                }
            ]
        }
    ],
    "skins": [
        {
            "joints": [
                3,
                8,
                5,
                6,
                9,
                4,
                7
            ],
            "inverseBindMatrices": 18,
            "skeleton": 3
        }
    ],
    "animations": [
        {
            "name": "Take 001",
            "channels": [
                {
                    "sampler": 0,
                    "target": {
                        "node": 2,
                        "path": "translation"
                    }
                },
                {
                    "sampler": 1,
                    "target": {
                        "node": 2,
                        "path": "rotation"
                    }
                },
                {
                    "sampler": 2,
                    "target": {
                        "node": 3,
                        "path": "translation"
                    }
                },
                {
                    "sampler": 3,
                    "target": {
                        "node": 4,
                        "path": "rotation"
                    }
                },
                {
                    "sampler": 4,
                    "target": {
                        "node": 5,
                        "path": "translation"
                    }
                },
                {
                    "sampler": 5,
                    "target": {
                        "node": 6,
                        "path": "rotation"
                    }
                },
                {
                    "sampler": 6,
                    "target": {
                        "node": 7,
                        "path": "translation"
                    }
                },
                {
                    "sampler": 7,
                    "target": {
                        "node": 8,
                        "path": "translation"
                    }
                },
                {
                    "sampler": 8,
                    "target": {
                        "node": 8,
                        "path": "rotation"
                    }
                },
                {
                    "sampler": 9,
                    "target": {
                        "node": 9,
                        "path": "translation"
                    }
                }
            ],
            "samplers": [
                {
                    "input": 0,
                    "interpolation": "LINEAR",
                    "output": 1
                },
                {
                    "input": 0,
                    "interpolation": "LINEAR",
                    "output": 2
                },
                {
                    "input": 0,
                    "interpolation": "LINEAR",
                    "output": 3
                },
                {
                    "input": 0,
                    "interpolation": "LINEAR",
                    "output": 4
                },
                {
                    "input": 0,
                    "interpolation": "LINEAR",
                    "output": 5
                },
                {
                    "input": 0,
                    "interpolation": "LINEAR",
                    "output": 6
                },
                {
                    "input": 0,
                    "interpolation": "LINEAR",
                    "output": 7
                },
                {
                    "input": 0,
                    "interpolation": "LINEAR",
                    "output": 8
                },
                {
                    "input": 0,
                    "interpolation": "LINEAR",
                    "output": 9
                },
                {
                    "input": 0,
                    "interpolation": "LINEAR",
                    "output": 10
                }
            ]
        }
    ],
    "nodes": [
        {
            "name": "RootNode",
            "translation": [
                0.0,
                0.0,
                0.0
            ],
            "rotation": [
                0.0,
                0.0,
                0.0,
                1.0
            ],
            "scale": [
                1.0,
                1.0,
                1.0
            ],
            "children": [
                1,
                2
            ]
        },
        {
            "name": "HAIR_W01",
            "translation": [
                0.00104017555713654,
                1.52361130714417,
                0.00326333753764629
            ],
            "rotation": [
                -0.70710676908493,
                -0.0,
                0.0,
                0.70710676908493
            ],
            "scale": [
                0.00999999977648258,
                0.00999999977648258,
                0.00999999977648258
            ],
            "mesh": 0,
            "skin": 0
        },
        {
            "name": "Dummy001",
            "translation": [
                0.00128823285922408,
                1.53854465484619,
                0.0325345695018768
            ],
            "rotation": [
                0.0205529797822237,
                -0.0375393256545067,
                0.00354641838930547,
                0.999077498912811
            ],
            "scale": [
                0.00999999977648258,
                0.00999999977648258,
                0.00999999977648258
            ],
            "children": [
                3,
                4,
                6,
                8
            ]
        },
        {
            "name": "HairRoot",
            "translation": [
                -2.38418579101563e-07,
                0.0,
                -4.76837158203125e-07
            ],
            "rotation": [
                3.68840358255795e-09,
                1.8867051920779e-08,
                -2.30525321054387e-10,
                1.0
            ],
            "scale": [
                1.01000070571899,
                1.01000070571899,
                1.01000022888184
            ]
        },
        {
            "name": "joint41",
            "translation": [
                7.38123893737793,
                -7.89053344726563,
                -0.0120091438293457
            ],
            "rotation": [
                -0.515966415405273,
                0.727743566036224,
                0.259282290935516,
                -0.370054841041565
            ],
            "scale": [
                1.01000082492828,
                1.01000070571899,
                1.01000082492828
            ],
            "children": [
                5
            ]
        },
        {
            "name": "joint42",
            "translation": [
                8.32745361328125,
                -1.1444091796875e-05,
                -9.5367431640625e-07
            ],
            "rotation": [
                -0.515408635139465,
                0.729729473590851,
                0.259192526340485,
                0.366971492767334
            ],
            "scale": [
                1.0,
                1.00000071525574,
                1.00000047683716
            ]
        },
        {
            "name": "joint43",
            "translation": [
                -1.19209289550781e-06,
                -7.89047241210938,
                -8.60202026367188
            ],
            "rotation": [
                0.426875293254852,
                -0.565419495105743,
                -0.425237715244293,
                0.563250541687012
            ],
            "scale": [
                1.01000082492828,
                1.00999987125397,
                1.01000106334686
            ],
            "children": [
                7
            ]
        },
        {
            "name": "joint44",
            "translation": [
                8.16023254394531,
                1.9073486328125e-06,
                1.19209289550781e-07
            ],
            "rotation": [
                -0.426869511604309,
                0.565423905849457,
                0.42523193359375,
                0.563254833221436
            ],
            "scale": [
                1.00000011920929,
                1.00000059604645,
                1.00000059604645
            ]
        },
        {
            "name": "joint45",
            "translation": [
                -7.18694162368774,
                -7.89047241210938,
                -0.0120105743408203
            ],
            "rotation": [
                0.315104275941849,
                -0.459278464317322,
                -0.47717410326004,
                0.679762840270996
            ],
            "scale": [
                1.01000034809113,
                1.00999999046326,
                1.01000022888184
            ],
            "children": [
                9
            ]
        },
        {
            "name": "joint46",
            "translation": [
                8.31707763671875,
                1.9073486328125e-05,
                -2.38418579101563e-06
            ],
            "rotation": [
                -0.263785421848297,
                0.372086048126221,
                0.514684557914734,
                0.725995182991028
            ],
            "scale": [
                1.0,
                1.0,
                0.999999821186066
            ]
        }
    ]
}