{
    "systemCapability":[
        {
            "name":"SystemCapability.Communication.Bluetooth",
            "register-on-startup":true
        },
        {
            "name":"SystemCapability.Communication.WiFi",
            "register-on-startup":true
        },
        {
            "name":"SystemCapability.Communication.NFC",
            "register-on-startup":true
        },
        {
            "name":"SystemCapability.ACE.UIEngine",
            "register-on-startup":true
        },
        {
            "name":"SystemCapability.Dms.Samgr",
            "register-on-startup":true
        },
        {
            "name":"SystemCapability.Dms.Fwk",
            "register-on-startup":true
        },
        {
            "name":"SystemCapability.Dms.Safwk",
            "register-on-startup":true
        },
        {
            "name":"SystemCapability.Foundation.Server",
            "register-on-startup":true
        },
        {
            "name":"SystemCapability.Data.DistributedDataMgr",
            "register-on-startup":true
        },
        {
            "name":"SystemCapability.Data.AppDataMgr",
            "register-on-startup":true
        },
        {
            "name":"SystemCapability.Data.Search",
            "register-on-startup":true
        },
        {
            "name":"SystemCapability.Developtools.Bytrace",
            "register-on-startup":true
        },
        {
            "name":"SystemCapability.Ressched.BackgroundTaskMgr",
            "register-on-startup":true
        },
        {
            "name":"SystemCapability.Ressched.WorkScheduler",
            "register-on-startup":true
        },
        {
            "name":"SystemCapability.Ressched.StorageInfo",
            "register-on-startup":true
        },
        {
            "name":"SystemCapability.Ressched.BundleActive",
            "register-on-startup":true
        },
        {
            "name":"SystemCapability.Ressched.Schedule",
            "register-on-startup":true
        },
        {
            "name":"SystemCapability.Ivi",
            "register-on-startup":false
        },
        {
            "name":"SystemCapability.Ivi.DrivingSafety",
            "register-on-startup":false
        },
        {
            "name":"SystemCapability.Ivi.VehicleControl",
            "register-on-startup":false
        },
        {
            "name":"SystemCapability.Ivi.ADAS",
            "register-on-startup":false
        },
        {
            "name":"SystemCapability.Ivi.TBOX",
            "register-on-startup":false
        },
        {
            "name":"SystemCapability.Ivi.Cluster",
            "register-on-startup":false
        },
        {
            "name":"SystemCapability.Usb.UsbManager",
            "register-on-startup":true
        },
        {
            "name":"SystemCapability.Aafwk.AbilityJet",
            "register-on-startup":true
        },
        {
            "name":"SystemCapability.Aafwk.Ability",
            "register-on-startup":true
        },
        {
            "name":"SystemCapability.Aafwk.Intent",
            "register-on-startup":true
        },
        {
            "name":"SystemCapability.Sensors.Sensor",
            "register-on-startup":true
        },
        {
            "name":"SystemCapability.Sensors.MiscDevice",
            "register-on-startup":true
        },
        {
            "name":"SystemCapability.HiviewDFX.HiLog",
            "register-on-startup":true
        },
        {
            "name":"SystemCapability.HiviewDFX.HiTrace",
            "register-on-startup":true
        },
        {
            "name":"SystemCapability.Input.MultimodalInput",
            "register-on-startup":true
        },
        {
            "name":"SystemCapability.PowerMgr.BatteryManager",
            "register-on-startup":true
        },
        {
            "name":"SystemCapability.PowerMgr.PowerManager",
            "register-on-startup":true
        },
        {
            "name":"SystemCapability.Security.Huks",
            "register-on-startup":true
        },
        {
            "name":"SystemCapability.PowerMgr.ThermalListener",
            "register-on-startup":true
        },
        {
            "name":"SystemCapability.PowerMgr.BatteryStatistics",
            "register-on-startup":true
        },
        {
            "name":"SystemCapability.Account.AppAccount",
            "register-on-startup":true
        },
        {
            "name":"SystemCapability.Security.DeviceAuth.P2PAuth",
            "register-on-startup":true
        },
        {
            "name":"SystemCapability.Account.OsAccount",
            "register-on-startup":true
        },
        {
            "name":"SystemCapability.Startup.SysInfo",
            "register-on-startup":true
        },
        {
            "name":"SystemCapability.Startup.Restore",
            "register-on-startup":true
        },
        {
            "name":"SystemCapability.Multimedia.Media",
            "register-on-startup":true
        },
        {
            "name":"SystemCapability.Multimedia.MediaLibrary",
            "register-on-startup":true
        },
        {
            "name":"SystemCapability.Communication.NetManager",
            "register-on-startup":true
        },
        {
            "name":"SystemCapability.Telephony.Telephony",
            "register-on-startup":false
        },
        {
            "name":"SystemCapability.Telephony.DCall",
            "register-on-startup":false
        },
        {
            "name":"SystemCapability.Multimedia.FMRadio",
            "register-on-startup":false
        },
        {
            "name":"SystemCapability.Multimedia.Audio",
            "register-on-startup":true
        },
        {
            "name":"SystemCapability.Multimedia.Camera",
            "register-on-startup":true
        },
        {
            "name":"SystemCapability.Multimedia.Image",
            "register-on-startup":true
        },
        {
            "name":"SystemCapability.Security.Eid",
            "register-on-startup":true
        },
        {
            "name":"SystemCapability.Security.SeOperator",
            "register-on-startup":true
        },
        {
            "name":"SystemCapability.Security.DeviceAuth.AccountAuth",
            "register-on-startup":true
        },
        {
            "name":"SystemCapability.Accessibility.Ability",
            "register-on-startup":true
        },
        {
            "name":"SystemCapability.Security.Asset",
            "register-on-startup":true
        },
        {
            "name":"SystemCapability.UserIAM.UserAuth.FaceAuth",
            "register-on-startup":true
        },
        {
            "name":"SystemCapability.UserIAM.UserAuth.BiometricAuth",
            "register-on-startup":true
        },
        {
            "name":"SystemCapability.Tv.dtv",
            "register-on-startup":false
        },
        {
            "name":"SystemCapability.Tv.middleware",
            "register-on-startup":false
        },
        {
            "name":"SystemCapability.Security.Permission",
            "register-on-startup":true
        },
        {
            "name":"SystemCapability.Security.NetworkSecurityPolicy",
            "register-on-startup":true
        },
        {
            "name":"SystemCapability.Security.KeyStoreProvider",
            "register-on-startup":true
        },
        {
            "name":"SystemCapability.Security.SecurityCenter",
            "register-on-startup":true
        },
        {
            "name":"SystemCapability.Security.AppVerify",
            "register-on-startup":true
        },
        {
            "name":"SystemCapability.Security.SecKeychain",
            "register-on-startup":true
        },
        {
            "name":"SystemCapability.Security.DataClassification.SFP",
            "register-on-startup":true
        },
        {
            "name":"SystemCapability.Security.DataClassification.DataFlag",
            "register-on-startup":true
        },
        {
            "name":"SystemCapability.Location",
            "register-on-startup":true
        },
        {
            "name":"SystemCapability.Location.Fine",
            "register-on-startup":true
        },
        {
            "name":"SystemCapability.Location.Coarse",
            "register-on-startup":true
        },
        {
            "name":"SystemCapability.Location.Geocode",
            "register-on-startup":true
        },
        {
            "name":"SystemCapability.Communication.IPC",
            "register-on-startup":true
        },
        {
            "name":"SystemCapability.Communication.SoftBus",
            "register-on-startup":true
        },
        {
            "name":"SystemCapability.Communication.SmartComm",
            "register-on-startup":true
        },
        {
            "name":"SystemCapability.Security.DiffPrivacy",
            "register-on-startup":true
        },
        {
            "name":"SystemCapability.HiviewDFX.Debug",
            "register-on-startup":true
        },
        {
            "name":"SystemCapability.HiviewDFX.HiChecker",
            "register-on-startup":true
        },
        {
            "name":"SystemCapability.HiviewDFX.HiCollie",
            "register-on-startup":true
        },
        {
            "name":"SystemCapability.HiviewDFX.HiDumper",
            "register-on-startup":true
        },
        {
            "name":"SystemCapability.HiviewDFX.Hiview",
            "register-on-startup":true
        },
        {
            "name":"SystemCapability.HiviewDFX.Hiview.FaultLogger",
            "register-on-startup":true
        },
        {
            "name":"SystemCapability.Notification.ANS",
            "register-on-startup":true
        },
        {
            "name":"SystemCapability.Notification.CES",
            "register-on-startup":true
        },
        {
            "name":"SystemCapability.Wearable.Complication",
            "register-on-startup":true
        }
    ]
}
