﻿{
	"centerX" : 0.5,
	"centerY" : 0.5,
	"angle" : 0,
	"scale" : 1,
	"width" : 280,
	"height" : 152,
	"contents" : [{
			"type" : "image",
			"resource":{
                "type":"dynamic",
                "resKey":"{aa}",
                "resources":[
                    {
                        "key":"凌晨",
                        "path":"res/wan an.png"
                    },
                    {
                        "key":"傍晚",
                        "path":"res/wan an.png"
					},
					{
                        "key":"晚上",
                        "path":"res/wan an.png"
                    },
                    {
                        "key":"上午",
                        "path":"res/zao an.png"
                    },{
                        "key":"中午",
                        "path":"res/wu an.png"
                    },
                    {
                        "key":"下午",
                        "path":"res/wu an.png"
                    }
                ]
            },
			"centerX" : 0.211,
			"centerY" : 0.5,
			"width" : 118,
			"height" : 152,
			"angle" : 0,
			"zorder" : 1
		},
		{
            "type": "text",
            "centerX": 0.711,
            "centerY": 0.526,
            "width": 162,
            "height": 25,
            "angle": 0,
            "color": "#ffffffff",
            "isVertical": 0,
            "alignment": 1,
            "font":"yasong.ttf",
            "text": "{CNH}",
            "zorder": 2
		},
		{
            "type": "text",
            "centerX": 0.671,
            "centerY": 0.726,
            "width": 142,
            "height": 20,
            "angle": 0,
            "color": "#ffffffff",
            "isVertical": 0,
			"alignment": 1,
			"editable":true,
            "text": "{USER_EDIT}",
            "zorder": 2
        }
	]
}
