MutualRawMax,
3351,3265,3247,3228,3248,3155,3170,3235,3178,3192,3176,3152,3188,3236,3135,3127,3175,3156,3044,3171,3150,3105,3178,3091,3105,3148,3098,3160,3157,3039,3071,3352,
3111,3064,3016,3039,3079,2982,3007,3055,3023,3050,3059,3012,3058,3092,2979,2998,3056,3059,2912,3065,3020,2994,3032,2976,2986,3025,2945,2991,2997,2912,2933,3267,
3094,3057,3027,3055,3098,2989,3015,3053,3035,3059,3048,3027,3066,3105,2996,3011,3083,3076,2938,3091,3041,3011,3050,2998,3003,3041,2972,3021,3022,2932,2952,3304,
3098,3060,3036,3066,3105,3004,3027,3060,3037,3066,3044,3025,3075,3116,3000,3015,3110,3086,2958,3099,3048,3023,3069,3006,3012,3053,2986,3042,3047,2938,2991,3352,
3121,3081,3034,3088,3115,3013,3045,3061,3040,3081,3044,3027,3084,3120,3003,3024,3136,3101,2988,3114,3059,3043,3078,3030,3030,3069,3008,3069,3071,2952,3009,3396,
3124,3086,3037,3095,3119,3018,3048,3071,3043,3078,3054,3027,3082,3117,3001,3027,3139,3100,2995,3112,3060,3046,3082,3031,3028,3073,3010,3069,3073,2953,3009,3394,
3131,3098,3048,3105,3130,3027,3050,3075,3042,3077,3056,3025,3085,3117,2996,3028,3148,3099,2996,3116,3066,3046,3085,3036,3035,3081,3021,3079,3079,2968,3023,3404,
3139,3109,3059,3112,3132,3028,3055,3072,3041,3075,3053,3021,3080,3116,2996,3028,3148,3095,2996,3107,3060,3040,3088,3037,3030,3075,3025,3085,3106,2970,3004,3341,
3269,3055,3075,3089,3135,3041,3051,3080,3051,3071,3053,3032,3082,3129,3013,3044,3164,3125,3018,3140,3098,3065,3120,3071,3062,3113,3081,3111,3120,3031,3049,3436,
3229,3066,3062,3057,3054,3124,3055,3006,3124,2972,3037,3108,3091,3041,3134,3078,3091,3113,3005,3051,3087,3044,3043,3056,2991,3028,3133,2966,3005,3046,3006,3319,
3080,3032,3072,3024,3026,3104,3026,2976,3091,2941,3012,3068,3058,3012,3108,3053,3056,3089,2983,3036,3072,3028,3028,3041,2971,3007,3111,2947,2990,3059,2979,3290,
3075,3028,3053,3012,3020,3101,3023,2979,3095,2945,3013,3074,3061,3012,3110,3058,3053,3091,2988,3041,3074,3034,3030,3046,2972,3015,3110,2943,2988,3043,2978,3288,
3060,3014,3041,3000,3009,3096,3020,2975,3090,2943,3013,3078,3057,3004,3104,3050,3046,3087,2987,3038,3071,3034,3026,3034,2963,3000,3101,2930,2976,3033,2965,3277,
3044,3006,3036,2995,3005,3093,3018,2974,3084,2945,3013,3085,3059,3005,3103,3052,3044,3087,2990,3043,3068,3038,3027,3026,2968,2996,3099,2934,2974,3030,2970,3272,
3005,2995,3027,2975,2992,3078,3001,2961,3076,2931,3001,3080,3037,2995,3091,3036,3028,3075,2975,3027,3052,3025,3007,3009,2952,2978,3078,2920,2946,3020,2947,3234,
3004,2984,3018,2970,2979,3068,2990,2945,3060,2922,2992,3086,3028,2998,3078,3015,3019,3062,2963,3014,3046,3028,2999,2995,2948,2970,3069,2914,2936,3011,2938,3215,
3027,2975,2996,2957,2965,3048,2970,2926,3037,2911,2973,3084,3009,2971,3060,2986,2995,3048,2938,2995,3034,3021,2975,2988,2934,2958,3054,2909,2918,3004,2918,3207,
3251,3169,3251,3173,3148,3195,3124,3071,3209,3094,3116,3222,3167,3107,3225,3114,3151,3216,3143,3122,3182,3207,3116,3157,3065,3108,3248,3146,3087,3171,3069,3331,
MutualRawMin,
1833,1786,1776,1765,1776,1726,1734,1769,1738,1745,1737,1724,1744,1770,1714,1710,1736,1726,1665,1734,1723,1698,1738,1690,1698,1722,1694,1728,1727,1662,1679,1833,
1701,1676,1649,1662,1684,1631,1645,1671,1653,1668,1673,1647,1672,1691,1629,1639,1671,1673,1593,1676,1651,1637,1658,1628,1633,1654,1610,1636,1639,1593,1604,1787,
1692,1672,1655,1671,1694,1635,1649,1670,1660,1673,1667,1655,1677,1698,1638,1646,1686,1682,1607,1691,1663,1646,1668,1639,1642,1663,1625,1652,1653,1603,1615,1807,
1694,1673,1660,1677,1698,1643,1655,1673,1661,1677,1665,1654,1681,1704,1641,1649,1701,1688,1618,1695,1667,1653,1678,1644,1647,1670,1633,1664,1666,1607,1636,1833,
1707,1685,1659,1689,1703,1648,1665,1674,1663,1685,1665,1656,1687,1706,1642,1654,1715,1696,1634,1703,1673,1664,1683,1657,1657,1679,1645,1679,1680,1614,1645,1857,
1709,1688,1661,1693,1706,1650,1667,1680,1664,1684,1670,1655,1686,1705,1641,1655,1717,1695,1638,1702,1673,1666,1686,1658,1656,1680,1646,1678,1680,1615,1646,1856,
1712,1694,1667,1698,1712,1655,1668,1682,1664,1683,1671,1654,1687,1705,1639,1656,1721,1695,1638,1704,1677,1666,1687,1660,1660,1685,1652,1684,1684,1623,1653,1861,
1716,1700,1673,1702,1713,1656,1671,1680,1663,1682,1670,1652,1684,1704,1639,1656,1722,1693,1638,1699,1673,1663,1689,1661,1657,1681,1654,1687,1699,1624,1643,1827,
1788,1671,1681,1689,1714,1663,1668,1684,1668,1680,1670,1658,1685,1711,1648,1665,1730,1709,1650,1717,1694,1676,1706,1679,1674,1702,1685,1701,1706,1658,1667,1879,
1766,1677,1674,1672,1670,1709,1671,1644,1708,1625,1661,1700,1691,1663,1714,1683,1690,1702,1643,1668,1688,1665,1664,1671,1636,1656,1714,1622,1644,1666,1644,1815,
1684,1658,1680,1654,1655,1698,1655,1628,1690,1609,1647,1678,1672,1647,1700,1670,1671,1689,1631,1660,1680,1656,1656,1663,1625,1644,1701,1611,1635,1673,1629,1799,
1681,1656,1670,1647,1652,1696,1653,1629,1693,1611,1648,1681,1674,1647,1701,1672,1670,1690,1634,1663,1681,1659,1657,1666,1625,1649,1701,1609,1634,1664,1629,1798,
1673,1649,1663,1640,1646,1693,1651,1627,1690,1610,1648,1684,1672,1643,1698,1668,1666,1688,1633,1661,1679,1659,1655,1659,1621,1641,1696,1602,1628,1659,1622,1792,
1665,1644,1660,1638,1644,1692,1651,1626,1687,1610,1648,1687,1673,1644,1697,1669,1665,1688,1635,1664,1678,1661,1655,1655,1623,1639,1695,1604,1626,1657,1624,1790,
1644,1638,1655,1627,1636,1683,1641,1619,1682,1603,1641,1684,1661,1638,1690,1660,1656,1682,1627,1655,1669,1654,1645,1645,1615,1629,1683,1597,1611,1652,1611,1769,
1643,1632,1650,1624,1629,1678,1635,1611,1673,1598,1636,1688,1656,1639,1684,1649,1651,1675,1620,1649,1666,1656,1640,1638,1612,1624,1679,1594,1606,1647,1607,1758,
1655,1627,1639,1617,1622,1667,1624,1600,1661,1592,1626,1687,1645,1625,1674,1633,1638,1667,1607,1638,1659,1652,1627,1634,1604,1618,1670,1591,1596,1643,1596,1754,
1778,1733,1778,1735,1722,1747,1709,1679,1755,1692,1704,1762,1732,1699,1764,1703,1723,1759,1719,1707,1740,1754,1704,1727,1676,1700,1776,1721,1688,1734,1678,1821,
Tx_delta_abslimit,
550,500,500,500,500,500,500,500,500,500,500,500,500,500,500,500,500,500,500,500,500,500,500,500,500,500,500,500,500,500,500,650,
430,300,300,300,300,300,300,300,300,300,300,300,300,300,300,300,300,300,300,300,300,300,300,300,300,300,300,300,300,300,300,430,
300,300,300,300,300,300,300,300,300,300,300,300,300,300,300,300,300,300,300,300,300,300,300,300,300,300,300,300,300,300,300,300,
300,300,300,300,300,300,300,300,300,300,300,300,300,300,300,300,300,300,300,300,300,300,300,300,300,300,300,300,300,300,300,300,
300,300,300,300,300,300,300,300,300,300,300,300,300,300,300,300,300,300,300,300,300,300,300,300,300,300,300,300,300,300,300,300,
300,300,300,300,300,300,300,300,300,300,300,300,300,300,300,300,300,300,300,300,300,300,300,300,300,300,300,300,300,300,300,300,
300,300,300,300,300,300,300,300,300,300,300,300,300,300,300,300,300,300,300,300,300,300,300,300,300,300,300,300,300,300,300,300,
430,300,300,300,300,300,300,300,300,300,300,300,300,300,300,300,300,300,300,300,300,300,300,300,300,300,300,300,300,300,300,430,
700,700,700,700,700,700,700,700,700,700,700,700,700,700,700,700,700,700,700,700,700,700,700,700,700,700,700,700,700,700,700,700,
430,300,300,300,300,300,300,300,300,300,300,300,300,300,300,300,300,300,300,300,300,300,300,300,300,300,300,300,300,300,300,430,
350,300,300,300,300,300,300,300,300,300,300,300,300,300,300,300,300,300,300,300,300,300,300,300,300,300,300,300,300,300,300,350,
350,300,300,300,300,300,300,300,300,300,300,300,300,300,300,300,300,300,300,300,300,300,300,300,300,300,300,300,300,300,300,350,
350,300,300,300,300,300,300,300,300,300,300,300,300,300,300,300,300,300,300,300,300,300,300,300,300,300,300,300,300,300,300,350,
350,300,300,300,300,300,300,300,300,300,300,300,300,300,300,300,300,300,300,300,300,300,300,300,300,300,300,300,300,300,300,350,
350,300,300,300,300,300,300,300,300,300,300,300,300,300,300,300,300,300,300,300,300,300,300,300,300,300,300,300,300,300,300,350,
430,300,300,300,300,300,300,300,300,300,300,300,300,300,300,300,300,300,300,300,300,300,300,300,300,300,300,300,300,300,300,430,
600,600,600,600,600,600,600,600,600,600,600,600,600,600,600,600,600,600,600,600,600,600,600,600,600,600,600,600,600,600,600,650,
Rx_delta_abslimit,
530,530,530,530,530,530,530,530,530,530,530,530,530,530,530,530,530,530,530,530,530,530,530,530,530,530,530,530,530,530,750,
530,530,530,530,530,530,530,530,530,530,530,530,530,530,530,530,530,530,530,530,530,530,530,530,530,530,530,530,530,530,750,
530,530,530,530,530,530,530,530,530,530,530,530,530,530,530,530,530,530,530,530,530,530,530,530,530,530,530,530,530,530,750,
530,530,530,530,530,530,530,530,530,530,530,530,530,530,530,530,530,530,530,530,530,530,530,530,530,530,530,530,530,530,750,
530,530,530,530,530,530,530,530,530,530,530,530,530,530,530,530,530,530,530,530,530,530,530,530,530,530,530,530,530,530,750,
530,530,530,530,530,530,530,530,530,530,530,530,530,530,530,530,530,530,530,530,530,530,530,530,530,530,530,530,530,530,750,
530,530,530,530,530,530,530,530,530,530,530,530,530,530,530,530,530,530,530,530,530,530,530,530,530,530,530,530,530,530,750,
650,530,530,530,530,530,530,530,530,530,530,530,530,530,530,530,530,530,530,530,530,530,530,530,530,530,530,530,530,530,750,
700,530,530,530,530,530,530,530,530,530,530,530,530,530,530,530,530,530,530,530,530,530,530,530,530,530,530,530,530,530,750,
700,530,530,530,530,530,530,530,530,530,530,530,530,530,530,530,530,530,530,530,530,530,530,530,530,530,530,530,530,530,750,
600,530,530,530,530,530,530,530,530,530,530,530,530,530,530,530,530,530,530,530,530,530,530,530,530,530,530,530,530,530,750,
530,530,530,530,530,530,530,530,530,530,530,530,530,530,530,530,530,530,530,530,530,530,530,530,530,530,530,530,530,530,750,
530,530,530,530,530,530,530,530,530,530,530,530,530,530,530,530,530,530,530,530,530,530,530,530,530,530,530,530,530,530,750,
530,530,530,530,530,530,530,530,530,530,530,530,530,530,530,530,530,530,530,530,530,530,530,530,530,530,530,530,530,530,750,
530,530,530,530,530,530,530,530,530,530,530,530,530,530,530,530,530,530,530,530,530,530,530,530,530,530,530,530,530,530,750,
530,530,530,530,530,530,530,530,530,530,530,530,530,530,530,530,530,530,530,530,530,530,530,530,530,530,530,530,530,530,750,
530,530,530,530,530,530,530,530,530,530,530,530,530,530,530,530,530,530,530,530,530,530,530,530,530,530,530,530,530,530,750,
530,530,530,530,530,530,530,530,530,530,530,530,530,530,530,530,530,530,530,530,530,530,530,530,530,530,530,530,530,530,750,
noise_data_limit,
-50,50,
tddi_ee_short_data_limit,
85,100,
