MutualRawMax,
3176,3113,3043,3034,3092,3009,3016,3075,2993,3009,3050,2995,2999,3044,2986,2990,3028,2950,2975,3013,2959,2958,3005,2952,2948,3005,2948,2986,2986,2909,2949,3103,
2926,2934,2866,2881,2947,2861,2871,2932,2849,2868,2941,2853,2875,2916,2857,2866,2902,2829,2854,2906,2842,2847,2885,2836,2833,2898,2826,2851,2874,2797,2839,2999,
2903,2926,2871,2886,2957,2861,2872,2926,2851,2870,2926,2861,2870,2925,2866,2877,2916,2842,2871,2924,2857,2865,2906,2856,2853,2921,2845,2870,2893,2815,2860,3026,
2911,2926,2874,2890,2961,2862,2876,2927,2848,2871,2920,2856,2868,2930,2863,2880,2932,2848,2880,2931,2863,2875,2927,2863,2868,2932,2852,2884,2913,2819,2893,3057,
2936,2944,2871,2903,2966,2867,2890,2931,2851,2884,2918,2856,2877,2929,2863,2886,2954,2860,2902,2948,2877,2900,2943,2880,2893,2959,2870,2908,2936,2839,2913,3089,
2941,2941,2872,2904,2970,2868,2892,2940,2851,2881,2931,2854,2876,2927,2861,2884,2950,2856,2902,2948,2879,2904,2948,2883,2897,2964,2871,2909,2935,2836,2913,3089,
2949,2948,2880,2911,2975,2874,2894,2941,2852,2884,2930,2856,2876,2925,2860,2884,2949,2856,2903,2947,2879,2904,2948,2888,2903,2972,2883,2926,2950,2852,2930,3105,
2956,2952,2886,2915,2975,2874,2895,2940,2852,2884,2929,2854,2875,2922,2860,2881,2948,2856,2902,2944,2876,2902,2949,2885,2900,2968,2879,2927,2976,2857,2915,3053,
2945,2899,2893,2893,2970,2880,2890,2944,2860,2883,2930,2867,2876,2941,2889,2906,2977,2898,2936,2990,2925,2941,2994,2939,2943,3014,2939,2964,3000,2925,2972,3169,
3032,2966,3023,2950,2959,3000,2934,2932,2989,2911,2932,2980,2918,2921,2976,2932,2926,2977,2906,2903,2976,2913,2913,2975,2904,2927,2970,2904,2909,2931,2912,3052,
2940,2927,3007,2890,2932,2964,2883,2892,2947,2862,2897,2934,2874,2889,2941,2893,2900,2950,2881,2897,2961,2900,2915,2971,2893,2930,2968,2894,2921,2976,2899,3054,
2939,2935,2985,2888,2929,2964,2885,2895,2950,2866,2900,2938,2877,2892,2947,2897,2902,2954,2884,2899,2964,2902,2917,2975,2895,2931,2968,2890,2911,2962,2886,3040,
2936,2930,2981,2884,2925,2964,2885,2894,2953,2867,2902,2940,2879,2893,2949,2897,2902,2956,2884,2898,2964,2899,2911,2963,2884,2915,2950,2872,2893,2941,2866,3013,
2927,2931,2985,2888,2926,2968,2890,2900,2959,2874,2908,2948,2886,2900,2958,2906,2908,2961,2886,2899,2961,2898,2908,2947,2880,2909,2939,2867,2888,2935,2861,3002,
2909,2922,2989,2886,2917,2962,2886,2894,2956,2872,2899,2948,2886,2893,2950,2906,2892,2947,2874,2879,2948,2883,2881,2930,2861,2880,2913,2845,2857,2907,2840,2963,
2906,2911,2982,2889,2911,2957,2888,2889,2948,2877,2903,2952,2894,2898,2950,2908,2885,2935,2870,2871,2939,2877,2870,2915,2854,2871,2906,2838,2851,2897,2831,2954,
2927,2909,2975,2884,2904,2953,2884,2888,2948,2875,2899,2947,2888,2888,2938,2898,2872,2920,2857,2867,2941,2861,2854,2902,2836,2851,2885,2820,2833,2874,2816,2936,
3119,3052,3119,3014,3032,3076,3013,3016,3077,3002,3022,3064,3013,3012,3062,3023,2993,3048,2988,2985,3044,2991,2982,3031,2967,2979,3020,2975,2970,3008,2962,3095,
MutualRawMin,
1786,1751,1711,1706,1740,1693,1696,1729,1683,1693,1716,1685,1687,1712,1680,1682,1704,1660,1673,1695,1665,1664,1691,1660,1658,1691,1658,1680,1680,1637,1659,1745,
1646,1650,1612,1621,1657,1609,1615,1650,1603,1614,1655,1605,1617,1640,1607,1612,1632,1591,1606,1634,1598,1601,1623,1596,1593,1630,1590,1603,1616,1573,1597,1687,
1633,1646,1615,1624,1663,1609,1616,1646,1603,1614,1646,1609,1614,1645,1612,1619,1640,1598,1615,1644,1607,1611,1634,1606,1605,1643,1601,1614,1627,1583,1608,1702,
1637,1646,1616,1626,1665,1610,1618,1647,1602,1615,1642,1606,1614,1648,1611,1620,1650,1602,1620,1649,1611,1617,1647,1611,1614,1650,1604,1622,1639,1585,1627,1719,
1652,1656,1615,1633,1668,1613,1626,1649,1603,1622,1642,1606,1619,1647,1611,1624,1662,1608,1632,1658,1619,1632,1655,1620,1627,1665,1614,1636,1652,1597,1639,1737,
1655,1655,1616,1634,1670,1614,1626,1654,1603,1621,1649,1606,1618,1647,1609,1622,1660,1606,1632,1658,1619,1634,1658,1621,1629,1668,1615,1637,1651,1596,1639,1737,
1659,1658,1620,1637,1673,1616,1628,1655,1604,1622,1648,1606,1618,1645,1608,1622,1659,1606,1633,1657,1619,1634,1658,1624,1633,1672,1621,1646,1660,1604,1648,1747,
1662,1660,1624,1639,1673,1616,1629,1654,1604,1622,1647,1606,1617,1644,1608,1621,1658,1606,1632,1656,1618,1632,1659,1623,1632,1670,1619,1647,1674,1607,1639,1717,
1657,1631,1627,1627,1670,1620,1626,1656,1608,1621,1648,1613,1618,1655,1625,1634,1675,1630,1652,1682,1645,1655,1684,1653,1655,1696,1653,1668,1688,1645,1672,1783,
1706,1668,1701,1660,1665,1688,1650,1650,1681,1637,1650,1676,1642,1643,1674,1650,1646,1675,1634,1633,1674,1639,1639,1673,1634,1647,1670,1634,1637,1649,1638,1716,
1654,1647,1691,1626,1650,1668,1621,1626,1657,1610,1629,1650,1616,1625,1655,1627,1632,1660,1621,1629,1665,1632,1639,1671,1627,1648,1670,1628,1643,1674,1631,1718,
1653,1651,1679,1624,1647,1668,1623,1629,1660,1612,1632,1652,1619,1626,1657,1629,1632,1662,1622,1631,1668,1632,1641,1673,1629,1649,1670,1626,1637,1666,1624,1710,
1652,1648,1677,1622,1645,1668,1623,1628,1661,1613,1632,1654,1619,1627,1659,1629,1632,1662,1622,1630,1668,1631,1637,1667,1622,1639,1660,1616,1627,1655,1612,1695,
1647,1649,1679,1624,1646,1670,1626,1632,1665,1616,1636,1658,1624,1632,1664,1634,1636,1665,1624,1631,1665,1630,1636,1657,1620,1637,1653,1613,1624,1651,1609,1688,
1637,1644,1681,1624,1641,1666,1624,1628,1662,1616,1631,1658,1624,1627,1660,1634,1626,1657,1616,1619,1658,1621,1621,1648,1609,1620,1639,1601,1607,1635,1598,1667,
1634,1637,1678,1625,1637,1663,1624,1625,1658,1619,1633,1660,1628,1630,1660,1636,1623,1651,1614,1615,1653,1619,1614,1639,1606,1615,1634,1596,1603,1629,1593,1662,
1647,1637,1673,1622,1634,1661,1622,1624,1658,1617,1631,1657,1624,1624,1652,1630,1616,1642,1607,1613,1655,1609,1606,1632,1596,1603,1623,1586,1593,1616,1584,1652,
1755,1716,1755,1696,1706,1730,1695,1696,1731,1688,1700,1724,1695,1694,1722,1701,1683,1714,1680,1679,1712,1683,1678,1705,1669,1675,1698,1673,1670,1692,1666,1741,
Tx_delta_abslimit,
500,400,400,400,400,400,400,400,400,400,400,400,400,400,400,400,400,400,400,400,400,400,400,400,400,400,400,400,400,400,400,550,
230,180,180,180,180,180,180,180,180,180,180,180,180,180,180,180,180,180,180,180,180,180,180,180,180,180,180,180,180,180,180,230,
180,180,180,180,180,180,180,180,180,180,180,180,180,180,180,180,180,180,180,180,180,180,180,180,180,180,180,180,180,180,180,180,
180,180,180,180,180,180,180,180,180,180,180,180,180,180,180,180,180,180,180,180,180,180,180,180,180,180,180,180,180,180,180,180,
180,180,180,180,180,180,180,180,180,180,180,180,180,180,180,180,180,180,180,180,180,180,180,180,180,180,180,180,180,180,180,180,
180,180,180,180,180,180,180,180,180,180,180,180,180,180,180,180,180,180,180,180,180,180,180,180,180,180,180,180,180,180,180,180,
180,180,180,180,180,180,180,180,180,180,180,180,180,180,180,180,180,180,180,180,180,180,180,180,180,180,180,180,180,180,180,180,
230,180,180,180,180,180,180,180,180,180,180,180,180,180,180,180,180,180,180,180,180,180,180,180,180,180,180,180,180,180,180,230,
550,550,550,550,550,550,550,550,550,550,550,550,550,550,550,550,550,550,550,550,550,550,550,550,550,550,550,550,550,550,550,550,
230,180,180,180,180,180,180,180,180,180,180,180,180,180,180,180,180,180,180,180,180,180,180,180,180,180,180,180,180,180,180,230,
180,180,180,180,180,180,180,180,180,180,180,180,180,180,180,180,180,180,180,180,180,180,180,180,180,180,180,180,180,180,180,180,
180,180,180,180,180,180,180,180,180,180,180,180,180,180,180,180,180,180,180,180,180,180,180,180,180,180,180,180,180,180,180,180,
180,180,180,180,180,180,180,180,180,180,180,180,180,180,180,180,180,180,180,180,180,180,180,180,180,180,180,180,180,180,180,180,
180,180,180,180,180,180,180,180,180,180,180,180,180,180,180,180,180,180,180,180,180,180,180,180,180,180,180,180,180,180,180,180,
180,180,180,180,180,180,180,180,180,180,180,180,180,180,180,180,180,180,180,180,180,180,180,180,180,180,180,180,180,180,180,180,
230,180,180,180,180,180,180,180,180,180,180,180,180,180,180,180,180,180,180,180,180,180,180,180,180,180,180,180,180,180,180,230,
500,400,400,400,400,400,400,400,400,400,400,400,400,400,400,400,400,400,400,400,400,400,400,400,400,400,400,400,400,400,400,550,
Rx_delta_abslimit,
550,550,550,550,550,550,550,550,550,550,550,550,550,550,550,550,550,550,550,550,550,550,550,550,550,550,550,550,550,550,650,
550,550,550,550,550,550,550,550,550,550,550,550,550,550,550,550,550,550,550,550,550,550,550,550,550,550,550,550,550,550,650,
550,550,550,550,550,550,550,550,550,550,550,550,550,550,550,550,550,550,550,550,550,550,550,550,550,550,550,550,550,550,650,
550,550,550,550,550,550,550,550,550,550,550,550,550,550,550,550,550,550,550,550,550,550,550,550,550,550,550,550,550,550,650,
550,550,550,550,550,550,550,550,550,550,550,550,550,550,550,550,550,550,550,550,550,550,550,550,550,550,550,550,550,550,650,
550,550,550,550,550,550,550,550,550,550,550,550,550,550,550,550,550,550,550,550,550,550,550,550,550,550,550,550,550,550,650,
550,550,550,550,550,550,550,550,550,550,550,550,550,550,550,550,550,550,550,550,550,550,550,550,550,550,550,550,550,550,650,
550,550,550,550,550,550,550,550,550,550,550,550,550,550,550,550,550,550,550,550,550,550,550,550,550,550,550,550,550,550,650,
550,550,550,550,550,550,550,550,550,550,550,550,550,550,550,550,550,550,550,550,550,550,550,550,550,550,550,550,550,550,650,
550,550,550,550,550,550,550,550,550,550,550,550,550,550,550,550,550,550,550,550,550,550,550,550,550,550,550,550,550,550,650,
550,550,550,550,550,550,550,550,550,550,550,550,550,550,550,550,550,550,550,550,550,550,550,550,550,550,550,550,550,550,650,
550,550,550,550,550,550,550,550,550,550,550,550,550,550,550,550,550,550,550,550,550,550,550,550,550,550,550,550,550,550,650,
550,550,550,550,550,550,550,550,550,550,550,550,550,550,550,550,550,550,550,550,550,550,550,550,550,550,550,550,550,550,650,
550,550,550,550,550,550,550,550,550,550,550,550,550,550,550,550,550,550,550,550,550,550,550,550,550,550,550,550,550,550,650,
550,550,550,550,550,550,550,550,550,550,550,550,550,550,550,550,550,550,550,550,550,550,550,550,550,550,550,550,550,550,650,
550,550,550,550,550,550,550,550,550,550,550,550,550,550,550,550,550,550,550,550,550,550,550,550,550,550,550,550,550,550,650,
550,550,550,550,550,550,550,550,550,550,550,550,550,550,550,550,550,550,550,550,550,550,550,550,550,550,550,550,550,550,650,
550,550,550,550,550,550,550,550,550,550,550,550,550,550,550,550,550,550,550,550,550,550,550,550,550,550,550,550,550,550,650,
noise_data_limit,
-50,50,
tddi_ee_short_data_limit,
80,85,
