{
    "version": "1.0.1",
    "release-time":"2021-06-03 10:06:00",
    "trust-app-source":[
        {
            "name":"huawei app gallary",
            "app-signing-cert":"C=CN, O=Huawei, OU=HOS AppGallery, CN=HOS AppGallery Application Release",
            "profile-signing-certificate":"C=CN, O=Huawei, OU=HOS AppGallery, CN=HOS Profile Management",
            "profile-debug-signing-certificate":"C=CN, O=Huawei, OU=HOS AppGallery, CN=HOS Profile Management Debug",
            "issuer-ca":"C=CN, O=Huawei, OU=Huawei CBG, CN=Huawei CBG Software Signing Service CA",
            "max-certs-path":3,
            "critialcal-cert-extension":["keyusage","huawei-signing-capability"]
        },
        {
            "name":"huawei system apps",
            "app-signing-cert":"C=CN, O=Huawei CBG, OU=HOS Development Team, CN=HOS Application Provision Release",
            "profile-signing-certificate":"C=CN, O=Huawei CBG, OU=HOS Development Team, CN=HOS Application Provision Profile Release",
            "profile-debug-signing-certificate":"C=CN, O=Huawei CBG, OU=HOS Development Team, CN=HOS Application Provision Profile Release_Debug",
            "issuer-ca":"C=CN, O=Huawei, OU=Huawei CBG, CN=Huawei CBG Software Signing Service CA",
            "max-certs-path":3,
            "critialcal-cert-extension":["keyusage","huawei-signing-capability"]
        },
        {
            "name":"third_party app preload",
            "app-signing-cert":"C=CN, O=Huawei, OU=HOS Open Platform, CN=HOS Preload Service",
            "profile-signing-certificate":"",
            "profile-debug-signing-certificate":"",
            "issuer-ca":"C=CN, O=Huawei, OU=Huawei CBG, CN=Huawei CBG Software Signing Service CA",
            "max-certs-path":3,
            "critialcal-cert-extension":["keyusage","huawei-signing-capability"]
        }
   ]
}
