{
    "version": "1.0.0",
    "delay" : 10,
    "schedule_time" : 10,
    "sensor" : {
        "name": "charger",
        "accuracy": 1
    },
    "temp_level" : {
        "comments" : "low_threshold, high_threshold, hysteresis_value, unit is millicentigrade",
        "table" : [
            [40000, 44000, 2000],
            [44000, 48000, 3000],
            [48000, 52000, 3000],
            [52000, 55000, 2000],
            [55000, 99000, 2000]
        ]
    },
    "current_limit" : {
        "comments" : "scale1, scale2, scale3, scale4, scale5",
        "wcurrent_5v" : {
            "channel" : 0,
            "prefix" : "dcp 0#",
            "limit": [1800, 1600, 1400, 1000, 500]
        },
        "wcurrent_9v" : {
            "channel" : 0,
            "prefix" : "dcp 1#",
            "limit": [1800, 1600, 1400, 1000, 500]
        }
    },
    "su_version": "1.0.0",
    "su_delay" : 1,
    "su_current_limit" : {
        "comments" : "hota, normal",
        "wcurrent_5v" : {
            "channel" : 0,
            "prefix" : "dcp 0#",
            "limit" : [900, 1300]
        },
        "wcurrent_9v" : {
            "channel" : 0,
            "prefix" : "dcp 1#",
            "limit": [900, 1300]
        },
        "direct_charger" : {
            "channel" : 1,
            "prefix" : "lvc ",
            "limit": [1500, 1500]
        },
        "direct_charger_sc" : {
            "channel" : 0,
            "prefix" : "sc 0#",
            "limit": [1500, 1500]
        }
    }
}