{
    "version": "1.0.0",
    "uid_name": "APP",
    "APP": {
        "SystemHungFault": [
            {
                "rule_prio":0,
                "featureid":"070140000",
                "RelatedInfo":{
                    "PID": "BasicParam.s_pid",
                    "UID": "BasicParam.s_uid"
                }
            }
        ],
        "SystemHungWarning": [
            {
                "rule_prio":0,
                "featureid":"070140040",
                "EventInfoParam":{
                    "TRUSTSTACK":"BasicParam.s_trace"
                },
                "RelatedInfo":{
                    "PID": "BasicParam.s_pid",
                    "UID": "BasicParam.s_uid"
                }
            }
        ],
        "AppFreeze": [
                        {
                            "rule_prio":0,
                            "featureid":"070140050",
                            "RelatedInfo":{
                                "PID": "BasicParam.s_pid",
                                "UID": "BasicParam.s_uid",
                                "PACKAGE": "BasicParam.s_package",
                                "PROCESS": "BasicParam.s_process",
                                "ACTIVITY": "BasicParam.s_activity",
                                "VERSION": "BasicParam.s_version",
                                "MASSAGE": "BasicParam.s_massage"
                            }
                        },
                        {
                            "rule_prio":1,
                            "featureid":"070140051",
                            "EventInfoParam":{
                                "TRUSTSTACK":"BasicParam.s_trace"
                            },
                            "RelatedInfo":{
                                "PID": "BasicParam.s_pid",
                                "UID": "BasicParam.s_uid",
                                "PACKAGE": "BasicParam.s_package",
                                "PROCESS": "BasicParam.s_process"
                            }
                        },
                        {
                            "rule_prio":1,
                            "featureid":"070140052",
                            "RelatedInfo":{
                                "PID": "BasicParam.s_pid",
                                "UID": "BasicParam.s_uid",
                                "PACKAGE": "BasicParam.s_package",
                                "PROCESS": "BasicParam.s_process"
                            }
                        }
        ],
        "AppFreezeWarning": [
                        {
                            "rule_prio":0,
                            "featureid":"070140060",
                            "RelatedInfo":{
                                "PID": "BasicParam.s_pid",
                                "UID": "BasicParam.s_uid",
                                "PACKAGE": "BasicParam.s_package",
                                "PROCESS": "BasicParam.s_process",
                                "ACTIVITY": "BasicParam.s_activity",
                                "VERSION": "BasicParam.s_version",
                                "MASSAGE": "BasicParam.s_massage"
                            }
                        }
        ]
    }
}
