{
    "effect": {
        "Link": [
            {
                "type": "3DScene",
                "zorder": 900,
                "path": "E12_3D_Scene_01/"
            },
            {
                "type":"Matting",
                "zorder":901,
                "path":"Matting_wuyun/"
            },
            {
                "type" : "2DSticker",
                "zorder" : 15001,
                "path" : "2DSticker_wuyun/"
            }
        ],
        "bgms":[
            {   
                "version":"bgmv2",
                "music_path":"bgm/leiyu.mp3",
                "defaultEnable":true
            }
        ]
    }, 
    "name": "E12_MagicSky_lzy", 
    "version": "2.5.1"
}
