{
	"centerX" : 0.5,
	"centerY" : 0.5,
	"angle" : 0,
	"scale" : 1,
	"width" : 168,
	"height" : 154,
	"contents" : [
        {
			"type" : "image",
			"resource" : {
				"type" : "static",
				"path" : "res/qiqiu.png"
			},
			"centerX" : 0.5,
			"centerY" : 0.5,
			"width" : 158,
			"height" : 144,
			"zorder" : 1
		},
        {
            "type": "text",
            "centerX": 0.45,
            "centerY": 0.6,
            "width": 30,
            "height": 15,
            "angle": 0,
            "color": "#ffffffff",
            "isVertical": 0,
			"alignment": 0,
            "editable":true,
            "font":"yasong.ttf",
            "text": "{ALTITUDE}",
            "zorder": 2
        },
        {
            "type": "text",
            "centerX": 0.58,
            "centerY": 0.6,
            "width": 10,
            "height": 15,
            "angle": 0,
            "color": "#ffffffff",
            "isVertical": 0,
            "alignment": 0,
            "font":"yasong.ttf",
            "text": "m",
            "zorder": 2
        }
	]
}
