#,version,,,,,,,,,,,,,,,,,,,,,,,,,,,,,,,,,,,,,,,,,,,,,,,,,,,,,,,,,,,,,,,,,,,,,
2023,4,3,1,,,,,,,,,,,,,,,,,,,,,,,,,,,,,,,,,,,,,,,,,,,,,,,,,,,,,,,,,,,,,,,,,,,
#,row_col_num,,,,,,,,,,,,,,,,,,,,,,,,,,,,,,,,,,,,,,,,,,,,,,,,,,,,,,,,,,,,,,,,,,,,,
37,34,,,,,,,,,,,,,,,,,,,,,,,,,,,,,,,,,,,,,,,,,,,,,,,,,,,,,,,,,,,,,,,,,,,,,
#,noise,,,,,,,,,,,,,,,,,,,,,,,,,,,,,,,,,,,,,,,,,,,,,,,,,,,,,,,,,,,,,,,,,,,,,
-600,600,,,,,,,,,,,,,,,,,,,,,,,,,,,,,,,,,,,,,,,,,,,,,,,,,,,,,,,,,,,,,,,,,,,,,
#,raw_max,,,,,,,,,,,,,,,,,,,,,,,,,,,,,,,,,,,,,,,,,,,,,,,,,,,,,,,,,,,,,,,,,,,,,
4758,4100,4037,3856,3907,3761,3822,3697,3782,3682,3764,3622,3728,3602,3686,3583,3683,3588,3687,3571,3639,3476,3571,3441,3442,2401,3440,3409,3576,3459,3604,3531,3653,3627,,,,,,,,,,,,,,,,,,,,,,,,,,,,,,,,,,,,,
3992,3739,3556,3634,3488,3567,3423,3522,3398,3520,3392,3472,3370,3462,3336,3454,3344,3468,3366,3480,3346,3413,3309,3402,3258,2707,3262,3359,3281,3368,3293,3458,3341,3679,,,,,,,,,,,,,,,,,,,,,,,,,,,,,,,,,,,,,
3944,3592,3650,3528,3606,3475,3544,3429,3518,3426,3514,3385,3491,3374,3459,3367,3470,3380,3496,3390,3467,3320,3436,3316,3368,3306,3390,3285,3427,3299,3429,3354,3442,3536,,,,,,,,,,,,,,,,,,,,,,,,,,,,,,,,,,,,,
3779,3695,3558,3658,3524,3610,3471,3569,3448,3571,3439,3522,3414,3510,3385,3506,3394,3519,3415,3532,3397,3463,3361,3457,3290,3445,3311,3418,3349,3422,3341,3487,3355,3673,,,,,,,,,,,,,,,,,,,,,,,,,,,,,,,,,,,,,
3754,3494,3572,3466,3548,3426,3501,3387,3475,3392,3475,3351,3454,3337,3419,3331,3431,3345,3450,3349,3431,3289,3397,3283,3331,3280,3349,3250,3384,3247,3383,3299,3385,3462,,,,,,,,,,,,,,,,,,,,,,,,,,,,,,,,,,,,,
3771,3741,3617,3730,3601,3684,3548,3647,3528,3656,3523,3606,3497,3596,3468,3595,3481,3609,3496,3615,3483,3545,3444,3540,3371,3527,3387,3501,3422,3501,3415,3556,3422,3719,,,,,,,,,,,,,,,,,,,,,,,,,,,,,,,,,,,,,
3851,3611,3704,3605,3692,3566,3637,3524,3618,3533,3621,3489,3593,3476,3563,3472,3575,3493,3597,3494,3576,3431,3539,3422,3468,3413,3481,3383,3519,3379,3513,3435,3522,3593,,,,,,,,,,,,,,,,,,,,,,,,,,,,,,,,,,,,,
3615,3601,3492,3601,3485,3567,3429,3527,3413,3543,3416,3493,3390,3484,3359,3481,3377,3497,3396,3507,3379,3446,3342,3439,3273,3428,3286,3400,3320,3398,3315,3454,3322,3606,,,,,,,,,,,,,,,,,,,,,,,,,,,,,,,,,,,,,
3875,3653,3751,3657,3749,3621,3700,3585,3675,3595,3678,3545,3654,3536,3619,3532,3639,3550,3658,3559,3641,3494,3602,3489,3533,3476,3548,3452,3583,3453,3583,3504,3593,3662,,,,,,,,,,,,,,,,,,,,,,,,,,,,,,,,,,,,,
3704,3701,3588,3704,3585,3670,3536,3634,3518,3652,3520,3600,3497,3600,3474,3598,3487,3614,3505,3613,3479,3550,3446,3546,3381,3532,3393,3509,3429,3514,3429,3570,3446,3734,,,,,,,,,,,,,,,,,,,,,,,,,,,,,,,,,,,,,
3767,3552,3657,3567,3653,3532,3608,3496,3591,3513,3598,3471,3572,3463,3546,3465,3563,3480,3583,3481,3557,3414,3527,3416,3458,3397,3472,3377,3513,3389,3515,3444,3522,3588,,,,,,,,,,,,,,,,,,,,,,,,,,,,,,,,,,,,,
3692,3695,3587,3713,3592,3679,3550,3645,3531,3666,3533,3617,3513,3608,3487,3611,3502,3634,3527,3637,3502,3567,3468,3567,3401,3554,3415,3524,3453,3540,3453,3595,3463,3756,,,,,,,,,,,,,,,,,,,,,,,,,,,,,,,,,,,,,
3864,3654,3762,3669,3764,3644,3725,3609,3706,3634,3712,3583,3688,3574,3662,3572,3676,3596,3702,3598,3673,3530,3639,3523,3570,3514,3591,3492,3634,3501,3628,3557,3637,3702,,,,,,,,,,,,,,,,,,,,,,,,,,,,,,,,,,,,,
3653,3661,3561,3679,3569,3656,3531,3626,3510,3641,3514,3589,3496,3584,3463,3592,3476,3615,3513,3615,3479,3541,3445,3543,3381,3535,3402,3510,3448,3524,3441,3579,3449,3721,,,,,,,,,,,,,,,,,,,,,,,,,,,,,,,,,,,,,
3795,3591,3696,3613,3702,3587,3670,3559,3653,3579,3656,3531,3634,3522,3608,3528,3622,3558,3656,3548,3626,3474,3589,3478,3524,3468,3544,3446,3592,3462,3587,3514,3595,3650,,,,,,,,,,,,,,,,,,,,,,,,,,,,,,,,,,,,,
3656,3661,3566,3682,3574,3661,3536,3632,3520,3656,3528,3608,3502,3596,3476,3597,3492,3622,3523,3623,3494,3550,3458,3552,3390,3540,3416,3520,3457,3536,3458,3593,3462,3732,,,,,,,,,,,,,,,,,,,,,,,,,,,,,,,,,,,,,
3753,3561,3662,3582,3679,3559,3636,3528,3624,3556,3628,3505,3605,3500,3582,3502,3597,3520,3626,3522,3593,3448,3562,3452,3502,3441,3520,3419,3561,3435,3561,3492,3567,3624,,,,,,,,,,,,,,,,,,,,,,,,,,,,,,,,,,,,,
3520,3530,3436,3557,3452,3533,3415,3509,3406,3533,3407,3485,3389,3478,3359,3483,3374,3498,3400,3498,3370,3429,3342,3427,3281,3418,3297,3402,3342,3419,3341,3470,3348,3608,,,,,,,,,,,,,,,,,,,,,,,,,,,,,,,,,,,,,
3725,3530,3636,3552,3649,3527,3611,3505,3606,3532,3609,3485,3582,3467,3557,3471,3567,3494,3595,3494,3570,3423,3536,3423,3475,3414,3494,3397,3543,3414,3537,3467,3541,3595,,,,,,,,,,,,,,,,,,,,,,,,,,,,,,,,,,,,,
3608,3628,3532,3657,3541,3632,3509,3610,3496,3636,3498,3580,3479,3578,3457,3579,3462,3596,3485,3601,3463,3530,3432,3533,3372,3523,3393,3505,3435,3519,3433,3571,3432,3714,,,,,,,,,,,,,,,,,,,,,,,,,,,,,,,,,,,,,
3767,3565,3671,3588,3686,3569,3648,3549,3641,3571,3641,3523,3624,3511,3598,3511,3611,3533,3635,3535,3610,3467,3574,3466,3517,3459,3537,3440,3576,3453,3583,3505,3580,3640,,,,,,,,,,,,,,,,,,,,,,,,,,,,,,,,,,,,,
3684,3697,3596,3713,3605,3693,3572,3667,3567,3687,3563,3644,3544,3637,3514,3644,3530,3656,3548,3663,3523,3589,3493,3591,3431,3582,3445,3556,3492,3575,3492,3623,3488,3773,,,,,,,,,,,,,,,,,,,,,,,,,,,,,,,,,,,,,
3821,3621,3728,3641,3738,3619,3700,3595,3693,3618,3702,3574,3670,3559,3649,3561,3657,3575,3682,3583,3657,3509,3626,3513,3561,3501,3579,3483,3623,3496,3619,3544,3623,3684,,,,,,,,,,,,,,,,,,,,,,,,,,,,,,,,,,,,,
3689,3709,3609,3732,3618,3706,3580,3683,3569,3706,3572,3656,3550,3643,3526,3645,3532,3661,3554,3665,3528,3592,3497,3593,3435,3588,3454,3562,3497,3578,3492,3626,3491,3780,,,,,,,,,,,,,,,,,,,,,,,,,,,,,,,,,,,,,
3822,3626,3732,3648,3740,3622,3697,3605,3695,3615,3699,3571,3678,3565,3652,3563,3660,3580,3679,3583,3661,3511,3627,3514,3562,3505,3582,3481,3621,3492,3617,3537,3621,3688,,,,,,,,,,,,,,,,,,,,,,,,,,,,,,,,,,,,,
3758,3773,3662,3784,3663,3762,3622,3735,3619,3752,3618,3704,3605,3700,3578,3701,3591,3715,3605,3722,3588,3649,3554,3653,3484,3640,3506,3618,3545,3628,3540,3674,3541,3835,,,,,,,,,,,,,,,,,,,,,,,,,,,,,,,,,,,,,
3862,3656,3756,3667,3757,3641,3718,3610,3706,3627,3712,3585,3691,3572,3666,3574,3679,3596,3701,3604,3680,3526,3641,3527,3575,3517,3595,3492,3636,3505,3630,3550,3632,3705,,,,,,,,,,,,,,,,,,,,,,,,,,,,,,,,,,,,,
3758,3756,3650,3766,3644,3738,3602,3714,3596,3730,3600,3686,3584,3676,3557,3678,3563,3691,3582,3701,3562,3630,3528,3624,3459,3615,3479,3593,3517,3601,3514,3647,3513,3810,,,,,,,,,,,,,,,,,,,,,,,,,,,,,,,,,,,,,
3887,3666,3769,3678,3767,3645,3717,3614,3713,3627,3715,3587,3696,3575,3667,3575,3680,3593,3697,3601,3678,3526,3639,3522,3575,3511,3591,3493,3632,3502,3628,3545,3628,3699,,,,,,,,,,,,,,,,,,,,,,,,,,,,,,,,,,,,,
3666,3650,3544,3658,3532,3623,3489,3597,3481,3611,3487,3570,3466,3559,3435,3563,3449,3572,3467,3587,3444,3515,3414,3510,3351,3498,3364,3479,3403,3485,3403,3532,3393,3689,,,,,,,,,,,,,,,,,,,,,,,,,,,,,,,,,,,,,
3890,3649,3744,3653,3731,3608,3682,3587,3675,3592,3682,3544,3657,3541,3627,3539,3639,3550,3657,3557,3634,3489,3600,3487,3531,3468,3552,3450,3588,3454,3583,3497,3580,3658,,,,,,,,,,,,,,,,,,,,,,,,,,,,,,,,,,,,,
3834,3795,3674,3779,3648,3741,3598,3718,3595,3727,3598,3679,3578,3673,3543,3670,3554,3682,3574,3695,3552,3617,3513,3611,3442,3601,3463,3583,3497,3587,3497,3631,3492,3800,,,,,,,,,,,,,,,,,,,,,,,,,,,,,,,,,,,,,
3948,3673,3754,3643,3725,3602,3680,3578,3670,3585,3671,3541,3653,3532,3618,3530,3631,3537,3648,3550,3627,3479,3588,3471,3520,3462,3544,3439,3579,3444,3583,3492,3579,3669,,,,,,,,,,,,,,,,,,,,,,,,,,,,,,,,,,,,,
3831,3740,3604,3699,3569,3657,3514,3630,3504,3630,3506,3589,3485,3576,3450,3578,3462,3580,3478,3600,3454,3528,3422,3527,3358,3514,3381,3497,3416,3502,3419,3552,3422,3743,,,,,,,,,,,,,,,,,,,,,,,,,,,,,,,,,,,,,
3955,3596,3652,3530,3605,3479,3553,3450,3536,3446,3528,3407,3515,3392,3481,3392,3492,3403,3510,3414,3493,3344,3452,3335,3388,3329,3416,3309,3448,3323,3455,3371,3467,3570,,,,,,,,,,,,,,,,,,,,,,,,,,,,,,,,,,,,,
4027,3765,3578,3650,3511,3595,3454,3558,3428,3548,3423,3509,3406,3496,3370,3497,3384,3506,3398,3519,3377,3448,3346,3442,3279,3435,3306,3413,3336,3427,3346,3487,3374,3725,,,,,,,,,,,,,,,,,,,,,,,,,,,,,,,,,,,,,
4917,4206,4128,3947,3994,3845,3913,3792,3875,3771,3853,3715,3826,3693,3778,3683,3788,3687,3800,3697,3774,3618,3723,3593,3641,3576,3661,3545,3696,3557,3697,3631,3761,3760,,,,,,,,,,,,,,,,,,,,,,,,,,,,,,,,,,,,,
#,raw_min,,,,,,,,,,,,,,,,,,,,,,,,,,,,,,,,,,,,,,,,,,,,,,,,,,,,,,,,,,,,,,,,,,,,,
2059,1746,1688,1673,1641,1599,1632,1567,1621,1607,1613,1528,1468,1518,1640,1628,1601,1553,1540,1524,1444,1494,1480,1474,1460,1307,1507,1491,1460,1491,1436,1325,1335,1623,,,,,,,,,,,,,,,,,,,,,,,,,,,,,,,,,,,,,
1831,1675,1650,1644,1622,1580,1626,1554,1618,1598,1611,1520,1461,1512,1644,1624,1597,1548,1538,1516,1438,1485,1475,1463,1460,1493,1542,1376,1445,1469,1400,1270,1263,1379,,,,,,,,,,,,,,,,,,,,,,,,,,,,,,,,,,,,,
1745,1636,1620,1622,1601,1565,1608,1542,1605,1590,1598,1513,1451,1504,1629,1613,1580,1537,1525,1505,1423,1475,1461,1453,1436,1392,1363,1355,1428,1451,1378,1250,1232,1324,,,,,,,,,,,,,,,,,,,,,,,,,,,,,,,,,,,,,
1690,1599,1590,1593,1582,1545,1591,1525,1589,1571,1582,1497,1440,1486,1610,1590,1563,1518,1513,1490,1412,1460,1450,1436,1423,1372,1350,1340,1411,1427,1360,1229,1208,1280,,,,,,,,,,,,,,,,,,,,,,,,,,,,,,,,,,,,,
1717,1637,1629,1638,1623,1595,1639,1575,1636,1621,1629,1544,1485,1538,1661,1645,1611,1570,1557,1537,1453,1506,1494,1484,1466,1417,1387,1384,1453,1471,1398,1267,1243,1314,,,,,,,,,,,,,,,,,,,,,,,,,,,,,,,,,,,,,
1686,1613,1609,1617,1606,1576,1626,1559,1622,1603,1615,1526,1472,1522,1648,1624,1595,1553,1544,1521,1440,1487,1479,1468,1455,1404,1379,1371,1442,1460,1386,1253,1229,1296,,,,,,,,,,,,,,,,,,,,,,,,,,,,,,,,,,,,,
1664,1596,1596,1608,1595,1571,1615,1556,1616,1598,1610,1528,1471,1521,1640,1621,1587,1551,1537,1518,1436,1487,1474,1463,1446,1401,1372,1367,1433,1449,1376,1245,1218,1287,,,,,,,,,,,,,,,,,,,,,,,,,,,,,,,,,,,,,
1652,1590,1592,1601,1593,1566,1613,1550,1614,1594,1609,1524,1472,1521,1642,1617,1588,1547,1541,1516,1439,1486,1476,1460,1445,1395,1371,1363,1433,1442,1373,1240,1203,1264,,,,,,,,,,,,,,,,,,,,,,,,,,,,,,,,,,,,,
1660,1604,1605,1619,1608,1586,1631,1574,1633,1617,1626,1547,1491,1543,1663,1638,1603,1569,1557,1537,1456,1506,1492,1479,1462,1412,1382,1379,1445,1462,1383,1237,1218,1297,,,,,,,,,,,,,,,,,,,,,,,,,,,,,,,,,,,,,
1631,1573,1581,1590,1582,1558,1609,1546,1611,1592,1605,1520,1469,1520,1640,1613,1581,1544,1537,1511,1436,1482,1470,1456,1443,1389,1365,1356,1422,1433,1343,1222,1205,1265,,,,,,,,,,,,,,,,,,,,,,,,,,,,,,,,,,,,,
1631,1580,1583,1597,1587,1567,1611,1555,1617,1601,1609,1529,1475,1528,1645,1622,1585,1552,1541,1518,1441,1488,1474,1464,1448,1397,1367,1364,1424,1424,1361,1236,1206,1270,,,,,,,,,,,,,,,,,,,,,,,,,,,,,,,,,,,,,
1576,1524,1531,1544,1536,1515,1561,1506,1568,1551,1562,1481,1433,1482,1597,1568,1539,1503,1494,1470,1396,1442,1432,1418,1407,1351,1323,1312,1365,1387,1325,1195,1172,1225,,,,,,,,,,,,,,,,,,,,,,,,,,,,,,,,,,,,,
1644,1597,1599,1617,1604,1587,1632,1577,1637,1623,1632,1551,1500,1554,1671,1645,1607,1576,1561,1540,1460,1511,1499,1483,1467,1418,1376,1361,1442,1458,1383,1250,1222,1283,,,,,,,,,,,,,,,,,,,,,,,,,,,,,,,,,,,,,
1605,1557,1564,1580,1570,1549,1599,1540,1603,1582,1597,1516,1469,1520,1637,1606,1574,1540,1531,1503,1430,1479,1464,1449,1435,1381,1345,1345,1413,1425,1352,1218,1195,1251,,,,,,,,,,,,,,,,,,,,,,,,,,,,,,,,,,,,,
1625,1579,1588,1607,1592,1572,1621,1563,1624,1606,1619,1543,1490,1546,1660,1630,1595,1564,1551,1527,1445,1498,1485,1474,1455,1402,1370,1367,1431,1447,1368,1236,1210,1274,,,,,,,,,,,,,,,,,,,,,,,,,,,,,,,,,,,,,
1583,1536,1546,1561,1555,1532,1578,1519,1582,1564,1577,1499,1452,1502,1620,1587,1554,1522,1513,1486,1412,1455,1447,1434,1421,1365,1337,1330,1395,1406,1333,1199,1175,1233,,,,,,,,,,,,,,,,,,,,,,,,,,,,,,,,,,,,,
1641,1597,1606,1624,1611,1594,1638,1580,1641,1625,1634,1555,1509,1564,1681,1650,1612,1587,1574,1549,1467,1515,1501,1492,1475,1419,1388,1386,1449,1465,1386,1252,1222,1285,,,,,,,,,,,,,,,,,,,,,,,,,,,,,,,,,,,,,
1610,1563,1574,1589,1583,1562,1611,1552,1613,1593,1605,1523,1472,1529,1652,1618,1584,1556,1546,1516,1437,1485,1476,1463,1448,1389,1363,1358,1425,1437,1361,1226,1199,1260,,,,,,,,,,,,,,,,,,,,,,,,,,,,,,,,,,,,,
1645,1595,1602,1625,1617,1599,1643,1587,1645,1629,1642,1556,1501,1563,1685,1661,1622,1589,1575,1553,1470,1519,1507,1497,1482,1425,1392,1386,1452,1469,1391,1255,1223,1292,,,,,,,,,,,,,,,,,,,,,,,,,,,,,,,,,,,,,
1668,1614,1624,1642,1639,1615,1665,1602,1667,1649,1662,1575,1525,1578,1707,1677,1645,1608,1598,1572,1491,1542,1529,1516,1502,1443,1415,1404,1475,1488,1414,1272,1245,1308,,,,,,,,,,,,,,,,,,,,,,,,,,,,,,,,,,,,,
1669,1618,1624,1647,1637,1621,1666,1606,1667,1652,1665,1581,1526,1583,1704,1680,1645,1610,1598,1575,1495,1545,1530,1519,1503,1451,1416,1409,1475,1491,1412,1279,1246,1313,,,,,,,,,,,,,,,,,,,,,,,,,,,,,,,,,,,,,
1665,1613,1626,1641,1637,1613,1663,1602,1665,1647,1659,1572,1522,1578,1701,1672,1639,1605,1596,1570,1494,1540,1528,1511,1501,1446,1415,1405,1472,1483,1410,1273,1246,1306,,,,,,,,,,,,,,,,,,,,,,,,,,,,,,,,,,,,,
1642,1594,1602,1622,1612,1590,1639,1578,1638,1621,1628,1552,1500,1561,1676,1653,1614,1584,1572,1550,1470,1521,1507,1496,1480,1430,1397,1389,1452,1463,1391,1260,1231,1293,,,,,,,,,,,,,,,,,,,,,,,,,,,,,,,,,,,,,
1667,1613,1624,1641,1634,1609,1661,1602,1662,1641,1653,1570,1520,1576,1699,1671,1638,1603,1594,1568,1493,1539,1530,1514,1501,1447,1417,1406,1474,1482,1410,1276,1251,1312,,,,,,,,,,,,,,,,,,,,,,,,,,,,,,,,,,,,,
1695,1647,1648,1661,1664,1641,1688,1629,1690,1675,1682,1599,1544,1607,1729,1703,1666,1634,1618,1596,1514,1567,1551,1542,1524,1473,1439,1432,1498,1510,1431,1299,1269,1336,,,,,,,,,,,,,,,,,,,,,,,,,,,,,,,,,,,,,
1678,1622,1617,1646,1641,1615,1666,1603,1666,1649,1661,1576,1525,1577,1700,1679,1647,1605,1598,1571,1488,1542,1530,1517,1504,1451,1421,1410,1479,1489,1415,1280,1252,1317,,,,,,,,,,,,,,,,,,,,,,,,,,,,,,,,,,,,,
1692,1636,1643,1663,1652,1630,1675,1616,1675,1661,1671,1588,1533,1587,1713,1697,1657,1617,1604,1581,1495,1553,1538,1529,1512,1463,1430,1422,1488,1502,1425,1292,1262,1329,,,,,,,,,,,,,,,,,,,,,,,,,,,,,,,,,,,,,
1701,1638,1650,1662,1654,1626,1677,1614,1676,1657,1672,1586,1534,1586,1711,1686,1659,1612,1601,1576,1496,1550,1538,1528,1514,1459,1434,1421,1488,1500,1428,1290,1263,1326,,,,,,,,,,,,,,,,,,,,,,,,,,,,,,,,,,,,,
1713,1655,1660,1678,1665,1638,1685,1623,1684,1671,1679,1596,1540,1596,1719,1698,1666,1626,1609,1591,1503,1562,1546,1539,1521,1470,1444,1436,1499,1511,1434,1302,1277,1349,,,,,,,,,,,,,,,,,,,,,,,,,,,,,,,,,,,,,
1668,1604,1607,1622,1615,1587,1633,1569,1631,1615,1627,1543,1490,1539,1661,1638,1614,1572,1557,1534,1454,1507,1498,1485,1472,1424,1401,1390,1457,1469,1396,1261,1236,1303,,,,,,,,,,,,,,,,,,,,,,,,,,,,,,,,,,,,,
1728,1662,1662,1676,1663,1637,1681,1619,1681,1666,1674,1593,1534,1588,1711,1691,1655,1614,1602,1581,1497,1552,1539,1536,1517,1471,1443,1437,1503,1519,1443,1309,1279,1354,,,,,,,,,,,,,,,,,,,,,,,,,,,,,,,,,,,,,
1694,1620,1619,1628,1620,1590,1638,1572,1634,1617,1628,1544,1490,1538,1663,1643,1611,1566,1557,1535,1458,1506,1501,1487,1479,1430,1407,1396,1464,1476,1407,1272,1249,1318,,,,,,,,,,,,,,,,,,,,,,,,,,,,,,,,,,,,,
1755,1675,1668,1680,1665,1634,1677,1615,1676,1663,1670,1587,1525,1581,1704,1687,1651,1608,1594,1575,1491,1545,1536,1526,1517,1466,1433,1434,1499,1517,1444,1308,1280,1360,,,,,,,,,,,,,,,,,,,,,,,,,,,,,,,,,,,,,
1780,1682,1676,1681,1669,1633,1676,1609,1677,1658,1671,1583,1524,1574,1703,1682,1651,1602,1594,1571,1491,1539,1535,1521,1515,1468,1438,1431,1504,1514,1447,1310,1287,1367,,,,,,,,,,,,,,,,,,,,,,,,,,,,,,,,,,,,,
1835,1721,1703,1709,1688,1656,1696,1628,1691,1679,1686,1600,1537,1588,1718,1704,1667,1620,1607,1589,1506,1567,1549,1547,1530,1485,1455,1450,1518,1539,1468,1337,1314,1405,,,,,,,,,,,,,,,,,,,,,,,,,,,,,,,,,,,,,
1876,1717,1687,1690,1672,1631,1675,1602,1667,1650,1661,1572,1513,1560,1691,1674,1643,1589,1583,1562,1484,1534,1528,1518,1503,1454,1432,1428,1504,1520,1459,1326,1318,1431,,,,,,,,,,,,,,,,,,,,,,,,,,,,,,,,,,,,,
2204,1839,1760,1763,1736,1695,1726,1658,1716,1704,1710,1624,1557,1609,1737,1729,1693,1639,1628,1611,1531,1587,1576,1568,1551,1513,1487,1484,1557,1587,1527,1418,1423,1752,,,,,,,,,,,,,,,,,,,,,,,,,,,,,,,,,,,,,
#,raw_row_delta_max,,,,,,,,,,,,,,,,,,,,,,,,,,,,,,,,,,,,,,,,,,,,,,,,,,,,,,,,,,,,,,,,,,,,,
1200,1000,1000,1000,1000,1000,1000,1000,1000,1000,1000,1000,1000,1000,1000,1000,1000,1000,1000,1000,1000,1000,1000,1000,1200,1200,1200,1000,1000,1000,1000,1000,1000,1200,,,,,,,,,,,,,,,,,,,,,,,,,,,,,,,,,,,,,
800,800,800,800,800,800,800,800,800,800,800,800,800,800,800,800,800,800,800,800,800,800,800,800,1200,1200,1200,800,800,800,800,800,800,800,,,,,,,,,,,,,,,,,,,,,,,,,,,,,,,,,,,,,
800,800,800,800,800,800,800,800,800,800,800,800,800,800,800,800,800,800,800,800,800,800,800,800,800,800,800,800,800,800,800,800,800,800,,,,,,,,,,,,,,,,,,,,,,,,,,,,,,,,,,,,,
800,800,800,800,800,800,800,800,800,800,800,800,800,800,800,800,800,800,800,800,800,800,800,800,800,800,800,800,800,800,800,800,800,800,,,,,,,,,,,,,,,,,,,,,,,,,,,,,,,,,,,,,
800,800,800,800,800,800,800,800,800,800,800,800,800,800,800,800,800,800,800,800,800,800,800,800,800,800,800,800,800,800,800,800,800,800,,,,,,,,,,,,,,,,,,,,,,,,,,,,,,,,,,,,,
800,800,800,800,800,800,800,800,800,800,800,800,800,800,800,800,800,800,800,800,800,800,800,800,800,800,800,800,800,800,800,800,800,800,,,,,,,,,,,,,,,,,,,,,,,,,,,,,,,,,,,,,
800,800,800,800,800,800,800,800,800,800,800,800,800,800,800,800,800,800,800,800,800,800,800,800,800,800,800,800,800,800,800,800,800,800,,,,,,,,,,,,,,,,,,,,,,,,,,,,,,,,,,,,,
800,800,800,800,800,800,800,800,800,800,800,800,800,800,800,800,800,800,800,800,800,800,800,800,800,800,800,800,800,800,800,800,800,800,,,,,,,,,,,,,,,,,,,,,,,,,,,,,,,,,,,,,
800,800,800,800,800,800,800,800,800,800,800,800,800,800,800,800,800,800,800,800,800,800,800,800,800,800,800,800,800,800,800,800,800,800,,,,,,,,,,,,,,,,,,,,,,,,,,,,,,,,,,,,,
800,800,800,800,800,800,800,800,800,800,800,800,800,800,800,800,800,800,800,800,800,800,800,800,800,800,800,800,800,800,800,800,800,800,,,,,,,,,,,,,,,,,,,,,,,,,,,,,,,,,,,,,
800,800,800,800,800,800,800,800,800,800,800,800,800,800,800,800,800,800,800,800,800,800,800,800,800,800,800,800,800,800,800,800,800,800,,,,,,,,,,,,,,,,,,,,,,,,,,,,,,,,,,,,,
800,800,800,800,800,800,800,800,800,800,800,800,800,800,800,800,800,800,800,800,800,800,800,800,800,800,800,800,800,800,800,800,800,800,,,,,,,,,,,,,,,,,,,,,,,,,,,,,,,,,,,,,
800,800,800,800,800,800,800,800,800,800,800,800,800,800,800,800,800,800,800,800,800,800,800,800,800,800,800,800,800,800,800,800,800,800,,,,,,,,,,,,,,,,,,,,,,,,,,,,,,,,,,,,,
800,800,800,800,800,800,800,800,800,800,800,800,800,800,800,800,800,800,800,800,800,800,800,800,800,800,800,800,800,800,800,800,800,800,,,,,,,,,,,,,,,,,,,,,,,,,,,,,,,,,,,,,
800,800,800,800,800,800,800,800,800,800,800,800,800,800,800,800,800,800,800,800,800,800,800,800,800,800,800,800,800,800,800,800,800,800,,,,,,,,,,,,,,,,,,,,,,,,,,,,,,,,,,,,,
800,800,800,800,800,800,800,800,800,800,800,800,800,800,800,800,800,800,800,800,800,800,800,800,800,800,800,800,800,800,800,800,800,800,,,,,,,,,,,,,,,,,,,,,,,,,,,,,,,,,,,,,
800,800,800,800,800,800,800,800,800,800,800,800,800,800,800,800,800,800,800,800,800,800,800,800,800,800,800,800,800,800,800,800,800,800,,,,,,,,,,,,,,,,,,,,,,,,,,,,,,,,,,,,,
800,800,800,800,800,800,800,800,800,800,800,800,800,800,800,800,800,800,800,800,800,800,800,800,800,800,800,800,800,800,800,800,800,800,,,,,,,,,,,,,,,,,,,,,,,,,,,,,,,,,,,,,
800,800,800,800,800,800,800,800,800,800,800,800,800,800,800,800,800,800,800,800,800,800,800,800,800,800,800,800,800,800,800,800,800,800,,,,,,,,,,,,,,,,,,,,,,,,,,,,,,,,,,,,,
800,800,800,800,800,800,800,800,800,800,800,800,800,800,800,800,800,800,800,800,800,800,800,800,800,800,800,800,800,800,800,800,800,800,,,,,,,,,,,,,,,,,,,,,,,,,,,,,,,,,,,,,
800,800,800,800,800,800,800,800,800,800,800,800,800,800,800,800,800,800,800,800,800,800,800,800,800,800,800,800,800,800,800,800,800,800,,,,,,,,,,,,,,,,,,,,,,,,,,,,,,,,,,,,,
800,800,800,800,800,800,800,800,800,800,800,800,800,800,800,800,800,800,800,800,800,800,800,800,800,800,800,800,800,800,800,800,800,800,,,,,,,,,,,,,,,,,,,,,,,,,,,,,,,,,,,,,
800,800,800,800,800,800,800,800,800,800,800,800,800,800,800,800,800,800,800,800,800,800,800,800,800,800,800,800,800,800,800,800,800,800,,,,,,,,,,,,,,,,,,,,,,,,,,,,,,,,,,,,,
800,800,800,800,800,800,800,800,800,800,800,800,800,800,800,800,800,800,800,800,800,800,800,800,800,800,800,800,800,800,800,800,800,800,,,,,,,,,,,,,,,,,,,,,,,,,,,,,,,,,,,,,
800,800,800,800,800,800,800,800,800,800,800,800,800,800,800,800,800,800,800,800,800,800,800,800,800,800,800,800,800,800,800,800,800,800,,,,,,,,,,,,,,,,,,,,,,,,,,,,,,,,,,,,,
800,800,800,800,800,800,800,800,800,800,800,800,800,800,800,800,800,800,800,800,800,800,800,800,800,800,800,800,800,800,800,800,800,800,,,,,,,,,,,,,,,,,,,,,,,,,,,,,,,,,,,,,
800,800,800,800,800,800,800,800,800,800,800,800,800,800,800,800,800,800,800,800,800,800,800,800,800,800,800,800,800,800,800,800,800,800,,,,,,,,,,,,,,,,,,,,,,,,,,,,,,,,,,,,,
800,800,800,800,800,800,800,800,800,800,800,800,800,800,800,800,800,800,800,800,800,800,800,800,800,800,800,800,800,800,800,800,800,800,,,,,,,,,,,,,,,,,,,,,,,,,,,,,,,,,,,,,
800,800,800,800,800,800,800,800,800,800,800,800,800,800,800,800,800,800,800,800,800,800,800,800,800,800,800,800,800,800,800,800,800,800,,,,,,,,,,,,,,,,,,,,,,,,,,,,,,,,,,,,,
800,800,800,800,800,800,800,800,800,800,800,800,800,800,800,800,800,800,800,800,800,800,800,800,800,800,800,800,800,800,800,800,800,800,,,,,,,,,,,,,,,,,,,,,,,,,,,,,,,,,,,,,
800,800,800,800,800,800,800,800,800,800,800,800,800,800,800,800,800,800,800,800,800,800,800,800,800,800,800,800,800,800,800,800,800,800,,,,,,,,,,,,,,,,,,,,,,,,,,,,,,,,,,,,,
800,800,800,800,800,800,800,800,800,800,800,800,800,800,800,800,800,800,800,800,800,800,800,800,800,800,800,800,800,800,800,800,800,800,,,,,,,,,,,,,,,,,,,,,,,,,,,,,,,,,,,,,
800,800,800,800,800,800,800,800,800,800,800,800,800,800,800,800,800,800,800,800,800,800,800,800,800,800,800,800,800,800,800,800,800,800,,,,,,,,,,,,,,,,,,,,,,,,,,,,,,,,,,,,,
800,800,800,800,800,800,800,800,800,800,800,800,800,800,800,800,800,800,800,800,800,800,800,800,800,800,800,800,800,800,800,800,800,800,,,,,,,,,,,,,,,,,,,,,,,,,,,,,,,,,,,,,
800,800,800,800,800,800,800,800,800,800,800,800,800,800,800,800,800,800,800,800,800,800,800,800,800,800,800,800,800,800,800,800,800,800,,,,,,,,,,,,,,,,,,,,,,,,,,,,,,,,,,,,,
1200,1000,1000,1000,1000,1000,1000,1000,1000,1000,1000,1000,1000,1000,1000,1000,1000,1000,1000,1000,1000,1000,1000,1000,1000,1000,1000,1000,1000,1000,1000,1000,1000,1200,,,,,,,,,,,,,,,,,,,,,,,,,,,,,,,,,,,,,
#,raw_row_delta_min,,,,,,,,,,,,,,,,,,,,,,,,,,,,,,,,,,,,,,,,,,,,,,,,,,,,,,,,,,,,,,,,,,,,,
-1200,-1000,-1000,-1000,-1000,-1000,-1000,-1000,-1000,-1000,-1000,-1000,-1000,-1000,-1000,-1000,-1000,-1000,-1000,-1000,-1000,-1000,-1000,-1000,-1200,-1200,-1200,-1000,-1000,-1000,-1000,-1000,-1000,-1200,,,,,,,,,,,,,,,,,,,,,,,,,,,,,,,,,,,,,
-800,-800,-800,-800,-800,-800,-800,-800,-800,-800,-800,-800,-800,-800,-800,-800,-800,-800,-800,-800,-800,-800,-800,-800,-1200,-1200,-1200,-800,-800,-800,-800,-800,-800,-800,,,,,,,,,,,,,,,,,,,,,,,,,,,,,,,,,,,,,
-800,-800,-800,-800,-800,-800,-800,-800,-800,-800,-800,-800,-800,-800,-800,-800,-800,-800,-800,-800,-800,-800,-800,-800,-800,-800,-800,-800,-800,-800,-800,-800,-800,-800,,,,,,,,,,,,,,,,,,,,,,,,,,,,,,,,,,,,,
-800,-800,-800,-800,-800,-800,-800,-800,-800,-800,-800,-800,-800,-800,-800,-800,-800,-800,-800,-800,-800,-800,-800,-800,-800,-800,-800,-800,-800,-800,-800,-800,-800,-800,,,,,,,,,,,,,,,,,,,,,,,,,,,,,,,,,,,,,
-800,-800,-800,-800,-800,-800,-800,-800,-800,-800,-800,-800,-800,-800,-800,-800,-800,-800,-800,-800,-800,-800,-800,-800,-800,-800,-800,-800,-800,-800,-800,-800,-800,-800,,,,,,,,,,,,,,,,,,,,,,,,,,,,,,,,,,,,,
-800,-800,-800,-800,-800,-800,-800,-800,-800,-800,-800,-800,-800,-800,-800,-800,-800,-800,-800,-800,-800,-800,-800,-800,-800,-800,-800,-800,-800,-800,-800,-800,-800,-800,,,,,,,,,,,,,,,,,,,,,,,,,,,,,,,,,,,,,
-800,-800,-800,-800,-800,-800,-800,-800,-800,-800,-800,-800,-800,-800,-800,-800,-800,-800,-800,-800,-800,-800,-800,-800,-800,-800,-800,-800,-800,-800,-800,-800,-800,-800,,,,,,,,,,,,,,,,,,,,,,,,,,,,,,,,,,,,,
-800,-800,-800,-800,-800,-800,-800,-800,-800,-800,-800,-800,-800,-800,-800,-800,-800,-800,-800,-800,-800,-800,-800,-800,-800,-800,-800,-800,-800,-800,-800,-800,-800,-800,,,,,,,,,,,,,,,,,,,,,,,,,,,,,,,,,,,,,
-800,-800,-800,-800,-800,-800,-800,-800,-800,-800,-800,-800,-800,-800,-800,-800,-800,-800,-800,-800,-800,-800,-800,-800,-800,-800,-800,-800,-800,-800,-800,-800,-800,-800,,,,,,,,,,,,,,,,,,,,,,,,,,,,,,,,,,,,,
-800,-800,-800,-800,-800,-800,-800,-800,-800,-800,-800,-800,-800,-800,-800,-800,-800,-800,-800,-800,-800,-800,-800,-800,-800,-800,-800,-800,-800,-800,-800,-800,-800,-800,,,,,,,,,,,,,,,,,,,,,,,,,,,,,,,,,,,,,
-800,-800,-800,-800,-800,-800,-800,-800,-800,-800,-800,-800,-800,-800,-800,-800,-800,-800,-800,-800,-800,-800,-800,-800,-800,-800,-800,-800,-800,-800,-800,-800,-800,-800,,,,,,,,,,,,,,,,,,,,,,,,,,,,,,,,,,,,,
-800,-800,-800,-800,-800,-800,-800,-800,-800,-800,-800,-800,-800,-800,-800,-800,-800,-800,-800,-800,-800,-800,-800,-800,-800,-800,-800,-800,-800,-800,-800,-800,-800,-800,,,,,,,,,,,,,,,,,,,,,,,,,,,,,,,,,,,,,
-800,-800,-800,-800,-800,-800,-800,-800,-800,-800,-800,-800,-800,-800,-800,-800,-800,-800,-800,-800,-800,-800,-800,-800,-800,-800,-800,-800,-800,-800,-800,-800,-800,-800,,,,,,,,,,,,,,,,,,,,,,,,,,,,,,,,,,,,,
-800,-800,-800,-800,-800,-800,-800,-800,-800,-800,-800,-800,-800,-800,-800,-800,-800,-800,-800,-800,-800,-800,-800,-800,-800,-800,-800,-800,-800,-800,-800,-800,-800,-800,,,,,,,,,,,,,,,,,,,,,,,,,,,,,,,,,,,,,
-800,-800,-800,-800,-800,-800,-800,-800,-800,-800,-800,-800,-800,-800,-800,-800,-800,-800,-800,-800,-800,-800,-800,-800,-800,-800,-800,-800,-800,-800,-800,-800,-800,-800,,,,,,,,,,,,,,,,,,,,,,,,,,,,,,,,,,,,,
-800,-800,-800,-800,-800,-800,-800,-800,-800,-800,-800,-800,-800,-800,-800,-800,-800,-800,-800,-800,-800,-800,-800,-800,-800,-800,-800,-800,-800,-800,-800,-800,-800,-800,,,,,,,,,,,,,,,,,,,,,,,,,,,,,,,,,,,,,
-800,-800,-800,-800,-800,-800,-800,-800,-800,-800,-800,-800,-800,-800,-800,-800,-800,-800,-800,-800,-800,-800,-800,-800,-800,-800,-800,-800,-800,-800,-800,-800,-800,-800,,,,,,,,,,,,,,,,,,,,,,,,,,,,,,,,,,,,,
-800,-800,-800,-800,-800,-800,-800,-800,-800,-800,-800,-800,-800,-800,-800,-800,-800,-800,-800,-800,-800,-800,-800,-800,-800,-800,-800,-800,-800,-800,-800,-800,-800,-800,,,,,,,,,,,,,,,,,,,,,,,,,,,,,,,,,,,,,
-800,-800,-800,-800,-800,-800,-800,-800,-800,-800,-800,-800,-800,-800,-800,-800,-800,-800,-800,-800,-800,-800,-800,-800,-800,-800,-800,-800,-800,-800,-800,-800,-800,-800,,,,,,,,,,,,,,,,,,,,,,,,,,,,,,,,,,,,,
-800,-800,-800,-800,-800,-800,-800,-800,-800,-800,-800,-800,-800,-800,-800,-800,-800,-800,-800,-800,-800,-800,-800,-800,-800,-800,-800,-800,-800,-800,-800,-800,-800,-800,,,,,,,,,,,,,,,,,,,,,,,,,,,,,,,,,,,,,
-800,-800,-800,-800,-800,-800,-800,-800,-800,-800,-800,-800,-800,-800,-800,-800,-800,-800,-800,-800,-800,-800,-800,-800,-800,-800,-800,-800,-800,-800,-800,-800,-800,-800,,,,,,,,,,,,,,,,,,,,,,,,,,,,,,,,,,,,,
-800,-800,-800,-800,-800,-800,-800,-800,-800,-800,-800,-800,-800,-800,-800,-800,-800,-800,-800,-800,-800,-800,-800,-800,-800,-800,-800,-800,-800,-800,-800,-800,-800,-800,,,,,,,,,,,,,,,,,,,,,,,,,,,,,,,,,,,,,
-800,-800,-800,-800,-800,-800,-800,-800,-800,-800,-800,-800,-800,-800,-800,-800,-800,-800,-800,-800,-800,-800,-800,-800,-800,-800,-800,-800,-800,-800,-800,-800,-800,-800,,,,,,,,,,,,,,,,,,,,,,,,,,,,,,,,,,,,,
-800,-800,-800,-800,-800,-800,-800,-800,-800,-800,-800,-800,-800,-800,-800,-800,-800,-800,-800,-800,-800,-800,-800,-800,-800,-800,-800,-800,-800,-800,-800,-800,-800,-800,,,,,,,,,,,,,,,,,,,,,,,,,,,,,,,,,,,,,
-800,-800,-800,-800,-800,-800,-800,-800,-800,-800,-800,-800,-800,-800,-800,-800,-800,-800,-800,-800,-800,-800,-800,-800,-800,-800,-800,-800,-800,-800,-800,-800,-800,-800,,,,,,,,,,,,,,,,,,,,,,,,,,,,,,,,,,,,,
-800,-800,-800,-800,-800,-800,-800,-800,-800,-800,-800,-800,-800,-800,-800,-800,-800,-800,-800,-800,-800,-800,-800,-800,-800,-800,-800,-800,-800,-800,-800,-800,-800,-800,,,,,,,,,,,,,,,,,,,,,,,,,,,,,,,,,,,,,
-800,-800,-800,-800,-800,-800,-800,-800,-800,-800,-800,-800,-800,-800,-800,-800,-800,-800,-800,-800,-800,-800,-800,-800,-800,-800,-800,-800,-800,-800,-800,-800,-800,-800,,,,,,,,,,,,,,,,,,,,,,,,,,,,,,,,,,,,,
-800,-800,-800,-800,-800,-800,-800,-800,-800,-800,-800,-800,-800,-800,-800,-800,-800,-800,-800,-800,-800,-800,-800,-800,-800,-800,-800,-800,-800,-800,-800,-800,-800,-800,,,,,,,,,,,,,,,,,,,,,,,,,,,,,,,,,,,,,
-800,-800,-800,-800,-800,-800,-800,-800,-800,-800,-800,-800,-800,-800,-800,-800,-800,-800,-800,-800,-800,-800,-800,-800,-800,-800,-800,-800,-800,-800,-800,-800,-800,-800,,,,,,,,,,,,,,,,,,,,,,,,,,,,,,,,,,,,,
-800,-800,-800,-800,-800,-800,-800,-800,-800,-800,-800,-800,-800,-800,-800,-800,-800,-800,-800,-800,-800,-800,-800,-800,-800,-800,-800,-800,-800,-800,-800,-800,-800,-800,,,,,,,,,,,,,,,,,,,,,,,,,,,,,,,,,,,,,
-800,-800,-800,-800,-800,-800,-800,-800,-800,-800,-800,-800,-800,-800,-800,-800,-800,-800,-800,-800,-800,-800,-800,-800,-800,-800,-800,-800,-800,-800,-800,-800,-800,-800,,,,,,,,,,,,,,,,,,,,,,,,,,,,,,,,,,,,,
-800,-800,-800,-800,-800,-800,-800,-800,-800,-800,-800,-800,-800,-800,-800,-800,-800,-800,-800,-800,-800,-800,-800,-800,-800,-800,-800,-800,-800,-800,-800,-800,-800,-800,,,,,,,,,,,,,,,,,,,,,,,,,,,,,,,,,,,,,
-800,-800,-800,-800,-800,-800,-800,-800,-800,-800,-800,-800,-800,-800,-800,-800,-800,-800,-800,-800,-800,-800,-800,-800,-800,-800,-800,-800,-800,-800,-800,-800,-800,-800,,,,,,,,,,,,,,,,,,,,,,,,,,,,,,,,,,,,,
-800,-800,-800,-800,-800,-800,-800,-800,-800,-800,-800,-800,-800,-800,-800,-800,-800,-800,-800,-800,-800,-800,-800,-800,-800,-800,-800,-800,-800,-800,-800,-800,-800,-800,,,,,,,,,,,,,,,,,,,,,,,,,,,,,,,,,,,,,
-800,-800,-800,-800,-800,-800,-800,-800,-800,-800,-800,-800,-800,-800,-800,-800,-800,-800,-800,-800,-800,-800,-800,-800,-800,-800,-800,-800,-800,-800,-800,-800,-800,-800,,,,,,,,,,,,,,,,,,,,,,,,,,,,,,,,,,,,,
-1200,-1000,-1000,-1000,-1000,-1000,-1000,-1000,-1000,-1000,-1000,-1000,-1000,-1000,-1000,-1000,-1000,-1000,-1000,-1000,-1000,-1000,-1000,-1000,-1000,-1000,-1000,-1000,-1000,-1000,-1000,-1000,-1000,-1200,,,,,,,,,,,,,,,,,,,,,,,,,,,,,,,,,,,,,
#,raw_col_delta_max,,,,,,,,,,,,,,,,,,,,,,,,,,,,,,,,,,,,,,,,,,,,,,,,,,,,,,,,,,,,,,,,,,,,,
1200,1000,1000,1000,1000,1000,1000,1000,1000,1000,1000,1000,1000,1000,1000,1000,1000,1000,1000,1000,1000,1000,1000,1000,1200,1200,1200,1000,1000,1000,1000,1000,1200,,,,,,,,,,,,,,,,,,,,,,,,,,,,,,,,,,,,,,
800,800,800,800,800,800,800,800,800,800,800,800,800,800,800,800,800,800,800,800,800,800,800,800,1200,1200,1200,800,800,800,800,800,800,,,,,,,,,,,,,,,,,,,,,,,,,,,,,,,,,,,,,,
800,800,800,800,800,800,800,800,800,800,800,800,800,800,800,800,800,800,800,800,800,800,800,800,800,800,800,800,800,800,800,800,800,,,,,,,,,,,,,,,,,,,,,,,,,,,,,,,,,,,,,,
800,800,800,800,800,800,800,800,800,800,800,800,800,800,800,800,800,800,800,800,800,800,800,800,800,800,800,800,800,800,800,800,800,,,,,,,,,,,,,,,,,,,,,,,,,,,,,,,,,,,,,,
800,800,800,800,800,800,800,800,800,800,800,800,800,800,800,800,800,800,800,800,800,800,800,800,800,800,800,800,800,800,800,800,800,,,,,,,,,,,,,,,,,,,,,,,,,,,,,,,,,,,,,,
800,800,800,800,800,800,800,800,800,800,800,800,800,800,800,800,800,800,800,800,800,800,800,800,800,800,800,800,800,800,800,800,800,,,,,,,,,,,,,,,,,,,,,,,,,,,,,,,,,,,,,,
800,800,800,800,800,800,800,800,800,800,800,800,800,800,800,800,800,800,800,800,800,800,800,800,800,800,800,800,800,800,800,800,800,,,,,,,,,,,,,,,,,,,,,,,,,,,,,,,,,,,,,,
800,800,800,800,800,800,800,800,800,800,800,800,800,800,800,800,800,800,800,800,800,800,800,800,800,800,800,800,800,800,800,800,800,,,,,,,,,,,,,,,,,,,,,,,,,,,,,,,,,,,,,,
800,800,800,800,800,800,800,800,800,800,800,800,800,800,800,800,800,800,800,800,800,800,800,800,800,800,800,800,800,800,800,800,800,,,,,,,,,,,,,,,,,,,,,,,,,,,,,,,,,,,,,,
800,800,800,800,800,800,800,800,800,800,800,800,800,800,800,800,800,800,800,800,800,800,800,800,800,800,800,800,800,800,800,800,800,,,,,,,,,,,,,,,,,,,,,,,,,,,,,,,,,,,,,,
800,800,800,800,800,800,800,800,800,800,800,800,800,800,800,800,800,800,800,800,800,800,800,800,800,800,800,800,800,800,800,800,800,,,,,,,,,,,,,,,,,,,,,,,,,,,,,,,,,,,,,,
800,800,800,800,800,800,800,800,800,800,800,800,800,800,800,800,800,800,800,800,800,800,800,800,800,800,800,800,800,800,800,800,800,,,,,,,,,,,,,,,,,,,,,,,,,,,,,,,,,,,,,,
800,800,800,800,800,800,800,800,800,800,800,800,800,800,800,800,800,800,800,800,800,800,800,800,800,800,800,800,800,800,800,800,800,,,,,,,,,,,,,,,,,,,,,,,,,,,,,,,,,,,,,,
800,800,800,800,800,800,800,800,800,800,800,800,800,800,800,800,800,800,800,800,800,800,800,800,800,800,800,800,800,800,800,800,800,,,,,,,,,,,,,,,,,,,,,,,,,,,,,,,,,,,,,,
800,800,800,800,800,800,800,800,800,800,800,800,800,800,800,800,800,800,800,800,800,800,800,800,800,800,800,800,800,800,800,800,800,,,,,,,,,,,,,,,,,,,,,,,,,,,,,,,,,,,,,,
800,800,800,800,800,800,800,800,800,800,800,800,800,800,800,800,800,800,800,800,800,800,800,800,800,800,800,800,800,800,800,800,800,,,,,,,,,,,,,,,,,,,,,,,,,,,,,,,,,,,,,,
800,800,800,800,800,800,800,800,800,800,800,800,800,800,800,800,800,800,800,800,800,800,800,800,800,800,800,800,800,800,800,800,800,,,,,,,,,,,,,,,,,,,,,,,,,,,,,,,,,,,,,,
800,800,800,800,800,800,800,800,800,800,800,800,800,800,800,800,800,800,800,800,800,800,800,800,800,800,800,800,800,800,800,800,800,,,,,,,,,,,,,,,,,,,,,,,,,,,,,,,,,,,,,,
800,800,800,800,800,800,800,800,800,800,800,800,800,800,800,800,800,800,800,800,800,800,800,800,800,800,800,800,800,800,800,800,800,,,,,,,,,,,,,,,,,,,,,,,,,,,,,,,,,,,,,,
800,800,800,800,800,800,800,800,800,800,800,800,800,800,800,800,800,800,800,800,800,800,800,800,800,800,800,800,800,800,800,800,800,,,,,,,,,,,,,,,,,,,,,,,,,,,,,,,,,,,,,,
800,800,800,800,800,800,800,800,800,800,800,800,800,800,800,800,800,800,800,800,800,800,800,800,800,800,800,800,800,800,800,800,800,,,,,,,,,,,,,,,,,,,,,,,,,,,,,,,,,,,,,,
800,800,800,800,800,800,800,800,800,800,800,800,800,800,800,800,800,800,800,800,800,800,800,800,800,800,800,800,800,800,800,800,800,,,,,,,,,,,,,,,,,,,,,,,,,,,,,,,,,,,,,,
800,800,800,800,800,800,800,800,800,800,800,800,800,800,800,800,800,800,800,800,800,800,800,800,800,800,800,800,800,800,800,800,800,,,,,,,,,,,,,,,,,,,,,,,,,,,,,,,,,,,,,,
800,800,800,800,800,800,800,800,800,800,800,800,800,800,800,800,800,800,800,800,800,800,800,800,800,800,800,800,800,800,800,800,800,,,,,,,,,,,,,,,,,,,,,,,,,,,,,,,,,,,,,,
800,800,800,800,800,800,800,800,800,800,800,800,800,800,800,800,800,800,800,800,800,800,800,800,800,800,800,800,800,800,800,800,800,,,,,,,,,,,,,,,,,,,,,,,,,,,,,,,,,,,,,,
800,800,800,800,800,800,800,800,800,800,800,800,800,800,800,800,800,800,800,800,800,800,800,800,800,800,800,800,800,800,800,800,800,,,,,,,,,,,,,,,,,,,,,,,,,,,,,,,,,,,,,,
800,800,800,800,800,800,800,800,800,800,800,800,800,800,800,800,800,800,800,800,800,800,800,800,800,800,800,800,800,800,800,800,800,,,,,,,,,,,,,,,,,,,,,,,,,,,,,,,,,,,,,,
800,800,800,800,800,800,800,800,800,800,800,800,800,800,800,800,800,800,800,800,800,800,800,800,800,800,800,800,800,800,800,800,800,,,,,,,,,,,,,,,,,,,,,,,,,,,,,,,,,,,,,,
800,800,800,800,800,800,800,800,800,800,800,800,800,800,800,800,800,800,800,800,800,800,800,800,800,800,800,800,800,800,800,800,800,,,,,,,,,,,,,,,,,,,,,,,,,,,,,,,,,,,,,,
800,800,800,800,800,800,800,800,800,800,800,800,800,800,800,800,800,800,800,800,800,800,800,800,800,800,800,800,800,800,800,800,800,,,,,,,,,,,,,,,,,,,,,,,,,,,,,,,,,,,,,,
800,800,800,800,800,800,800,800,800,800,800,800,800,800,800,800,800,800,800,800,800,800,800,800,800,800,800,800,800,800,800,800,800,,,,,,,,,,,,,,,,,,,,,,,,,,,,,,,,,,,,,,
800,800,800,800,800,800,800,800,800,800,800,800,800,800,800,800,800,800,800,800,800,800,800,800,800,800,800,800,800,800,800,800,800,,,,,,,,,,,,,,,,,,,,,,,,,,,,,,,,,,,,,,
800,800,800,800,800,800,800,800,800,800,800,800,800,800,800,800,800,800,800,800,800,800,800,800,800,800,800,800,800,800,800,800,800,,,,,,,,,,,,,,,,,,,,,,,,,,,,,,,,,,,,,,
800,800,800,800,800,800,800,800,800,800,800,800,800,800,800,800,800,800,800,800,800,800,800,800,800,800,800,800,800,800,800,800,800,,,,,,,,,,,,,,,,,,,,,,,,,,,,,,,,,,,,,,
800,800,800,800,800,800,800,800,800,800,800,800,800,800,800,800,800,800,800,800,800,800,800,800,800,800,800,800,800,800,800,800,800,,,,,,,,,,,,,,,,,,,,,,,,,,,,,,,,,,,,,,
800,800,800,800,800,800,800,800,800,800,800,800,800,800,800,800,800,800,800,800,800,800,800,800,800,800,800,800,800,800,800,800,800,,,,,,,,,,,,,,,,,,,,,,,,,,,,,,,,,,,,,,
1200,1000,1000,1000,1000,1000,1000,1000,1000,1000,1000,1000,1000,1000,1000,1000,1000,1000,1000,1000,1000,1000,1000,1000,1000,1000,1000,1000,1000,1000,1000,1000,1200,,,,,,,,,,,,,,,,,,,,,,,,,,,,,,,,,,,,,,
#,raw_col_delta_min,,,,,,,,,,,,,,,,,,,,,,,,,,,,,,,,,,,,,,,,,,,,,,,,,,,,,,,,,,,,,,,,,,,,,
-1200,-1000,-1000,-1000,-1000,-1000,-1000,-1000,-1000,-1000,-1000,-1000,-1000,-1000,-1000,-1000,-1000,-1000,-1000,-1000,-1000,-1000,-1000,-1000,-1200,-1200,-1200,-1000,-1000,-1000,-1000,-1000,-1200,,,,,,,,,,,,,,,,,,,,,,,,,,,,,,,,,,,,,,
-800,-800,-800,-800,-800,-800,-800,-800,-800,-800,-800,-800,-800,-800,-800,-800,-800,-800,-800,-800,-800,-800,-800,-800,-1200,-1200,-1200,-800,-800,-800,-800,-800,-800,,,,,,,,,,,,,,,,,,,,,,,,,,,,,,,,,,,,,,
-800,-800,-800,-800,-800,-800,-800,-800,-800,-800,-800,-800,-800,-800,-800,-800,-800,-800,-800,-800,-800,-800,-800,-800,-800,-800,-800,-800,-800,-800,-800,-800,-800,,,,,,,,,,,,,,,,,,,,,,,,,,,,,,,,,,,,,,
-800,-800,-800,-800,-800,-800,-800,-800,-800,-800,-800,-800,-800,-800,-800,-800,-800,-800,-800,-800,-800,-800,-800,-800,-800,-800,-800,-800,-800,-800,-800,-800,-800,,,,,,,,,,,,,,,,,,,,,,,,,,,,,,,,,,,,,,
-800,-800,-800,-800,-800,-800,-800,-800,-800,-800,-800,-800,-800,-800,-800,-800,-800,-800,-800,-800,-800,-800,-800,-800,-800,-800,-800,-800,-800,-800,-800,-800,-800,,,,,,,,,,,,,,,,,,,,,,,,,,,,,,,,,,,,,,
-800,-800,-800,-800,-800,-800,-800,-800,-800,-800,-800,-800,-800,-800,-800,-800,-800,-800,-800,-800,-800,-800,-800,-800,-800,-800,-800,-800,-800,-800,-800,-800,-800,,,,,,,,,,,,,,,,,,,,,,,,,,,,,,,,,,,,,,
-800,-800,-800,-800,-800,-800,-800,-800,-800,-800,-800,-800,-800,-800,-800,-800,-800,-800,-800,-800,-800,-800,-800,-800,-800,-800,-800,-800,-800,-800,-800,-800,-800,,,,,,,,,,,,,,,,,,,,,,,,,,,,,,,,,,,,,,
-800,-800,-800,-800,-800,-800,-800,-800,-800,-800,-800,-800,-800,-800,-800,-800,-800,-800,-800,-800,-800,-800,-800,-800,-800,-800,-800,-800,-800,-800,-800,-800,-800,,,,,,,,,,,,,,,,,,,,,,,,,,,,,,,,,,,,,,
-800,-800,-800,-800,-800,-800,-800,-800,-800,-800,-800,-800,-800,-800,-800,-800,-800,-800,-800,-800,-800,-800,-800,-800,-800,-800,-800,-800,-800,-800,-800,-800,-800,,,,,,,,,,,,,,,,,,,,,,,,,,,,,,,,,,,,,,
-800,-800,-800,-800,-800,-800,-800,-800,-800,-800,-800,-800,-800,-800,-800,-800,-800,-800,-800,-800,-800,-800,-800,-800,-800,-800,-800,-800,-800,-800,-800,-800,-800,,,,,,,,,,,,,,,,,,,,,,,,,,,,,,,,,,,,,,
-800,-800,-800,-800,-800,-800,-800,-800,-800,-800,-800,-800,-800,-800,-800,-800,-800,-800,-800,-800,-800,-800,-800,-800,-800,-800,-800,-800,-800,-800,-800,-800,-800,,,,,,,,,,,,,,,,,,,,,,,,,,,,,,,,,,,,,,
-800,-800,-800,-800,-800,-800,-800,-800,-800,-800,-800,-800,-800,-800,-800,-800,-800,-800,-800,-800,-800,-800,-800,-800,-800,-800,-800,-800,-800,-800,-800,-800,-800,,,,,,,,,,,,,,,,,,,,,,,,,,,,,,,,,,,,,,
-800,-800,-800,-800,-800,-800,-800,-800,-800,-800,-800,-800,-800,-800,-800,-800,-800,-800,-800,-800,-800,-800,-800,-800,-800,-800,-800,-800,-800,-800,-800,-800,-800,,,,,,,,,,,,,,,,,,,,,,,,,,,,,,,,,,,,,,
-800,-800,-800,-800,-800,-800,-800,-800,-800,-800,-800,-800,-800,-800,-800,-800,-800,-800,-800,-800,-800,-800,-800,-800,-800,-800,-800,-800,-800,-800,-800,-800,-800,,,,,,,,,,,,,,,,,,,,,,,,,,,,,,,,,,,,,,
-800,-800,-800,-800,-800,-800,-800,-800,-800,-800,-800,-800,-800,-800,-800,-800,-800,-800,-800,-800,-800,-800,-800,-800,-800,-800,-800,-800,-800,-800,-800,-800,-800,,,,,,,,,,,,,,,,,,,,,,,,,,,,,,,,,,,,,,
-800,-800,-800,-800,-800,-800,-800,-800,-800,-800,-800,-800,-800,-800,-800,-800,-800,-800,-800,-800,-800,-800,-800,-800,-800,-800,-800,-800,-800,-800,-800,-800,-800,,,,,,,,,,,,,,,,,,,,,,,,,,,,,,,,,,,,,,
-800,-800,-800,-800,-800,-800,-800,-800,-800,-800,-800,-800,-800,-800,-800,-800,-800,-800,-800,-800,-800,-800,-800,-800,-800,-800,-800,-800,-800,-800,-800,-800,-800,,,,,,,,,,,,,,,,,,,,,,,,,,,,,,,,,,,,,,
-800,-800,-800,-800,-800,-800,-800,-800,-800,-800,-800,-800,-800,-800,-800,-800,-800,-800,-800,-800,-800,-800,-800,-800,-800,-800,-800,-800,-800,-800,-800,-800,-800,,,,,,,,,,,,,,,,,,,,,,,,,,,,,,,,,,,,,,
-800,-800,-800,-800,-800,-800,-800,-800,-800,-800,-800,-800,-800,-800,-800,-800,-800,-800,-800,-800,-800,-800,-800,-800,-800,-800,-800,-800,-800,-800,-800,-800,-800,,,,,,,,,,,,,,,,,,,,,,,,,,,,,,,,,,,,,,
-800,-800,-800,-800,-800,-800,-800,-800,-800,-800,-800,-800,-800,-800,-800,-800,-800,-800,-800,-800,-800,-800,-800,-800,-800,-800,-800,-800,-800,-800,-800,-800,-800,,,,,,,,,,,,,,,,,,,,,,,,,,,,,,,,,,,,,,
-800,-800,-800,-800,-800,-800,-800,-800,-800,-800,-800,-800,-800,-800,-800,-800,-800,-800,-800,-800,-800,-800,-800,-800,-800,-800,-800,-800,-800,-800,-800,-800,-800,,,,,,,,,,,,,,,,,,,,,,,,,,,,,,,,,,,,,,
-800,-800,-800,-800,-800,-800,-800,-800,-800,-800,-800,-800,-800,-800,-800,-800,-800,-800,-800,-800,-800,-800,-800,-800,-800,-800,-800,-800,-800,-800,-800,-800,-800,,,,,,,,,,,,,,,,,,,,,,,,,,,,,,,,,,,,,,
-800,-800,-800,-800,-800,-800,-800,-800,-800,-800,-800,-800,-800,-800,-800,-800,-800,-800,-800,-800,-800,-800,-800,-800,-800,-800,-800,-800,-800,-800,-800,-800,-800,,,,,,,,,,,,,,,,,,,,,,,,,,,,,,,,,,,,,,
-800,-800,-800,-800,-800,-800,-800,-800,-800,-800,-800,-800,-800,-800,-800,-800,-800,-800,-800,-800,-800,-800,-800,-800,-800,-800,-800,-800,-800,-800,-800,-800,-800,,,,,,,,,,,,,,,,,,,,,,,,,,,,,,,,,,,,,,
-800,-800,-800,-800,-800,-800,-800,-800,-800,-800,-800,-800,-800,-800,-800,-800,-800,-800,-800,-800,-800,-800,-800,-800,-800,-800,-800,-800,-800,-800,-800,-800,-800,,,,,,,,,,,,,,,,,,,,,,,,,,,,,,,,,,,,,,
-800,-800,-800,-800,-800,-800,-800,-800,-800,-800,-800,-800,-800,-800,-800,-800,-800,-800,-800,-800,-800,-800,-800,-800,-800,-800,-800,-800,-800,-800,-800,-800,-800,,,,,,,,,,,,,,,,,,,,,,,,,,,,,,,,,,,,,,
-800,-800,-800,-800,-800,-800,-800,-800,-800,-800,-800,-800,-800,-800,-800,-800,-800,-800,-800,-800,-800,-800,-800,-800,-800,-800,-800,-800,-800,-800,-800,-800,-800,,,,,,,,,,,,,,,,,,,,,,,,,,,,,,,,,,,,,,
-800,-800,-800,-800,-800,-800,-800,-800,-800,-800,-800,-800,-800,-800,-800,-800,-800,-800,-800,-800,-800,-800,-800,-800,-800,-800,-800,-800,-800,-800,-800,-800,-800,,,,,,,,,,,,,,,,,,,,,,,,,,,,,,,,,,,,,,
-800,-800,-800,-800,-800,-800,-800,-800,-800,-800,-800,-800,-800,-800,-800,-800,-800,-800,-800,-800,-800,-800,-800,-800,-800,-800,-800,-800,-800,-800,-800,-800,-800,,,,,,,,,,,,,,,,,,,,,,,,,,,,,,,,,,,,,,
-800,-800,-800,-800,-800,-800,-800,-800,-800,-800,-800,-800,-800,-800,-800,-800,-800,-800,-800,-800,-800,-800,-800,-800,-800,-800,-800,-800,-800,-800,-800,-800,-800,,,,,,,,,,,,,,,,,,,,,,,,,,,,,,,,,,,,,,
-800,-800,-800,-800,-800,-800,-800,-800,-800,-800,-800,-800,-800,-800,-800,-800,-800,-800,-800,-800,-800,-800,-800,-800,-800,-800,-800,-800,-800,-800,-800,-800,-800,,,,,,,,,,,,,,,,,,,,,,,,,,,,,,,,,,,,,,
-800,-800,-800,-800,-800,-800,-800,-800,-800,-800,-800,-800,-800,-800,-800,-800,-800,-800,-800,-800,-800,-800,-800,-800,-800,-800,-800,-800,-800,-800,-800,-800,-800,,,,,,,,,,,,,,,,,,,,,,,,,,,,,,,,,,,,,,
-800,-800,-800,-800,-800,-800,-800,-800,-800,-800,-800,-800,-800,-800,-800,-800,-800,-800,-800,-800,-800,-800,-800,-800,-800,-800,-800,-800,-800,-800,-800,-800,-800,,,,,,,,,,,,,,,,,,,,,,,,,,,,,,,,,,,,,,
-800,-800,-800,-800,-800,-800,-800,-800,-800,-800,-800,-800,-800,-800,-800,-800,-800,-800,-800,-800,-800,-800,-800,-800,-800,-800,-800,-800,-800,-800,-800,-800,-800,,,,,,,,,,,,,,,,,,,,,,,,,,,,,,,,,,,,,,
-800,-800,-800,-800,-800,-800,-800,-800,-800,-800,-800,-800,-800,-800,-800,-800,-800,-800,-800,-800,-800,-800,-800,-800,-800,-800,-800,-800,-800,-800,-800,-800,-800,,,,,,,,,,,,,,,,,,,,,,,,,,,,,,,,,,,,,,
-800,-800,-800,-800,-800,-800,-800,-800,-800,-800,-800,-800,-800,-800,-800,-800,-800,-800,-800,-800,-800,-800,-800,-800,-800,-800,-800,-800,-800,-800,-800,-800,-800,,,,,,,,,,,,,,,,,,,,,,,,,,,,,,,,,,,,,,
-1200,-1000,-1000,-1000,-1000,-1000,-1000,-1000,-1000,-1000,-1000,-1000,-1000,-1000,-1000,-1000,-1000,-1000,-1000,-1000,-1000,-1000,-1000,-1000,-1000,-1000,-1000,-1000,-1000,-1000,-1000,-1000,-1200,,,,,,,,,,,,,,,,,,,,,,,,,,,,,,,,,,,,,,
#,line_max,,,,,,,,,,,,,,,,,,,,,,,,,,,,,,,,,,,,,,,,,,,,,,,,,,,,,,,,,,,,,,,,,,,,,
8000,8000,8000,8000,8000,8000,8000,8000,8000,8000,8000,8000,8000,8000,8000,8000,8000,8000,8000,8000,8000,8000,8000,8000,8000,8000,8000,8000,8000,8000,8000,8000,8000,8000,8000,8000,8000,8000,8000,8000,8000,8000,8000,8000,8000,8000,8000,8000,8000,8000,8000,8000,8000,8000,8000,8000,8000,8000,8000,8000,8000,8000,8000,8000,8000,8000,8000,8000,8000,8000,8000
#,line_min,,,,,,,,,,,,,,,,,,,,,,,,,,,,,,,,,,,,,,,,,,,,,,,,,,,,,,,,,,,,,,,,,,,,,
300,300,300,300,300,300,300,300,300,300,300,300,300,300,300,300,300,300,300,300,300,300,300,300,300,300,300,300,300,300,300,300,300,300,300,300,300,300,300,300,300,300,300,300,300,300,300,300,300,300,300,300,300,300,300,300,300,300,300,300,300,300,300,300,300,300,300,300,300,300,300
