!	1
&	2
'	3
(	4
)	5
+	6
,	7
-	8
.	9
/	10
0	11
1	12
2	13
3	14
4	15
5	16
6	17
7	18
8	19
9	20
:	21
;	22
<	23
=	24
>	25
?	26
A	27
B	28
C	29
D	30
E	31
F	32
G	33
H	34
I	35
J	36
K	37
L	38
M	39
N	40
O	41
P	42
Q	43
R	44
S	45
T	46
U	47
V	48
W	49
X	50
Y	51
Z	52
[	53
\#	54
\$	55
\%	56
\&	57
\@	58
\AE	59
\Delta	60
\Downarrow	61
\Gamma	62
\Lambda	63
\Leftarrow	64
\Leftrightarrow	65
\Omega	66
\Phi	67
\Psi	68
\Rightarrow	69
\S	70
\Subset	71
\Supset	72
\Theta	73
\Uparrow	74
\Updownarrow	75
\Xi	76
\\	77
\acute	78
\ae	79
\aleph	80
\alpha	81
\angle	82
\approx	83
\ast	84
\asymp	85
\backsim	86
\because	87
\begin{matrix}	88
\beta	89
\between	90
\blacksquare	91
\blacktriangleright	92
\bowtie	93
\boxdot	94
\boxplus	95
\boxtimes	96
\breve	97
\cap	98
\check	99
\checkmark	100
\chi	101
\circ	102
\circlearrowleft	103
\circlearrowright	104
\circledast	105
\circledcirc	106
\clubsuit	107
\cong	108
\coprod	109
\copyright	110
\cup	111
\curvearrowright	112
\dagger	113
\dashv	114
\ddagger	115
\ddots	116
\delta	117
\diamond	118
\div	119
\dot	120
\doteq	121
\doteqdot	122
\downarrow	123
\emptyset	124
\end{matrix}	125
\epsilon	126
\equiv	127
\eta	128
\exists	129
\fallingdotseq	130
\female	131
\fint	132
\forall	133
\frac	134
\frown	135
\gamma	136
\geq	137
\geqq	138
\gg	139
\grave	140
\gtrless	141
\gtrsim	142
\heartsuit	143
\hookrightarrow	144
\hslash	145
\iddots	146
\in	147
\infty	148
\int	149
\iota	150
\kappa	151
\lambda	152
\langle	153
\lceil	154
\leftarrow	155
\leftharpoondown	156
\leftharpoonup	157
\leftmoon	158
\leftrightarrow	159
\leftrightharpoons	160
\leq	161
\leqq	162
\lessgtr	163
\lesssim	164
\lfloor	165
\lightning	166
\ll	167
\llbracket	168
\llcorner	169
\lrcorner	170
\ltimes	171
\male	172
\mapsfrom	173
\mapsto	174
\mathring	175
\mathsterling	176
\models	177
\mp	178
\mu	179
\multimap	180
\nabla	181
\nearrow	182
\neg	183
\ni	184
\not	185
\nu	186
\nwarrow	187
\odot	188
\oe	189
\oiiint	190
\oiint	191
\oint	192
\omega	193
\ominus	194
\oplus	195
\otimes	196
\overline	197
\overrightarrow	198
\parr	199
\partial	200
\perp	201
\phi	202
\pi	203
\pitchfork	204
\pm	205
\prec	206
\preceq	207
\prod	208
\propto	209
\psi	210
\rangle	211
\rceil	212
\rfloor	213
\rho	214
\rightarrow	215
\rightharpoondown	216
\rightharpoonup	217
\rightleftarrows	218
\rightleftharpoons	219
\rightrightarrows	220
\rightsquigarrow	221
\rrbracket	222
\rtimes	223
\searrow	224
\setminus	225
\sigma	226
\sim	227
\simeq	228
\sphericalangle	229
\sqrt	230
\square	231
\star	232
\subset	233
\subseteq	234
\subseteqq	235
\subsetneq	236
\subsetneqq	237
\succ	238
\succeq	239
\sum	240
\sun	241
\supset	242
\supseteq	243
\supseteqq	244
\supsetneq	245
\supsetneqq	246
\swarrow	247
\tau	248
\textcent	249
\texteuro	250
\textperthousand	251
\textregistered	252
\textwon	253
\therefore	254
\theta	255
\times	256
\triangle	257
\triangleleft	258
\trianglelefteq	259
\triangleq	260
\triangleright	261
\twoheadrightarrow	262
\ulcorner	263
\underbrace	264
\underline	265
\uparrow	266
\updownarrow	267
\upharpoonright	268
\uplus	269
\upsilon	270
\urcorner	271
\vdash	272
\vdots	273
\vee	274
\wedge	275
\widehat	276
\widetilde	277
\wp	278
\wr	279
\xi	280
\yen	281
\zeta	282
\{	283
\}	284
]	285
^	286
_	287
`	288
a	289
b	290
c	291
d	292
e	293
f	294
g	295
h	296
i	297
j	298
k	299
l	300
m	301
n	302
o	303
p	304
q	305
r	306
s	307
t	308
u	309
v	310
w	311
x	312
y	313
z	314
{	315
|	316
}	317
\	318
 	319
☾ 	320
⇌ 	321
☼ 	322
♀ 	323
<eol>	0
