#,version,,,,,,,,,,,,,,,,,,,,,,,,,,,,,,,,,,,,,,,,,,,,,,,,,,,,,,,,,,,,,,,,,,,,,
2023,10,31,1,,,,,,,,,,,,,,,,,,,,,,,,,,,,,,,,,,,,,,,,,,,,,,,,,,,,,,,,,,,,,,,,,,,
#,row_col_num,,,,,,,,,,,,,,,,,,,,,,,,,,,,,,,,,,,,,,,,,,,,,,,,,,,,,,,,,,,,,,,,,,,,,
37,34,,,,,,,,,,,,,,,,,,,,,,,,,,,,,,,,,,,,,,,,,,,,,,,,,,,,,,,,,,,,,,,,,,,,,
#,noise,,,,,,,,,,,,,,,,,,,,,,,,,,,,,,,,,,,,,,,,,,,,,,,,,,,,,,,,,,,,,,,,,,,,,
-600,600,,,,,,,,,,,,,,,,,,,,,,,,,,,,,,,,,,,,,,,,,,,,,,,,,,,,,,,,,,,,,,,,,,,,,
#,raw_max,,,,,,,,,,,,,,,,,,,,,,,,,,,,,,,,,,,,,,,,,,,,,,,,,,,,,,,,,,,,,,,,,,,,,
4602,4074,3868,3774,3711,3694,3659,3656,3632,3627,3605,3587,3572,3565,3535,3538,3518,3501,3475,3467,3439,3421,3394,3385,3355,4000,3342,3384,3376,3381,3387,3415,3449,3433,,,,,,,,,,,,,,,,,,,,,,,,,,,,,,,,,,,,,
3986,3602,3523,3459,3433,3410,3399,3388,3389,3373,3372,3345,3351,3332,3323,3315,3317,3289,3283,3266,3259,3229,3226,3208,3235,4000,3239,3226,3242,3235,3260,3271,3307,3468,,,,,,,,,,,,,,,,,,,,,,,,,,,,,,,,,,,,,
3764,3523,3457,3432,3394,3395,3370,3379,3363,3368,3349,3341,3329,3328,3301,3314,3298,3288,3264,3264,3237,3229,3204,3205,3188,3205,3206,3219,3214,3224,3227,3253,3261,3415,,,,,,,,,,,,,,,,,,,,,,,,,,,,,,,,,,,,,
3684,3483,3454,3412,3399,3387,3382,3375,3380,3367,3367,3340,3348,3329,3320,3313,3317,3290,3283,3263,3254,3227,3221,3204,3203,3198,3218,3216,3228,3218,3237,3242,3265,3391,,,,,,,,,,,,,,,,,,,,,,,,,,,,,,,,,,,,,
3512,3367,3331,3315,3286,3295,3273,3284,3271,3277,3261,3254,3243,3243,3218,3229,3214,3206,3182,3180,3153,3144,3121,3122,3103,3118,3117,3131,3125,3133,3132,3152,3152,3286,,,,,,,,,,,,,,,,,,,,,,,,,,,,,,,,,,,,,
3613,3462,3451,3418,3410,3398,3401,3392,3399,3388,3390,3367,3373,3357,3347,3340,3343,3316,3308,3287,3277,3250,3245,3226,3224,3222,3241,3236,3248,3238,3254,3254,3270,3385,,,,,,,,,,,,,,,,,,,,,,,,,,,,,,,,,,,,,
3569,3450,3427,3415,3390,3399,3384,3390,3382,3389,3373,3366,3359,3361,3333,3344,3329,3320,3292,3288,3260,3250,3226,3225,3204,3219,3219,3232,3225,3234,3229,3247,3242,3373,,,,,,,,,,,,,,,,,,,,,,,,,,,,,,,,,,,,,
3451,3330,3329,3302,3297,3288,3292,3280,3291,3277,3284,3258,3271,3253,3247,3238,3241,3216,3206,3184,3174,3147,3141,3122,3121,3117,3134,3128,3139,3129,3144,3142,3158,3264,,,,,,,,,,,,,,,,,,,,,,,,,,,,,,,,,,,,,
3530,3429,3412,3404,3381,3392,3380,3388,3380,3384,3374,3365,3361,3358,3336,3347,3330,3322,3294,3291,3262,3252,3227,3227,3206,3221,3219,3232,3224,3232,3232,3248,3244,3374,,,,,,,,,,,,,,,,,,,,,,,,,,,,,,,,,,,,,
3516,3401,3405,3379,3377,3369,3369,3365,3377,3363,3371,3344,3360,3338,3330,3328,3330,3303,3292,3272,3262,3233,3226,3206,3203,3200,3217,3211,3222,3211,3231,3227,3244,3355,,,,,,,,,,,,,,,,,,,,,,,,,,,,,,,,,,,,,
3404,3315,3303,3297,3279,3291,3274,3288,3278,3287,3274,3269,3267,3263,3238,3254,3239,3232,3204,3203,3173,3162,3138,3136,3115,3130,3129,3142,3134,3141,3140,3156,3152,3281,,,,,,,,,,,,,,,,,,,,,,,,,,,,,,,,,,,,,
3498,3391,3399,3376,3376,3371,3373,3369,3380,3369,3375,3353,3369,3348,3340,3337,3340,3314,3304,3284,3273,3243,3236,3216,3213,3209,3227,3223,3234,3221,3238,3235,3251,3364,,,,,,,,,,,,,,,,,,,,,,,,,,,,,,,,,,,,,
3473,3386,3377,3374,3357,3370,3355,3368,3359,3369,3358,3354,3350,3348,3322,3339,3324,3319,3289,3288,3258,3246,3221,3219,3198,3213,3212,3226,3218,3226,3222,3239,3236,3367,,,,,,,,,,,,,,,,,,,,,,,,,,,,,,,,,,,,,
3478,3375,3386,3365,3368,3363,3364,3361,3370,3362,3369,3347,3358,3342,3334,3333,3333,3304,3303,3276,3272,3243,3233,3213,3210,3206,3224,3220,3231,3219,3234,3232,3248,3360,,,,,,,,,,,,,,,,,,,,,,,,,,,,,,,,,,,,,
3463,3380,3374,3373,3358,3372,3355,3371,3363,3373,3361,3358,3350,3351,3327,3344,3332,3316,3296,3291,3266,3253,3227,3226,3204,3219,3218,3232,3224,3232,3228,3245,3242,3377,,,,,,,,,,,,,,,,,,,,,,,,,,,,,,,,,,,,,
3455,3356,3370,3352,3354,3350,3352,3349,3359,3352,3357,3337,3348,3331,3325,3327,3321,3295,3287,3268,3263,3228,3227,3207,3203,3200,3217,3212,3223,3211,3225,3225,3239,3353,,,,,,,,,,,,,,,,,,,,,,,,,,,,,,,,,,,,,
3432,3352,3348,3348,3332,3346,3331,3347,3339,3350,3338,3336,3330,3332,3307,3324,3303,3294,3272,3267,3249,3228,3209,3208,3185,3200,3198,3212,3204,3210,3206,3224,3219,3350,,,,,,,,,,,,,,,,,,,,,,,,,,,,,,,,,,,,,
3345,3250,3264,3247,3249,3245,3249,3247,3257,3250,3256,3236,3247,3232,3225,3224,3221,3195,3196,3169,3166,3135,3130,3112,3109,3104,3121,3116,3127,3115,3129,3127,3142,3250,,,,,,,,,,,,,,,,,,,,,,,,,,,,,,,,,,,,,
3349,3272,3269,3269,3254,3268,3254,3270,3262,3272,3261,3258,3251,3255,3230,3243,3226,3218,3193,3191,3165,3155,3140,3133,3115,3128,3126,3141,3132,3138,3134,3151,3146,3274,,,,,,,,,,,,,,,,,,,,,,,,,,,,,,,,,,,,,
3400,3301,3316,3298,3302,3297,3300,3298,3309,3301,3307,3286,3296,3282,3276,3269,3272,3245,3238,3219,3211,3183,3177,3158,3164,3155,3175,3170,3181,3168,3183,3180,3194,3296,,,,,,,,,,,,,,,,,,,,,,,,,,,,,,,,,,,,,
3379,3300,3296,3297,3282,3296,3280,3296,3288,3299,3286,3283,3276,3279,3255,3267,3251,3243,3218,3218,3193,3183,3162,3159,3145,3158,3157,3170,3162,3168,3163,3180,3175,3306,,,,,,,,,,,,,,,,,,,,,,,,,,,,,,,,,,,,,
3476,3377,3390,3372,3375,3371,3373,3371,3381,3373,3378,3357,3367,3352,3345,3339,3342,3315,3309,3290,3283,3255,3249,3231,3235,3232,3247,3242,3252,3240,3252,3251,3266,3375,,,,,,,,,,,,,,,,,,,,,,,,,,,,,,,,,,,,,
3493,3411,3404,3404,3389,3402,3386,3402,3393,3403,3390,3385,3377,3380,3354,3370,3353,3344,3319,3320,3294,3285,3267,3270,3245,3259,3259,3272,3264,3270,3263,3280,3274,3406,,,,,,,,,,,,,,,,,,,,,,,,,,,,,,,,,,,,,
3496,3391,3402,3383,3384,3379,3381,3380,3388,3379,3384,3361,3371,3355,3349,3343,3348,3321,3314,3295,3287,3261,3256,3237,3237,3230,3256,3252,3259,3246,3259,3257,3270,3373,,,,,,,,,,,,,,,,,,,,,,,,,,,,,,,,,,,,,
3490,3402,3394,3391,3376,3389,3373,3388,3378,3387,3373,3369,3361,3363,3337,3349,3335,3327,3302,3302,3278,3268,3245,3245,3225,3239,3248,3255,3248,3254,3249,3264,3258,3382,,,,,,,,,,,,,,,,,,,,,,,,,,,,,,,,,,,,,
3510,3402,3412,3390,3390,3385,3386,3383,3392,3384,3386,3364,3373,3357,3350,3343,3347,3321,3314,3297,3291,3263,3258,3241,3239,3234,3253,3247,3266,3246,3263,3253,3275,3377,,,,,,,,,,,,,,,,,,,,,,,,,,,,,,,,,,,,,
3514,3420,3409,3406,3387,3399,3382,3395,3386,3395,3381,3375,3367,3368,3343,3354,3340,3331,3308,3308,3284,3276,3252,3253,3233,3246,3247,3260,3255,3257,3258,3267,3271,3391,,,,,,,,,,,,,,,,,,,,,,,,,,,,,,,,,,,,,
3550,3433,3437,3414,3413,3406,3407,3402,3410,3400,3403,3381,3390,3374,3366,3359,3364,3337,3329,3312,3307,3279,3275,3256,3256,3252,3271,3264,3275,3261,3276,3271,3285,3395,,,,,,,,,,,,,,,,,,,,,,,,,,,,,,,,,,,,,
3542,3438,3424,3417,3396,3408,3388,3402,3390,3399,3384,3377,3369,3370,3344,3357,3344,3336,3310,3311,3288,3279,3256,3256,3236,3250,3250,3262,3261,3271,3262,3276,3273,3396,,,,,,,,,,,,,,,,,,,,,,,,,,,,,,,,,,,,,
3467,3343,3344,3317,3313,3305,3304,3299,3304,3295,3297,3275,3283,3266,3259,3253,3258,3232,3225,3209,3204,3178,3173,3155,3154,3150,3168,3160,3172,3160,3177,3172,3187,3294,,,,,,,,,,,,,,,,,,,,,,,,,,,,,,,,,,,,,
3601,3481,3457,3445,3422,3431,3410,3423,3410,3418,3401,3396,3385,3386,3360,3372,3358,3350,3325,3327,3302,3294,3270,3272,3251,3265,3266,3280,3272,3278,3283,3291,3291,3420,,,,,,,,,,,,,,,,,,,,,,,,,,,,,,,,,,,,,
3653,3501,3490,3456,3448,3437,3433,3428,3433,3422,3423,3399,3409,3391,3382,3375,3381,3354,3348,3331,3326,3298,3293,3276,3275,3271,3292,3287,3300,3288,3304,3304,3321,3440,,,,,,,,,,,,,,,,,,,,,,,,,,,,,,,,,,,,,
3655,3503,3466,3446,3418,3422,3400,3412,3398,3405,3388,3382,3373,3374,3346,3358,3344,3336,3312,3314,3292,3283,3260,3262,3241,3257,3260,3276,3268,3276,3273,3294,3294,3435,,,,,,,,,,,,,,,,,,,,,,,,,,,,,,,,,,,,,
3707,3502,3473,3428,3415,3399,3393,3384,3386,3374,3375,3350,3361,3343,3334,3327,3332,3304,3300,3285,3280,3253,3251,3234,3233,3231,3253,3250,3262,3251,3271,3273,3296,3422,,,,,,,,,,,,,,,,,,,,,,,,,,,,,,,,,,,,,
3701,3460,3395,3361,3324,3323,3297,3305,3288,3294,3277,3271,3261,3262,3236,3247,3233,3225,3204,3206,3183,3175,3156,3158,3140,3157,3160,3175,3169,3180,3182,3207,3215,3367,,,,,,,,,,,,,,,,,,,,,,,,,,,,,,,,,,,,,
3946,3551,3472,3404,3379,3354,3341,3330,3332,3318,3317,3292,3300,3282,3274,3267,3271,3244,3240,3224,3220,3194,3193,3176,3177,3175,3199,3196,3210,3203,3228,3240,3278,3439,,,,,,,,,,,,,,,,,,,,,,,,,,,,,,,,,,,,,
4660,4065,3852,3762,3695,3678,3635,3638,3609,3611,3583,3570,3555,3552,3520,3527,3504,3490,3463,3462,3435,3422,3395,3390,3359,3370,3374,3388,3380,3391,3396,3430,3472,3458,,,,,,,,,,,,,,,,,,,,,,,,,,,,,,,,,,,,,
#,raw_min,,,,,,,,,,,,,,,,,,,,,,,,,,,,,,,,,,,,,,,,,,,,,,,,,,,,,,,,,,,,,,,,,,,,,
2478,2194,2083,2032,1998,1989,1970,1968,1955,1953,1941,1931,1924,1920,1903,1905,1894,1885,1871,1867,1852,1842,1827,1823,1807,500,1800,1822,1818,1820,1824,1839,1857,1848,,,,,,,,,,,,,,,,,,,,,,,,,,,,,,,,,,,,,
2146,1940,1897,1862,1848,1836,1830,1824,1825,1816,1816,1801,1804,1794,1789,1785,1786,1771,1768,1758,1755,1739,1737,1728,1742,500,1744,1737,1746,1742,1755,1761,1781,1867,,,,,,,,,,,,,,,,,,,,,,,,,,,,,,,,,,,,,
2027,1897,1862,1848,1827,1828,1814,1820,1811,1814,1803,1799,1793,1792,1778,1784,1776,1771,1757,1757,1743,1738,1725,1726,1716,1726,1726,1733,1730,1736,1737,1752,1756,1839,,,,,,,,,,,,,,,,,,,,,,,,,,,,,,,,,,,,,
1984,1875,1860,1837,1830,1824,1821,1817,1820,1813,1813,1799,1803,1793,1787,1784,1786,1772,1768,1757,1752,1737,1734,1725,1725,1722,1733,1732,1738,1733,1743,1746,1758,1826,,,,,,,,,,,,,,,,,,,,,,,,,,,,,,,,,,,,,
1891,1813,1794,1785,1769,1774,1762,1769,1761,1765,1756,1752,1746,1746,1733,1739,1731,1727,1713,1712,1698,1693,1680,1681,1671,1679,1678,1686,1682,1687,1686,1697,1697,1769,,,,,,,,,,,,,,,,,,,,,,,,,,,,,,,,,,,,,
1945,1864,1858,1840,1836,1830,1831,1827,1830,1824,1825,1813,1816,1807,1802,1798,1800,1786,1781,1770,1765,1750,1747,1737,1736,1735,1745,1743,1749,1744,1752,1752,1761,1823,,,,,,,,,,,,,,,,,,,,,,,,,,,,,,,,,,,,,
1922,1858,1845,1839,1825,1830,1822,1825,1821,1825,1816,1813,1808,1810,1795,1801,1792,1788,1773,1771,1755,1750,1737,1736,1725,1733,1733,1740,1737,1741,1739,1749,1746,1816,,,,,,,,,,,,,,,,,,,,,,,,,,,,,,,,,,,,,
1858,1793,1793,1778,1775,1770,1772,1766,1772,1764,1768,1754,1762,1751,1748,1744,1745,1731,1726,1714,1709,1694,1691,1681,1680,1679,1687,1684,1690,1685,1693,1692,1700,1758,,,,,,,,,,,,,,,,,,,,,,,,,,,,,,,,,,,,,
1901,1846,1837,1833,1821,1826,1820,1824,1820,1822,1817,1812,1810,1808,1796,1802,1793,1789,1774,1772,1757,1751,1738,1738,1726,1734,1733,1740,1736,1740,1740,1749,1747,1817,,,,,,,,,,,,,,,,,,,,,,,,,,,,,,,,,,,,,
1893,1831,1833,1820,1818,1814,1814,1812,1819,1811,1815,1801,1809,1797,1793,1792,1793,1779,1773,1762,1756,1741,1737,1726,1725,1723,1732,1729,1735,1729,1740,1738,1747,1806,,,,,,,,,,,,,,,,,,,,,,,,,,,,,,,,,,,,,
1833,1785,1779,1775,1766,1772,1763,1770,1765,1770,1763,1760,1759,1757,1744,1752,1744,1740,1725,1724,1709,1703,1690,1688,1677,1685,1685,1692,1688,1691,1691,1699,1697,1767,,,,,,,,,,,,,,,,,,,,,,,,,,,,,,,,,,,,,
1883,1826,1830,1818,1818,1815,1816,1814,1820,1814,1817,1805,1814,1803,1798,1797,1798,1784,1779,1768,1762,1746,1742,1732,1730,1728,1738,1735,1741,1735,1744,1742,1750,1811,,,,,,,,,,,,,,,,,,,,,,,,,,,,,,,,,,,,,
1870,1823,1819,1817,1808,1815,1806,1814,1808,1814,1808,1806,1804,1803,1789,1798,1790,1787,1771,1770,1754,1748,1734,1733,1722,1730,1729,1737,1733,1737,1735,1744,1742,1813,,,,,,,,,,,,,,,,,,,,,,,,,,,,,,,,,,,,,
1873,1817,1823,1812,1813,1811,1811,1810,1814,1810,1814,1802,1808,1799,1795,1795,1795,1779,1779,1764,1762,1746,1741,1730,1728,1726,1736,1734,1740,1734,1742,1740,1749,1809,,,,,,,,,,,,,,,,,,,,,,,,,,,,,,,,,,,,,
1865,1820,1817,1816,1808,1816,1807,1815,1811,1816,1810,1808,1804,1805,1791,1801,1794,1785,1775,1772,1759,1752,1738,1737,1725,1734,1733,1740,1736,1740,1738,1747,1746,1819,,,,,,,,,,,,,,,,,,,,,,,,,,,,,,,,,,,,,
1861,1807,1815,1805,1806,1804,1805,1803,1809,1805,1808,1797,1803,1794,1790,1792,1788,1774,1770,1760,1757,1738,1737,1727,1725,1723,1732,1730,1735,1729,1737,1736,1744,1806,,,,,,,,,,,,,,,,,,,,,,,,,,,,,,,,,,,,,
1848,1805,1803,1803,1794,1802,1793,1802,1798,1804,1798,1796,1793,1794,1780,1790,1778,1774,1762,1759,1749,1738,1728,1727,1715,1723,1722,1729,1725,1729,1726,1736,1733,1804,,,,,,,,,,,,,,,,,,,,,,,,,,,,,,,,,,,,,
1801,1750,1758,1748,1750,1747,1749,1749,1754,1750,1753,1742,1748,1741,1737,1736,1734,1721,1721,1706,1705,1688,1686,1676,1674,1671,1680,1678,1684,1677,1685,1684,1692,1750,,,,,,,,,,,,,,,,,,,,,,,,,,,,,,,,,,,,,
1803,1762,1760,1760,1752,1759,1752,1761,1757,1762,1756,1754,1750,1753,1739,1746,1737,1733,1719,1718,1704,1699,1691,1687,1677,1684,1683,1691,1687,1690,1687,1697,1694,1763,,,,,,,,,,,,,,,,,,,,,,,,,,,,,,,,,,,,,
1831,1778,1786,1776,1778,1776,1777,1776,1782,1778,1781,1769,1775,1767,1764,1760,1762,1747,1743,1733,1729,1714,1710,1700,1704,1699,1710,1707,1713,1706,1714,1713,1720,1775,,,,,,,,,,,,,,,,,,,,,,,,,,,,,,,,,,,,,
1819,1777,1775,1775,1767,1775,1766,1775,1771,1776,1770,1768,1764,1766,1753,1759,1751,1746,1733,1733,1719,1714,1703,1701,1693,1701,1700,1707,1703,1706,1703,1712,1709,1780,,,,,,,,,,,,,,,,,,,,,,,,,,,,,,,,,,,,,
1871,1818,1825,1816,1818,1815,1816,1815,1821,1816,1819,1808,1813,1805,1801,1798,1799,1785,1782,1771,1768,1753,1749,1740,1742,1740,1748,1745,1751,1744,1751,1750,1759,1817,,,,,,,,,,,,,,,,,,,,,,,,,,,,,,,,,,,,,
1881,1836,1833,1833,1825,1832,1823,1832,1827,1832,1825,1823,1819,1820,1806,1815,1806,1800,1787,1787,1774,1769,1759,1761,1747,1755,1755,1762,1757,1761,1757,1766,1763,1834,,,,,,,,,,,,,,,,,,,,,,,,,,,,,,,,,,,,,
1882,1826,1832,1822,1822,1820,1821,1820,1824,1820,1822,1810,1815,1807,1803,1800,1803,1788,1784,1774,1770,1756,1753,1743,1743,1739,1753,1751,1755,1748,1755,1754,1761,1816,,,,,,,,,,,,,,,,,,,,,,,,,,,,,,,,,,,,,
1879,1832,1827,1826,1818,1825,1816,1824,1819,1824,1816,1814,1810,1811,1797,1803,1796,1792,1778,1778,1765,1760,1747,1748,1737,1744,1749,1753,1749,1752,1749,1758,1754,1821,,,,,,,,,,,,,,,,,,,,,,,,,,,,,,,,,,,,,
1890,1832,1837,1826,1826,1822,1823,1822,1827,1822,1823,1811,1816,1808,1804,1800,1802,1788,1785,1775,1772,1757,1754,1745,1744,1742,1752,1748,1759,1748,1757,1752,1763,1818,,,,,,,,,,,,,,,,,,,,,,,,,,,,,,,,,,,,,
1892,1841,1835,1834,1824,1830,1821,1828,1823,1828,1820,1818,1813,1813,1800,1806,1798,1794,1781,1781,1768,1764,1751,1751,1741,1748,1748,1755,1752,1754,1754,1759,1761,1826,,,,,,,,,,,,,,,,,,,,,,,,,,,,,,,,,,,,,
1911,1848,1851,1838,1838,1834,1834,1832,1836,1831,1833,1820,1825,1817,1812,1809,1811,1797,1793,1783,1781,1766,1763,1753,1753,1751,1761,1758,1763,1756,1764,1761,1769,1828,,,,,,,,,,,,,,,,,,,,,,,,,,,,,,,,,,,,,
1907,1851,1844,1840,1829,1835,1824,1832,1826,1830,1822,1819,1814,1815,1801,1808,1801,1796,1782,1783,1770,1766,1753,1753,1742,1750,1750,1757,1756,1761,1756,1764,1762,1829,,,,,,,,,,,,,,,,,,,,,,,,,,,,,,,,,,,,,
1867,1800,1800,1786,1784,1780,1779,1776,1779,1774,1776,1763,1768,1759,1755,1752,1754,1740,1737,1728,1725,1711,1709,1699,1698,1696,1706,1702,1708,1701,1710,1708,1716,1774,,,,,,,,,,,,,,,,,,,,,,,,,,,,,,,,,,,,,
1939,1874,1861,1855,1843,1848,1836,1843,1836,1840,1831,1828,1823,1823,1809,1816,1808,1804,1790,1791,1778,1773,1761,1762,1750,1758,1759,1766,1762,1765,1768,1772,1772,1842,,,,,,,,,,,,,,,,,,,,,,,,,,,,,,,,,,,,,
1967,1885,1879,1861,1857,1851,1849,1846,1849,1842,1843,1830,1835,1826,1821,1817,1820,1806,1803,1794,1791,1776,1773,1764,1764,1761,1773,1770,1777,1770,1779,1779,1788,1852,,,,,,,,,,,,,,,,,,,,,,,,,,,,,,,,,,,,,
1968,1886,1866,1856,1840,1843,1831,1837,1830,1834,1824,1821,1816,1817,1802,1808,1801,1796,1783,1784,1772,1768,1755,1756,1745,1754,1755,1764,1760,1764,1763,1774,1774,1850,,,,,,,,,,,,,,,,,,,,,,,,,,,,,,,,,,,,,
1996,1886,1870,1846,1839,1830,1827,1822,1823,1817,1817,1804,1810,1800,1795,1791,1794,1779,1777,1769,1766,1752,1750,1741,1741,1740,1752,1750,1756,1751,1761,1762,1775,1843,,,,,,,,,,,,,,,,,,,,,,,,,,,,,,,,,,,,,
1993,1863,1828,1810,1790,1790,1775,1779,1771,1774,1764,1761,1756,1757,1742,1748,1741,1737,1725,1726,1714,1710,1699,1701,1691,1700,1702,1710,1707,1712,1713,1727,1731,1813,,,,,,,,,,,,,,,,,,,,,,,,,,,,,,,,,,,,,
2125,1912,1869,1833,1819,1806,1799,1793,1794,1787,1786,1772,1777,1767,1763,1759,1761,1747,1745,1736,1734,1720,1719,1710,1711,1710,1722,1721,1728,1725,1738,1745,1765,1852,,,,,,,,,,,,,,,,,,,,,,,,,,,,,,,,,,,,,
2509,2189,2074,2026,1990,1981,1957,1959,1943,1945,1929,1922,1914,1913,1895,1899,1887,1879,1865,1864,1850,1843,1828,1825,1809,1815,1817,1824,1820,1826,1829,1847,1869,1862,,,,,,,,,,,,,,,,,,,,,,,,,,,,,,,,,,,,,
#,raw_row_delta_max,,,,,,,,,,,,,,,,,,,,,,,,,,,,,,,,,,,,,,,,,,,,,,,,,,,,,,,,,,,,,,,,,,,,,
1000,800,800,800,800,800,800,800,800,800,800,800,800,800,800,800,800,800,800,800,800,800,800,800,800,1500,800,800,800,800,800,800,800,800,,,,,,,,,,,,,,,,,,,,,,,,,,,,,,,,,,,,,
500,500,500,500,500,500,500,500,500,500,500,500,500,500,500,500,500,500,500,500,500,500,500,500,500,1500,500,500,500,500,500,500,500,500,,,,,,,,,,,,,,,,,,,,,,,,,,,,,,,,,,,,,
500,500,500,500,500,500,500,500,500,500,500,500,500,500,500,500,500,500,500,500,500,500,500,500,500,500,500,500,500,500,500,500,500,500,,,,,,,,,,,,,,,,,,,,,,,,,,,,,,,,,,,,,
500,500,500,500,500,500,500,500,500,500,500,500,500,500,500,500,500,500,500,500,500,500,500,500,500,500,500,500,500,500,500,500,500,500,,,,,,,,,,,,,,,,,,,,,,,,,,,,,,,,,,,,,
500,500,500,500,500,500,500,500,500,500,500,500,500,500,500,500,500,500,500,500,500,500,500,500,500,500,500,500,500,500,500,500,500,500,,,,,,,,,,,,,,,,,,,,,,,,,,,,,,,,,,,,,
500,500,500,500,500,500,500,500,500,500,500,500,500,500,500,500,500,500,500,500,500,500,500,500,500,500,500,500,500,500,500,500,500,500,,,,,,,,,,,,,,,,,,,,,,,,,,,,,,,,,,,,,
500,500,500,500,500,500,500,500,500,500,500,500,500,500,500,500,500,500,500,500,500,500,500,500,500,500,500,500,500,500,500,500,500,500,,,,,,,,,,,,,,,,,,,,,,,,,,,,,,,,,,,,,
500,500,500,500,500,500,500,500,500,500,500,500,500,500,500,500,500,500,500,500,500,500,500,500,500,500,500,500,500,500,500,500,500,500,,,,,,,,,,,,,,,,,,,,,,,,,,,,,,,,,,,,,
500,500,500,500,500,500,500,500,500,500,500,500,500,500,500,500,500,500,500,500,500,500,500,500,500,500,500,500,500,500,500,500,500,500,,,,,,,,,,,,,,,,,,,,,,,,,,,,,,,,,,,,,
500,500,500,500,500,500,500,500,500,500,500,500,500,500,500,500,500,500,500,500,500,500,500,500,500,500,500,500,500,500,500,500,500,500,,,,,,,,,,,,,,,,,,,,,,,,,,,,,,,,,,,,,
500,500,500,500,500,500,500,500,500,500,500,500,500,500,500,500,500,500,500,500,500,500,500,500,500,500,500,500,500,500,500,500,500,500,,,,,,,,,,,,,,,,,,,,,,,,,,,,,,,,,,,,,
500,500,500,500,500,500,500,500,500,500,500,500,500,500,500,500,500,500,500,500,500,500,500,500,500,500,500,500,500,500,500,500,500,500,,,,,,,,,,,,,,,,,,,,,,,,,,,,,,,,,,,,,
500,500,500,500,500,500,500,500,500,500,500,500,500,500,500,500,500,500,500,500,500,500,500,500,500,500,500,500,500,500,500,500,500,500,,,,,,,,,,,,,,,,,,,,,,,,,,,,,,,,,,,,,
500,500,500,500,500,500,500,500,500,500,500,500,500,500,500,500,500,500,500,500,500,500,500,500,500,500,500,500,500,500,500,500,500,500,,,,,,,,,,,,,,,,,,,,,,,,,,,,,,,,,,,,,
500,500,500,500,500,500,500,500,500,500,500,500,500,500,500,500,500,500,500,500,500,500,500,500,500,500,500,500,500,500,500,500,500,500,,,,,,,,,,,,,,,,,,,,,,,,,,,,,,,,,,,,,
500,500,500,500,500,500,500,500,500,500,500,500,500,500,500,500,500,500,500,500,500,500,500,500,500,500,500,500,500,500,500,500,500,500,,,,,,,,,,,,,,,,,,,,,,,,,,,,,,,,,,,,,
500,500,500,500,500,500,500,500,500,500,500,500,500,500,500,500,500,500,500,500,500,500,500,500,500,500,500,500,500,500,500,500,500,500,,,,,,,,,,,,,,,,,,,,,,,,,,,,,,,,,,,,,
500,500,500,500,500,500,500,500,500,500,500,500,500,500,500,500,500,500,500,500,500,500,500,500,500,500,500,500,500,500,500,500,500,500,,,,,,,,,,,,,,,,,,,,,,,,,,,,,,,,,,,,,
500,500,500,500,500,500,500,500,500,500,500,500,500,500,500,500,500,500,500,500,500,500,500,500,500,500,500,500,500,500,500,500,500,500,,,,,,,,,,,,,,,,,,,,,,,,,,,,,,,,,,,,,
500,500,500,500,500,500,500,500,500,500,500,500,500,500,500,500,500,500,500,500,500,500,500,500,500,500,500,500,500,500,500,500,500,500,,,,,,,,,,,,,,,,,,,,,,,,,,,,,,,,,,,,,
500,500,500,500,500,500,500,500,500,500,500,500,500,500,500,500,500,500,500,500,500,500,500,500,500,500,500,500,500,500,500,500,500,500,,,,,,,,,,,,,,,,,,,,,,,,,,,,,,,,,,,,,
500,500,500,500,500,500,500,500,500,500,500,500,500,500,500,500,500,500,500,500,500,500,500,500,500,500,500,500,500,500,500,500,500,500,,,,,,,,,,,,,,,,,,,,,,,,,,,,,,,,,,,,,
500,500,500,500,500,500,500,500,500,500,500,500,500,500,500,500,500,500,500,500,500,500,500,500,500,500,500,500,500,500,500,500,500,500,,,,,,,,,,,,,,,,,,,,,,,,,,,,,,,,,,,,,
500,500,500,500,500,500,500,500,500,500,500,500,500,500,500,500,500,500,500,500,500,500,500,500,500,500,500,500,500,500,500,500,500,500,,,,,,,,,,,,,,,,,,,,,,,,,,,,,,,,,,,,,
500,500,500,500,500,500,500,500,500,500,500,500,500,500,500,500,500,500,500,500,500,500,500,500,500,500,500,500,500,500,500,500,500,500,,,,,,,,,,,,,,,,,,,,,,,,,,,,,,,,,,,,,
500,500,500,500,500,500,500,500,500,500,500,500,500,500,500,500,500,500,500,500,500,500,500,500,500,500,500,500,500,500,500,500,500,500,,,,,,,,,,,,,,,,,,,,,,,,,,,,,,,,,,,,,
500,500,500,500,500,500,500,500,500,500,500,500,500,500,500,500,500,500,500,500,500,500,500,500,500,500,500,500,500,500,500,500,500,500,,,,,,,,,,,,,,,,,,,,,,,,,,,,,,,,,,,,,
500,500,500,500,500,500,500,500,500,500,500,500,500,500,500,500,500,500,500,500,500,500,500,500,500,500,500,500,500,500,500,500,500,500,,,,,,,,,,,,,,,,,,,,,,,,,,,,,,,,,,,,,
500,500,500,500,500,500,500,500,500,500,500,500,500,500,500,500,500,500,500,500,500,500,500,500,500,500,500,500,500,500,500,500,500,500,,,,,,,,,,,,,,,,,,,,,,,,,,,,,,,,,,,,,
500,500,500,500,500,500,500,500,500,500,500,500,500,500,500,500,500,500,500,500,500,500,500,500,500,500,500,500,500,500,500,500,500,500,,,,,,,,,,,,,,,,,,,,,,,,,,,,,,,,,,,,,
500,500,500,500,500,500,500,500,500,500,500,500,500,500,500,500,500,500,500,500,500,500,500,500,500,500,500,500,500,500,500,500,500,500,,,,,,,,,,,,,,,,,,,,,,,,,,,,,,,,,,,,,
500,500,500,500,500,500,500,500,500,500,500,500,500,500,500,500,500,500,500,500,500,500,500,500,500,500,500,500,500,500,500,500,500,500,,,,,,,,,,,,,,,,,,,,,,,,,,,,,,,,,,,,,
500,500,500,500,500,500,500,500,500,500,500,500,500,500,500,500,500,500,500,500,500,500,500,500,500,500,500,500,500,500,500,500,500,500,,,,,,,,,,,,,,,,,,,,,,,,,,,,,,,,,,,,,
500,500,500,500,500,500,500,500,500,500,500,500,500,500,500,500,500,500,500,500,500,500,500,500,500,500,500,500,500,500,500,500,500,500,,,,,,,,,,,,,,,,,,,,,,,,,,,,,,,,,,,,,
500,500,500,500,500,500,500,500,500,500,500,500,500,500,500,500,500,500,500,500,500,500,500,500,500,500,500,500,500,500,500,500,500,500,,,,,,,,,,,,,,,,,,,,,,,,,,,,,,,,,,,,,
1000,800,800,800,800,800,800,800,800,800,800,800,800,800,800,800,800,800,800,800,800,800,800,800,800,800,800,800,800,800,800,800,800,800,,,,,,,,,,,,,,,,,,,,,,,,,,,,,,,,,,,,,
#,raw_row_delta_min,,,,,,,,,,,,,,,,,,,,,,,,,,,,,,,,,,,,,,,,,,,,,,,,,,,,,,,,,,,,,,,,,,,,,
-1000,-800,-800,-800,-800,-800,-800,-800,-800,-800,-800,-800,-800,-800,-800,-800,-800,-800,-800,-800,-800,-800,-800,-800,-800,-1500,-800,-800,-800,-800,-800,-800,-800,-800,,,,,,,,,,,,,,,,,,,,,,,,,,,,,,,,,,,,,
-500,-500,-500,-500,-500,-500,-500,-500,-500,-500,-500,-500,-500,-500,-500,-500,-500,-500,-500,-500,-500,-500,-500,-500,-500,-1500,-500,-500,-500,-500,-500,-500,-500,-500,,,,,,,,,,,,,,,,,,,,,,,,,,,,,,,,,,,,,
-500,-500,-500,-500,-500,-500,-500,-500,-500,-500,-500,-500,-500,-500,-500,-500,-500,-500,-500,-500,-500,-500,-500,-500,-500,-500,-500,-500,-500,-500,-500,-500,-500,-500,,,,,,,,,,,,,,,,,,,,,,,,,,,,,,,,,,,,,
-500,-500,-500,-500,-500,-500,-500,-500,-500,-500,-500,-500,-500,-500,-500,-500,-500,-500,-500,-500,-500,-500,-500,-500,-500,-500,-500,-500,-500,-500,-500,-500,-500,-500,,,,,,,,,,,,,,,,,,,,,,,,,,,,,,,,,,,,,
-500,-500,-500,-500,-500,-500,-500,-500,-500,-500,-500,-500,-500,-500,-500,-500,-500,-500,-500,-500,-500,-500,-500,-500,-500,-500,-500,-500,-500,-500,-500,-500,-500,-500,,,,,,,,,,,,,,,,,,,,,,,,,,,,,,,,,,,,,
-500,-500,-500,-500,-500,-500,-500,-500,-500,-500,-500,-500,-500,-500,-500,-500,-500,-500,-500,-500,-500,-500,-500,-500,-500,-500,-500,-500,-500,-500,-500,-500,-500,-500,,,,,,,,,,,,,,,,,,,,,,,,,,,,,,,,,,,,,
-500,-500,-500,-500,-500,-500,-500,-500,-500,-500,-500,-500,-500,-500,-500,-500,-500,-500,-500,-500,-500,-500,-500,-500,-500,-500,-500,-500,-500,-500,-500,-500,-500,-500,,,,,,,,,,,,,,,,,,,,,,,,,,,,,,,,,,,,,
-500,-500,-500,-500,-500,-500,-500,-500,-500,-500,-500,-500,-500,-500,-500,-500,-500,-500,-500,-500,-500,-500,-500,-500,-500,-500,-500,-500,-500,-500,-500,-500,-500,-500,,,,,,,,,,,,,,,,,,,,,,,,,,,,,,,,,,,,,
-500,-500,-500,-500,-500,-500,-500,-500,-500,-500,-500,-500,-500,-500,-500,-500,-500,-500,-500,-500,-500,-500,-500,-500,-500,-500,-500,-500,-500,-500,-500,-500,-500,-500,,,,,,,,,,,,,,,,,,,,,,,,,,,,,,,,,,,,,
-500,-500,-500,-500,-500,-500,-500,-500,-500,-500,-500,-500,-500,-500,-500,-500,-500,-500,-500,-500,-500,-500,-500,-500,-500,-500,-500,-500,-500,-500,-500,-500,-500,-500,,,,,,,,,,,,,,,,,,,,,,,,,,,,,,,,,,,,,
-500,-500,-500,-500,-500,-500,-500,-500,-500,-500,-500,-500,-500,-500,-500,-500,-500,-500,-500,-500,-500,-500,-500,-500,-500,-500,-500,-500,-500,-500,-500,-500,-500,-500,,,,,,,,,,,,,,,,,,,,,,,,,,,,,,,,,,,,,
-500,-500,-500,-500,-500,-500,-500,-500,-500,-500,-500,-500,-500,-500,-500,-500,-500,-500,-500,-500,-500,-500,-500,-500,-500,-500,-500,-500,-500,-500,-500,-500,-500,-500,,,,,,,,,,,,,,,,,,,,,,,,,,,,,,,,,,,,,
-500,-500,-500,-500,-500,-500,-500,-500,-500,-500,-500,-500,-500,-500,-500,-500,-500,-500,-500,-500,-500,-500,-500,-500,-500,-500,-500,-500,-500,-500,-500,-500,-500,-500,,,,,,,,,,,,,,,,,,,,,,,,,,,,,,,,,,,,,
-500,-500,-500,-500,-500,-500,-500,-500,-500,-500,-500,-500,-500,-500,-500,-500,-500,-500,-500,-500,-500,-500,-500,-500,-500,-500,-500,-500,-500,-500,-500,-500,-500,-500,,,,,,,,,,,,,,,,,,,,,,,,,,,,,,,,,,,,,
-500,-500,-500,-500,-500,-500,-500,-500,-500,-500,-500,-500,-500,-500,-500,-500,-500,-500,-500,-500,-500,-500,-500,-500,-500,-500,-500,-500,-500,-500,-500,-500,-500,-500,,,,,,,,,,,,,,,,,,,,,,,,,,,,,,,,,,,,,
-500,-500,-500,-500,-500,-500,-500,-500,-500,-500,-500,-500,-500,-500,-500,-500,-500,-500,-500,-500,-500,-500,-500,-500,-500,-500,-500,-500,-500,-500,-500,-500,-500,-500,,,,,,,,,,,,,,,,,,,,,,,,,,,,,,,,,,,,,
-500,-500,-500,-500,-500,-500,-500,-500,-500,-500,-500,-500,-500,-500,-500,-500,-500,-500,-500,-500,-500,-500,-500,-500,-500,-500,-500,-500,-500,-500,-500,-500,-500,-500,,,,,,,,,,,,,,,,,,,,,,,,,,,,,,,,,,,,,
-500,-500,-500,-500,-500,-500,-500,-500,-500,-500,-500,-500,-500,-500,-500,-500,-500,-500,-500,-500,-500,-500,-500,-500,-500,-500,-500,-500,-500,-500,-500,-500,-500,-500,,,,,,,,,,,,,,,,,,,,,,,,,,,,,,,,,,,,,
-500,-500,-500,-500,-500,-500,-500,-500,-500,-500,-500,-500,-500,-500,-500,-500,-500,-500,-500,-500,-500,-500,-500,-500,-500,-500,-500,-500,-500,-500,-500,-500,-500,-500,,,,,,,,,,,,,,,,,,,,,,,,,,,,,,,,,,,,,
-500,-500,-500,-500,-500,-500,-500,-500,-500,-500,-500,-500,-500,-500,-500,-500,-500,-500,-500,-500,-500,-500,-500,-500,-500,-500,-500,-500,-500,-500,-500,-500,-500,-500,,,,,,,,,,,,,,,,,,,,,,,,,,,,,,,,,,,,,
-500,-500,-500,-500,-500,-500,-500,-500,-500,-500,-500,-500,-500,-500,-500,-500,-500,-500,-500,-500,-500,-500,-500,-500,-500,-500,-500,-500,-500,-500,-500,-500,-500,-500,,,,,,,,,,,,,,,,,,,,,,,,,,,,,,,,,,,,,
-500,-500,-500,-500,-500,-500,-500,-500,-500,-500,-500,-500,-500,-500,-500,-500,-500,-500,-500,-500,-500,-500,-500,-500,-500,-500,-500,-500,-500,-500,-500,-500,-500,-500,,,,,,,,,,,,,,,,,,,,,,,,,,,,,,,,,,,,,
-500,-500,-500,-500,-500,-500,-500,-500,-500,-500,-500,-500,-500,-500,-500,-500,-500,-500,-500,-500,-500,-500,-500,-500,-500,-500,-500,-500,-500,-500,-500,-500,-500,-500,,,,,,,,,,,,,,,,,,,,,,,,,,,,,,,,,,,,,
-500,-500,-500,-500,-500,-500,-500,-500,-500,-500,-500,-500,-500,-500,-500,-500,-500,-500,-500,-500,-500,-500,-500,-500,-500,-500,-500,-500,-500,-500,-500,-500,-500,-500,,,,,,,,,,,,,,,,,,,,,,,,,,,,,,,,,,,,,
-500,-500,-500,-500,-500,-500,-500,-500,-500,-500,-500,-500,-500,-500,-500,-500,-500,-500,-500,-500,-500,-500,-500,-500,-500,-500,-500,-500,-500,-500,-500,-500,-500,-500,,,,,,,,,,,,,,,,,,,,,,,,,,,,,,,,,,,,,
-500,-500,-500,-500,-500,-500,-500,-500,-500,-500,-500,-500,-500,-500,-500,-500,-500,-500,-500,-500,-500,-500,-500,-500,-500,-500,-500,-500,-500,-500,-500,-500,-500,-500,,,,,,,,,,,,,,,,,,,,,,,,,,,,,,,,,,,,,
-500,-500,-500,-500,-500,-500,-500,-500,-500,-500,-500,-500,-500,-500,-500,-500,-500,-500,-500,-500,-500,-500,-500,-500,-500,-500,-500,-500,-500,-500,-500,-500,-500,-500,,,,,,,,,,,,,,,,,,,,,,,,,,,,,,,,,,,,,
-500,-500,-500,-500,-500,-500,-500,-500,-500,-500,-500,-500,-500,-500,-500,-500,-500,-500,-500,-500,-500,-500,-500,-500,-500,-500,-500,-500,-500,-500,-500,-500,-500,-500,,,,,,,,,,,,,,,,,,,,,,,,,,,,,,,,,,,,,
-500,-500,-500,-500,-500,-500,-500,-500,-500,-500,-500,-500,-500,-500,-500,-500,-500,-500,-500,-500,-500,-500,-500,-500,-500,-500,-500,-500,-500,-500,-500,-500,-500,-500,,,,,,,,,,,,,,,,,,,,,,,,,,,,,,,,,,,,,
-500,-500,-500,-500,-500,-500,-500,-500,-500,-500,-500,-500,-500,-500,-500,-500,-500,-500,-500,-500,-500,-500,-500,-500,-500,-500,-500,-500,-500,-500,-500,-500,-500,-500,,,,,,,,,,,,,,,,,,,,,,,,,,,,,,,,,,,,,
-500,-500,-500,-500,-500,-500,-500,-500,-500,-500,-500,-500,-500,-500,-500,-500,-500,-500,-500,-500,-500,-500,-500,-500,-500,-500,-500,-500,-500,-500,-500,-500,-500,-500,,,,,,,,,,,,,,,,,,,,,,,,,,,,,,,,,,,,,
-500,-500,-500,-500,-500,-500,-500,-500,-500,-500,-500,-500,-500,-500,-500,-500,-500,-500,-500,-500,-500,-500,-500,-500,-500,-500,-500,-500,-500,-500,-500,-500,-500,-500,,,,,,,,,,,,,,,,,,,,,,,,,,,,,,,,,,,,,
-500,-500,-500,-500,-500,-500,-500,-500,-500,-500,-500,-500,-500,-500,-500,-500,-500,-500,-500,-500,-500,-500,-500,-500,-500,-500,-500,-500,-500,-500,-500,-500,-500,-500,,,,,,,,,,,,,,,,,,,,,,,,,,,,,,,,,,,,,
-500,-500,-500,-500,-500,-500,-500,-500,-500,-500,-500,-500,-500,-500,-500,-500,-500,-500,-500,-500,-500,-500,-500,-500,-500,-500,-500,-500,-500,-500,-500,-500,-500,-500,,,,,,,,,,,,,,,,,,,,,,,,,,,,,,,,,,,,,
-500,-500,-500,-500,-500,-500,-500,-500,-500,-500,-500,-500,-500,-500,-500,-500,-500,-500,-500,-500,-500,-500,-500,-500,-500,-500,-500,-500,-500,-500,-500,-500,-500,-500,,,,,,,,,,,,,,,,,,,,,,,,,,,,,,,,,,,,,
-1000,-800,-800,-800,-800,-800,-800,-800,-800,-800,-800,-800,-800,-800,-800,-800,-800,-800,-800,-800,-800,-800,-800,-800,-800,-800,-800,-800,-800,-800,-800,-800,-800,-800,,,,,,,,,,,,,,,,,,,,,,,,,,,,,,,,,,,,,
#,raw_col_delta_max,,,,,,,,,,,,,,,,,,,,,,,,,,,,,,,,,,,,,,,,,,,,,,,,,,,,,,,,,,,,,,,,,,,,,
1000,500,500,500,500,500,500,500,500,500,500,500,500,500,500,500,500,500,500,500,500,500,500,500,2000,2000,2000,500,500,500,500,500,800,,,,,,,,,,,,,,,,,,,,,,,,,,,,,,,,,,,,,,
800,500,500,500,500,500,500,500,500,500,500,500,500,500,500,500,500,500,500,500,500,500,500,500,2000,2000,2000,500,500,500,500,500,800,,,,,,,,,,,,,,,,,,,,,,,,,,,,,,,,,,,,,,
800,500,500,500,500,500,500,500,500,500,500,500,500,500,500,500,500,500,500,500,500,500,500,500,500,500,500,500,500,500,500,500,800,,,,,,,,,,,,,,,,,,,,,,,,,,,,,,,,,,,,,,
800,500,500,500,500,500,500,500,500,500,500,500,500,500,500,500,500,500,500,500,500,500,500,500,500,500,500,500,500,500,500,500,800,,,,,,,,,,,,,,,,,,,,,,,,,,,,,,,,,,,,,,
800,500,500,500,500,500,500,500,500,500,500,500,500,500,500,500,500,500,500,500,500,500,500,500,500,500,500,500,500,500,500,500,800,,,,,,,,,,,,,,,,,,,,,,,,,,,,,,,,,,,,,,
800,500,500,500,500,500,500,500,500,500,500,500,500,500,500,500,500,500,500,500,500,500,500,500,500,500,500,500,500,500,500,500,800,,,,,,,,,,,,,,,,,,,,,,,,,,,,,,,,,,,,,,
800,500,500,500,500,500,500,500,500,500,500,500,500,500,500,500,500,500,500,500,500,500,500,500,500,500,500,500,500,500,500,500,800,,,,,,,,,,,,,,,,,,,,,,,,,,,,,,,,,,,,,,
800,500,500,500,500,500,500,500,500,500,500,500,500,500,500,500,500,500,500,500,500,500,500,500,500,500,500,500,500,500,500,500,800,,,,,,,,,,,,,,,,,,,,,,,,,,,,,,,,,,,,,,
800,500,500,500,500,500,500,500,500,500,500,500,500,500,500,500,500,500,500,500,500,500,500,500,500,500,500,500,500,500,500,500,800,,,,,,,,,,,,,,,,,,,,,,,,,,,,,,,,,,,,,,
800,500,500,500,500,500,500,500,500,500,500,500,500,500,500,500,500,500,500,500,500,500,500,500,500,500,500,500,500,500,500,500,800,,,,,,,,,,,,,,,,,,,,,,,,,,,,,,,,,,,,,,
800,500,500,500,500,500,500,500,500,500,500,500,500,500,500,500,500,500,500,500,500,500,500,500,500,500,500,500,500,500,500,500,800,,,,,,,,,,,,,,,,,,,,,,,,,,,,,,,,,,,,,,
800,500,500,500,500,500,500,500,500,500,500,500,500,500,500,500,500,500,500,500,500,500,500,500,500,500,500,500,500,500,500,500,800,,,,,,,,,,,,,,,,,,,,,,,,,,,,,,,,,,,,,,
800,500,500,500,500,500,500,500,500,500,500,500,500,500,500,500,500,500,500,500,500,500,500,500,500,500,500,500,500,500,500,500,800,,,,,,,,,,,,,,,,,,,,,,,,,,,,,,,,,,,,,,
800,500,500,500,500,500,500,500,500,500,500,500,500,500,500,500,500,500,500,500,500,500,500,500,500,500,500,500,500,500,500,500,800,,,,,,,,,,,,,,,,,,,,,,,,,,,,,,,,,,,,,,
800,500,500,500,500,500,500,500,500,500,500,500,500,500,500,500,500,500,500,500,500,500,500,500,500,500,500,500,500,500,500,500,800,,,,,,,,,,,,,,,,,,,,,,,,,,,,,,,,,,,,,,
800,500,500,500,500,500,500,500,500,500,500,500,500,500,500,500,500,500,500,500,500,500,500,500,500,500,500,500,500,500,500,500,800,,,,,,,,,,,,,,,,,,,,,,,,,,,,,,,,,,,,,,
800,500,500,500,500,500,500,500,500,500,500,500,500,500,500,500,500,500,500,500,500,500,500,500,500,500,500,500,500,500,500,500,800,,,,,,,,,,,,,,,,,,,,,,,,,,,,,,,,,,,,,,
800,500,500,500,500,500,500,500,500,500,500,500,500,500,500,500,500,500,500,500,500,500,500,500,500,500,500,500,500,500,500,500,800,,,,,,,,,,,,,,,,,,,,,,,,,,,,,,,,,,,,,,
800,500,500,500,500,500,500,500,500,500,500,500,500,500,500,500,500,500,500,500,500,500,500,500,500,500,500,500,500,500,500,500,800,,,,,,,,,,,,,,,,,,,,,,,,,,,,,,,,,,,,,,
800,500,500,500,500,500,500,500,500,500,500,500,500,500,500,500,500,500,500,500,500,500,500,500,500,500,500,500,500,500,500,500,800,,,,,,,,,,,,,,,,,,,,,,,,,,,,,,,,,,,,,,
800,500,500,500,500,500,500,500,500,500,500,500,500,500,500,500,500,500,500,500,500,500,500,500,500,500,500,500,500,500,500,500,800,,,,,,,,,,,,,,,,,,,,,,,,,,,,,,,,,,,,,,
800,500,500,500,500,500,500,500,500,500,500,500,500,500,500,500,500,500,500,500,500,500,500,500,500,500,500,500,500,500,500,500,800,,,,,,,,,,,,,,,,,,,,,,,,,,,,,,,,,,,,,,
800,500,500,500,500,500,500,500,500,500,500,500,500,500,500,500,500,500,500,500,500,500,500,500,500,500,500,500,500,500,500,500,800,,,,,,,,,,,,,,,,,,,,,,,,,,,,,,,,,,,,,,
800,500,500,500,500,500,500,500,500,500,500,500,500,500,500,500,500,500,500,500,500,500,500,500,500,500,500,500,500,500,500,500,800,,,,,,,,,,,,,,,,,,,,,,,,,,,,,,,,,,,,,,
800,500,500,500,500,500,500,500,500,500,500,500,500,500,500,500,500,500,500,500,500,500,500,500,500,500,500,500,500,500,500,500,800,,,,,,,,,,,,,,,,,,,,,,,,,,,,,,,,,,,,,,
800,500,500,500,500,500,500,500,500,500,500,500,500,500,500,500,500,500,500,500,500,500,500,500,500,500,500,500,500,500,500,500,800,,,,,,,,,,,,,,,,,,,,,,,,,,,,,,,,,,,,,,
800,500,500,500,500,500,500,500,500,500,500,500,500,500,500,500,500,500,500,500,500,500,500,500,500,500,500,500,500,500,500,500,800,,,,,,,,,,,,,,,,,,,,,,,,,,,,,,,,,,,,,,
800,500,500,500,500,500,500,500,500,500,500,500,500,500,500,500,500,500,500,500,500,500,500,500,500,500,500,500,500,500,500,500,800,,,,,,,,,,,,,,,,,,,,,,,,,,,,,,,,,,,,,,
800,500,500,500,500,500,500,500,500,500,500,500,500,500,500,500,500,500,500,500,500,500,500,500,500,500,500,500,500,500,500,500,800,,,,,,,,,,,,,,,,,,,,,,,,,,,,,,,,,,,,,,
800,500,500,500,500,500,500,500,500,500,500,500,500,500,500,500,500,500,500,500,500,500,500,500,500,500,500,500,500,500,500,500,800,,,,,,,,,,,,,,,,,,,,,,,,,,,,,,,,,,,,,,
800,500,500,500,500,500,500,500,500,500,500,500,500,500,500,500,500,500,500,500,500,500,500,500,500,500,500,500,500,500,500,500,800,,,,,,,,,,,,,,,,,,,,,,,,,,,,,,,,,,,,,,
800,500,500,500,500,500,500,500,500,500,500,500,500,500,500,500,500,500,500,500,500,500,500,500,500,500,500,500,500,500,500,500,800,,,,,,,,,,,,,,,,,,,,,,,,,,,,,,,,,,,,,,
800,500,500,500,500,500,500,500,500,500,500,500,500,500,500,500,500,500,500,500,500,500,500,500,500,500,500,500,500,500,500,500,800,,,,,,,,,,,,,,,,,,,,,,,,,,,,,,,,,,,,,,
800,500,500,500,500,500,500,500,500,500,500,500,500,500,500,500,500,500,500,500,500,500,500,500,500,500,500,500,500,500,500,500,800,,,,,,,,,,,,,,,,,,,,,,,,,,,,,,,,,,,,,,
800,500,500,500,500,500,500,500,500,500,500,500,500,500,500,500,500,500,500,500,500,500,500,500,500,500,500,500,500,500,500,500,800,,,,,,,,,,,,,,,,,,,,,,,,,,,,,,,,,,,,,,
800,500,500,500,500,500,500,500,500,500,500,500,500,500,500,500,500,500,500,500,500,500,500,500,500,500,500,500,500,500,500,500,800,,,,,,,,,,,,,,,,,,,,,,,,,,,,,,,,,,,,,,
1000,500,500,500,500,500,500,500,500,500,500,500,500,500,500,500,500,500,500,500,500,500,500,500,500,500,500,500,500,500,500,500,800,,,,,,,,,,,,,,,,,,,,,,,,,,,,,,,,,,,,,,
#,raw_col_delta_min,,,,,,,,,,,,,,,,,,,,,,,,,,,,,,,,,,,,,,,,,,,,,,,,,,,,,,,,,,,,,,,,,,,,,
-1000,-500,-500,-500,-500,-500,-500,-500,-500,-500,-500,-500,-500,-500,-500,-500,-500,-500,-500,-500,-500,-500,-500,-500,-2000,-2000,-2000,-500,-500,-500,-500,-500,-800,,,,,,,,,,,,,,,,,,,,,,,,,,,,,,,,,,,,,,
-800,-500,-500,-500,-500,-500,-500,-500,-500,-500,-500,-500,-500,-500,-500,-500,-500,-500,-500,-500,-500,-500,-500,-500,-2000,-2000,-2000,-500,-500,-500,-500,-500,-800,,,,,,,,,,,,,,,,,,,,,,,,,,,,,,,,,,,,,,
-800,-500,-500,-500,-500,-500,-500,-500,-500,-500,-500,-500,-500,-500,-500,-500,-500,-500,-500,-500,-500,-500,-500,-500,-500,-500,-500,-500,-500,-500,-500,-500,-800,,,,,,,,,,,,,,,,,,,,,,,,,,,,,,,,,,,,,,
-800,-500,-500,-500,-500,-500,-500,-500,-500,-500,-500,-500,-500,-500,-500,-500,-500,-500,-500,-500,-500,-500,-500,-500,-500,-500,-500,-500,-500,-500,-500,-500,-800,,,,,,,,,,,,,,,,,,,,,,,,,,,,,,,,,,,,,,
-800,-500,-500,-500,-500,-500,-500,-500,-500,-500,-500,-500,-500,-500,-500,-500,-500,-500,-500,-500,-500,-500,-500,-500,-500,-500,-500,-500,-500,-500,-500,-500,-800,,,,,,,,,,,,,,,,,,,,,,,,,,,,,,,,,,,,,,
-800,-500,-500,-500,-500,-500,-500,-500,-500,-500,-500,-500,-500,-500,-500,-500,-500,-500,-500,-500,-500,-500,-500,-500,-500,-500,-500,-500,-500,-500,-500,-500,-800,,,,,,,,,,,,,,,,,,,,,,,,,,,,,,,,,,,,,,
-800,-500,-500,-500,-500,-500,-500,-500,-500,-500,-500,-500,-500,-500,-500,-500,-500,-500,-500,-500,-500,-500,-500,-500,-500,-500,-500,-500,-500,-500,-500,-500,-800,,,,,,,,,,,,,,,,,,,,,,,,,,,,,,,,,,,,,,
-800,-500,-500,-500,-500,-500,-500,-500,-500,-500,-500,-500,-500,-500,-500,-500,-500,-500,-500,-500,-500,-500,-500,-500,-500,-500,-500,-500,-500,-500,-500,-500,-800,,,,,,,,,,,,,,,,,,,,,,,,,,,,,,,,,,,,,,
-800,-500,-500,-500,-500,-500,-500,-500,-500,-500,-500,-500,-500,-500,-500,-500,-500,-500,-500,-500,-500,-500,-500,-500,-500,-500,-500,-500,-500,-500,-500,-500,-800,,,,,,,,,,,,,,,,,,,,,,,,,,,,,,,,,,,,,,
-800,-500,-500,-500,-500,-500,-500,-500,-500,-500,-500,-500,-500,-500,-500,-500,-500,-500,-500,-500,-500,-500,-500,-500,-500,-500,-500,-500,-500,-500,-500,-500,-800,,,,,,,,,,,,,,,,,,,,,,,,,,,,,,,,,,,,,,
-800,-500,-500,-500,-500,-500,-500,-500,-500,-500,-500,-500,-500,-500,-500,-500,-500,-500,-500,-500,-500,-500,-500,-500,-500,-500,-500,-500,-500,-500,-500,-500,-800,,,,,,,,,,,,,,,,,,,,,,,,,,,,,,,,,,,,,,
-800,-500,-500,-500,-500,-500,-500,-500,-500,-500,-500,-500,-500,-500,-500,-500,-500,-500,-500,-500,-500,-500,-500,-500,-500,-500,-500,-500,-500,-500,-500,-500,-800,,,,,,,,,,,,,,,,,,,,,,,,,,,,,,,,,,,,,,
-800,-500,-500,-500,-500,-500,-500,-500,-500,-500,-500,-500,-500,-500,-500,-500,-500,-500,-500,-500,-500,-500,-500,-500,-500,-500,-500,-500,-500,-500,-500,-500,-800,,,,,,,,,,,,,,,,,,,,,,,,,,,,,,,,,,,,,,
-800,-500,-500,-500,-500,-500,-500,-500,-500,-500,-500,-500,-500,-500,-500,-500,-500,-500,-500,-500,-500,-500,-500,-500,-500,-500,-500,-500,-500,-500,-500,-500,-800,,,,,,,,,,,,,,,,,,,,,,,,,,,,,,,,,,,,,,
-800,-500,-500,-500,-500,-500,-500,-500,-500,-500,-500,-500,-500,-500,-500,-500,-500,-500,-500,-500,-500,-500,-500,-500,-500,-500,-500,-500,-500,-500,-500,-500,-800,,,,,,,,,,,,,,,,,,,,,,,,,,,,,,,,,,,,,,
-800,-500,-500,-500,-500,-500,-500,-500,-500,-500,-500,-500,-500,-500,-500,-500,-500,-500,-500,-500,-500,-500,-500,-500,-500,-500,-500,-500,-500,-500,-500,-500,-800,,,,,,,,,,,,,,,,,,,,,,,,,,,,,,,,,,,,,,
-800,-500,-500,-500,-500,-500,-500,-500,-500,-500,-500,-500,-500,-500,-500,-500,-500,-500,-500,-500,-500,-500,-500,-500,-500,-500,-500,-500,-500,-500,-500,-500,-800,,,,,,,,,,,,,,,,,,,,,,,,,,,,,,,,,,,,,,
-800,-500,-500,-500,-500,-500,-500,-500,-500,-500,-500,-500,-500,-500,-500,-500,-500,-500,-500,-500,-500,-500,-500,-500,-500,-500,-500,-500,-500,-500,-500,-500,-800,,,,,,,,,,,,,,,,,,,,,,,,,,,,,,,,,,,,,,
-800,-500,-500,-500,-500,-500,-500,-500,-500,-500,-500,-500,-500,-500,-500,-500,-500,-500,-500,-500,-500,-500,-500,-500,-500,-500,-500,-500,-500,-500,-500,-500,-800,,,,,,,,,,,,,,,,,,,,,,,,,,,,,,,,,,,,,,
-800,-500,-500,-500,-500,-500,-500,-500,-500,-500,-500,-500,-500,-500,-500,-500,-500,-500,-500,-500,-500,-500,-500,-500,-500,-500,-500,-500,-500,-500,-500,-500,-800,,,,,,,,,,,,,,,,,,,,,,,,,,,,,,,,,,,,,,
-800,-500,-500,-500,-500,-500,-500,-500,-500,-500,-500,-500,-500,-500,-500,-500,-500,-500,-500,-500,-500,-500,-500,-500,-500,-500,-500,-500,-500,-500,-500,-500,-800,,,,,,,,,,,,,,,,,,,,,,,,,,,,,,,,,,,,,,
-800,-500,-500,-500,-500,-500,-500,-500,-500,-500,-500,-500,-500,-500,-500,-500,-500,-500,-500,-500,-500,-500,-500,-500,-500,-500,-500,-500,-500,-500,-500,-500,-800,,,,,,,,,,,,,,,,,,,,,,,,,,,,,,,,,,,,,,
-800,-500,-500,-500,-500,-500,-500,-500,-500,-500,-500,-500,-500,-500,-500,-500,-500,-500,-500,-500,-500,-500,-500,-500,-500,-500,-500,-500,-500,-500,-500,-500,-800,,,,,,,,,,,,,,,,,,,,,,,,,,,,,,,,,,,,,,
-800,-500,-500,-500,-500,-500,-500,-500,-500,-500,-500,-500,-500,-500,-500,-500,-500,-500,-500,-500,-500,-500,-500,-500,-500,-500,-500,-500,-500,-500,-500,-500,-800,,,,,,,,,,,,,,,,,,,,,,,,,,,,,,,,,,,,,,
-800,-500,-500,-500,-500,-500,-500,-500,-500,-500,-500,-500,-500,-500,-500,-500,-500,-500,-500,-500,-500,-500,-500,-500,-500,-500,-500,-500,-500,-500,-500,-500,-800,,,,,,,,,,,,,,,,,,,,,,,,,,,,,,,,,,,,,,
-800,-500,-500,-500,-500,-500,-500,-500,-500,-500,-500,-500,-500,-500,-500,-500,-500,-500,-500,-500,-500,-500,-500,-500,-500,-500,-500,-500,-500,-500,-500,-500,-800,,,,,,,,,,,,,,,,,,,,,,,,,,,,,,,,,,,,,,
-800,-500,-500,-500,-500,-500,-500,-500,-500,-500,-500,-500,-500,-500,-500,-500,-500,-500,-500,-500,-500,-500,-500,-500,-500,-500,-500,-500,-500,-500,-500,-500,-800,,,,,,,,,,,,,,,,,,,,,,,,,,,,,,,,,,,,,,
-800,-500,-500,-500,-500,-500,-500,-500,-500,-500,-500,-500,-500,-500,-500,-500,-500,-500,-500,-500,-500,-500,-500,-500,-500,-500,-500,-500,-500,-500,-500,-500,-800,,,,,,,,,,,,,,,,,,,,,,,,,,,,,,,,,,,,,,
-800,-500,-500,-500,-500,-500,-500,-500,-500,-500,-500,-500,-500,-500,-500,-500,-500,-500,-500,-500,-500,-500,-500,-500,-500,-500,-500,-500,-500,-500,-500,-500,-800,,,,,,,,,,,,,,,,,,,,,,,,,,,,,,,,,,,,,,
-800,-500,-500,-500,-500,-500,-500,-500,-500,-500,-500,-500,-500,-500,-500,-500,-500,-500,-500,-500,-500,-500,-500,-500,-500,-500,-500,-500,-500,-500,-500,-500,-800,,,,,,,,,,,,,,,,,,,,,,,,,,,,,,,,,,,,,,
-800,-500,-500,-500,-500,-500,-500,-500,-500,-500,-500,-500,-500,-500,-500,-500,-500,-500,-500,-500,-500,-500,-500,-500,-500,-500,-500,-500,-500,-500,-500,-500,-800,,,,,,,,,,,,,,,,,,,,,,,,,,,,,,,,,,,,,,
-800,-500,-500,-500,-500,-500,-500,-500,-500,-500,-500,-500,-500,-500,-500,-500,-500,-500,-500,-500,-500,-500,-500,-500,-500,-500,-500,-500,-500,-500,-500,-500,-800,,,,,,,,,,,,,,,,,,,,,,,,,,,,,,,,,,,,,,
-800,-500,-500,-500,-500,-500,-500,-500,-500,-500,-500,-500,-500,-500,-500,-500,-500,-500,-500,-500,-500,-500,-500,-500,-500,-500,-500,-500,-500,-500,-500,-500,-800,,,,,,,,,,,,,,,,,,,,,,,,,,,,,,,,,,,,,,
-800,-500,-500,-500,-500,-500,-500,-500,-500,-500,-500,-500,-500,-500,-500,-500,-500,-500,-500,-500,-500,-500,-500,-500,-500,-500,-500,-500,-500,-500,-500,-500,-800,,,,,,,,,,,,,,,,,,,,,,,,,,,,,,,,,,,,,,
-800,-500,-500,-500,-500,-500,-500,-500,-500,-500,-500,-500,-500,-500,-500,-500,-500,-500,-500,-500,-500,-500,-500,-500,-500,-500,-500,-500,-500,-500,-500,-500,-800,,,,,,,,,,,,,,,,,,,,,,,,,,,,,,,,,,,,,,
-800,-500,-500,-500,-500,-500,-500,-500,-500,-500,-500,-500,-500,-500,-500,-500,-500,-500,-500,-500,-500,-500,-500,-500,-500,-500,-500,-500,-500,-500,-500,-500,-800,,,,,,,,,,,,,,,,,,,,,,,,,,,,,,,,,,,,,,
-1000,-500,-500,-500,-500,-500,-500,-500,-500,-500,-500,-500,-500,-500,-500,-500,-500,-500,-500,-500,-500,-500,-500,-500,-500,-500,-500,-500,-500,-500,-500,-500,-800,,,,,,,,,,,,,,,,,,,,,,,,,,,,,,,,,,,,,,
#,line_max,,,,,,,,,,,,,,,,,,,,,,,,,,,,,,,,,,,,,,,,,,,,,,,,,,,,,,,,,,,,,,,,,,,,,
8000,8000,8000,8000,8000,8000,8000,8000,8000,8000,8000,8000,8000,8000,8000,8000,8000,8000,8000,8000,8000,8000,8000,8000,8000,8000,8000,8000,8000,8000,8000,8000,8000,8000,8000,8000,8000,8000,8000,8000,8000,8000,8000,8000,8000,8000,8000,8000,8000,8000,8000,8000,8000,8000,8000,8000,8000,8000,8000,8000,8000,8000,8000,8000,8000,8000,8000,8000,8000,8000,8000
#,line_min,,,,,,,,,,,,,,,,,,,,,,,,,,,,,,,,,,,,,,,,,,,,,,,,,,,,,,,,,,,,,,,,,,,,,
300,300,300,300,300,300,300,300,300,300,300,300,300,300,300,300,300,300,300,300,300,300,300,300,300,300,300,300,300,300,300,300,300,300,300,300,300,300,300,300,300,300,300,300,300,300,300,300,300,300,300,300,300,300,300,300,300,300,300,300,300,300,300,300,300,300,300,300,300,300,300
