#,version,,,,,,,,,,,,,,,,,,,,,,,,,,,,,,,,,,,,,,,,,,,,,,,,,,,,,,,,,,,,,,,,,,,,,
2023,2,7,1,,,,,,,,,,,,,,,,,,,,,,,,,,,,,,,,,,,,,,,,,,,,,,,,,,,,,,,,,,,,,,,,,,,
#,row_col_num,,,,,,,,,,,,,,,,,,,,,,,,,,,,,,,,,,,,,,,,,,,,,,,,,,,,,,,,,,,,,,,,,,,,,
37,34,,,,,,,,,,,,,,,,,,,,,,,,,,,,,,,,,,,,,,,,,,,,,,,,,,,,,,,,,,,,,,,,,,,,,
#,noise,,,,,,,,,,,,,,,,,,,,,,,,,,,,,,,,,,,,,,,,,,,,,,,,,,,,,,,,,,,,,,,,,,,,,
-600,600,,,,,,,,,,,,,,,,,,,,,,,,,,,,,,,,,,,,,,,,,,,,,,,,,,,,,,,,,,,,,,,,,,,,,
#,raw_max,,,,,,,,,,,,,,,,,,,,,,,,,,,,,,,,,,,,,,,,,,,,,,,,,,,,,,,,,,,,,,,,,,,,,
3014,2999,2975,2930,2938,2922,2905,2899,2886,2880,2862,2867,2833,2847,2820,2822,2826,2810,2806,2797,2788,2790,2786,2784,2807,2053,2798,2818,2690,2685,2694,2708,2735,2750,,,,,,,,,,,,,,,,,,,,,,,,,,,,,,,,,,,,,
3000,2925,2915,2877,2881,2895,2870,2872,2854,2853,2840,2847,2812,2830,2798,2804,2809,2797,2788,2777,2768,2769,2772,2767,2799,3184,2743,2714,2672,2668,2677,2687,2710,2812,,,,,,,,,,,,,,,,,,,,,,,,,,,,,,,,,,,,,
3000,2940,2941,2911,2917,2926,2922,2911,2898,2895,2884,2891,2859,2884,2851,2854,2862,2852,2842,2834,2819,2821,2821,2818,2831,2808,2773,2756,2723,2721,2731,2736,2756,2856,,,,,,,,,,,,,,,,,,,,,,,,,,,,,,,,,,,,,
2957,2906,2915,2889,2899,2910,2898,2913,2891,2885,2873,2887,2856,2878,2851,2853,2859,2849,2843,2837,2822,2823,2823,2821,2831,2798,2771,2756,2724,2720,2729,2737,2754,2849,,,,,,,,,,,,,,,,,,,,,,,,,,,,,,,,,,,,,
2898,2856,2868,2844,2858,2870,2859,2868,2870,2853,2843,2860,2828,2850,2822,2823,2836,2821,2816,2807,2796,2795,2795,2795,2806,2776,2748,2731,2697,2696,2704,2711,2730,2827,,,,,,,,,,,,,,,,,,,,,,,,,,,,,,,,,,,,,
3016,2976,2993,2972,2993,3006,2993,3003,2993,3002,2988,3002,2970,2996,2969,2967,2981,2969,2959,2952,2944,2942,2943,2941,2954,2923,2894,2878,2842,2840,2850,2852,2871,2972,,,,,,,,,,,,,,,,,,,,,,,,,,,,,,,,,,,,,
2999,2967,2984,2962,2986,3000,2985,3003,2994,2992,2997,3007,2972,3002,2970,2974,2988,2971,2965,2960,2949,2948,2950,2946,2959,2929,2901,2882,2851,2850,2860,2861,2880,2979,,,,,,,,,,,,,,,,,,,,,,,,,,,,,,,,,,,,,
3021,2995,3018,2997,3020,3032,3023,3038,3035,3026,3023,3056,3016,3044,3015,3023,3033,3017,3011,3004,2993,2995,2993,2993,3009,2976,2949,2931,2892,2894,2901,2906,2935,3019,,,,,,,,,,,,,,,,,,,,,,,,,,,,,,,,,,,,,
2991,2960,2986,2968,2995,3010,3008,3024,3012,3005,3001,3025,3002,3029,2995,3003,3011,2998,2988,2977,2972,2974,2969,2974,2991,2961,2935,2920,2884,2882,2887,2894,2917,3009,,,,,,,,,,,,,,,,,,,,,,,,,,,,,,,,,,,,,
2925,2900,2925,2910,2936,2953,2951,2967,2960,2961,2958,2978,2946,2988,2953,2957,2967,2954,2949,2934,2924,2924,2927,2932,2948,2918,2893,2878,2843,2841,2849,2846,2877,2951,,,,,,,,,,,,,,,,,,,,,,,,,,,,,,,,,,,,,
3005,2987,3013,2995,3026,3042,3037,3053,3049,3052,3051,3071,3038,3074,3054,3060,3067,3051,3041,3026,3018,3022,3023,3032,3045,3014,2990,2974,2936,2934,2951,2947,2974,3051,,,,,,,,,,,,,,,,,,,,,,,,,,,,,,,,,,,,,
3064,3046,3073,3056,3091,3113,3105,3125,3115,3123,3118,3143,3109,3148,3117,3134,3146,3131,3117,3103,3086,3099,3102,3106,3120,3087,3063,3047,3011,3007,3012,3023,3052,3122,,,,,,,,,,,,,,,,,,,,,,,,,,,,,,,,,,,,,
3070,3052,3082,3069,3104,3127,3122,3139,3132,3136,3132,3159,3125,3165,3137,3149,3165,3155,3139,3129,3124,3127,3137,3134,3148,3114,3082,3075,3036,3029,3040,3048,3073,3155,,,,,,,,,,,,,,,,,,,,,,,,,,,,,,,,,,,,,
3013,2991,3024,3014,3042,3070,3068,3079,3084,3083,3076,3110,3077,3115,3089,3092,3105,3100,3092,3080,3072,3082,3082,3075,3089,3062,3028,3018,2985,2981,2993,3000,3020,3103,,,,,,,,,,,,,,,,,,,,,,,,,,,,,,,,,,,,,
3038,3024,3056,3041,3077,3105,3101,3119,3115,3118,3119,3140,3113,3152,3124,3129,3139,3131,3135,3127,3112,3115,3120,3118,3129,3102,3068,3056,3021,3025,3028,3032,3059,3137,,,,,,,,,,,,,,,,,,,,,,,,,,,,,,,,,,,,,
2999,2986,3020,3009,3043,3068,3063,3078,3073,3081,3078,3103,3077,3117,3087,3096,3108,3099,3093,3090,3090,3089,3089,3094,3098,3067,3038,3026,2993,2989,3004,3004,3026,3112,,,,,,,,,,,,,,,,,,,,,,,,,,,,,,,,,,,,,
3054,3037,3075,3063,3098,3123,3123,3139,3134,3139,3138,3165,3136,3178,3147,3158,3171,3162,3155,3150,3146,3155,3149,3147,3161,3131,3101,3091,3052,3050,3056,3059,3086,3169,,,,,,,,,,,,,,,,,,,,,,,,,,,,,,,,,,,,,
2889,2875,2912,2902,2934,2959,2956,2975,2968,2975,2973,3000,2973,3013,2981,2992,3009,2998,2993,2986,2981,2986,2991,2984,2997,2967,2942,2932,2896,2896,2901,2902,2929,3007,,,,,,,,,,,,,,,,,,,,,,,,,,,,,,,,,,,,,
2886,2870,2908,2896,2932,2958,2953,2974,2969,2980,2976,3004,2976,3014,2987,2992,3009,3005,3000,2994,2984,2988,2989,2988,3002,2973,2951,2935,2899,2900,2910,2911,2935,3015,,,,,,,,,,,,,,,,,,,,,,,,,,,,,,,,,,,,,
3030,3013,3050,3039,3075,3103,3096,3124,3120,3125,3123,3155,3125,3159,3131,3139,3155,3150,3148,3140,3130,3134,3139,3138,3152,3122,3095,3078,3042,3044,3052,3056,3078,3160,,,,,,,,,,,,,,,,,,,,,,,,,,,,,,,,,,,,,
3085,3068,3103,3089,3124,3157,3149,3178,3169,3179,3176,3209,3174,3215,3180,3195,3212,3206,3198,3195,3183,3186,3191,3190,3202,3173,3148,3134,3095,3098,3103,3106,3129,3215,,,,,,,,,,,,,,,,,,,,,,,,,,,,,,,,,,,,,
3083,3061,3092,3080,3120,3152,3146,3171,3165,3178,3169,3203,3165,3207,3177,3190,3201,3194,3188,3183,3176,3179,3182,3183,3193,3166,3138,3122,3086,3089,3091,3094,3120,3208,,,,,,,,,,,,,,,,,,,,,,,,,,,,,,,,,,,,,
3065,3048,3080,3063,3102,3129,3125,3152,3145,3153,3145,3178,3145,3189,3153,3164,3178,3169,3161,3157,3152,3157,3158,3157,3171,3139,3110,3098,3061,3061,3066,3068,3093,3188,,,,,,,,,,,,,,,,,,,,,,,,,,,,,,,,,,,,,
2979,2960,2987,2974,3009,3034,3032,3051,3050,3056,3051,3080,3050,3090,3053,3066,3078,3071,3064,3058,3053,3056,3058,3057,3068,3040,3012,2999,2964,2962,2970,2969,2993,3085,,,,,,,,,,,,,,,,,,,,,,,,,,,,,,,,,,,,,
3076,3054,3084,3071,3107,3132,3130,3150,3145,3154,3146,3174,3143,3185,3150,3160,3174,3164,3156,3152,3145,3148,3149,3150,3163,3136,3106,3091,3055,3053,3060,3060,3085,3183,,,,,,,,,,,,,,,,,,,,,,,,,,,,,,,,,,,,,
3112,3094,3122,3108,3140,3165,3165,3184,3178,3183,3179,3204,3176,3214,3178,3192,3205,3196,3186,3178,3170,3172,3172,3175,3188,3162,3133,3118,3081,3078,3084,3085,3109,3210,,,,,,,,,,,,,,,,,,,,,,,,,,,,,,,,,,,,,
3095,3073,3102,3085,3117,3144,3139,3157,3151,3153,3148,3176,3143,3177,3146,3160,3166,3152,3154,3146,3134,3138,3141,3139,3155,3128,3102,3083,3045,3044,3049,3050,3071,3170,,,,,,,,,,,,,,,,,,,,,,,,,,,,,,,,,,,,,
3084,3059,3088,3071,3099,3122,3119,3134,3128,3130,3125,3152,3118,3150,3120,3132,3141,3125,3125,3121,3104,3109,3111,3112,3126,3099,3070,3056,3018,3016,3021,3021,3045,3141,,,,,,,,,,,,,,,,,,,,,,,,,,,,,,,,,,,,,
3027,3006,3032,3014,3042,3064,3057,3071,3063,3067,3060,3084,3051,3080,3048,3063,3064,3054,3045,3038,3034,3031,3037,3040,3054,3025,2989,2983,2946,2939,2947,2950,2972,3070,,,,,,,,,,,,,,,,,,,,,,,,,,,,,,,,,,,,,
3028,3005,3029,3009,3038,3061,3047,3060,3052,3053,3042,3066,3032,3063,3030,3042,3042,3034,3026,3014,3012,3013,3016,3014,3031,3002,2969,2956,2922,2926,2927,2928,2950,3049,,,,,,,,,,,,,,,,,,,,,,,,,,,,,,,,,,,,,
2978,2955,2976,2952,2977,2995,2987,2996,2986,2987,2978,2997,2966,2991,2962,2973,2973,2961,2962,2942,2938,2940,2943,2941,2956,2929,2902,2887,2851,2846,2852,2857,2878,2970,,,,,,,,,,,,,,,,,,,,,,,,,,,,,,,,,,,,,
3050,3022,3040,3014,3038,3052,3044,3054,3045,3045,3031,3049,3017,3043,3013,3015,3022,3010,3002,2993,2986,2988,2992,2991,3001,2978,2943,2935,2896,2885,2896,2898,2922,3017,,,,,,,,,,,,,,,,,,,,,,,,,,,,,,,,,,,,,
2969,2934,2951,2927,2944,2957,2950,2953,2944,2941,2929,2944,2910,2935,2906,2907,2915,2903,2894,2887,2880,2878,2887,2884,2890,2870,2834,2823,2788,2775,2789,2791,2816,2906,,,,,,,,,,,,,,,,,,,,,,,,,,,,,,,,,,,,,
2908,2865,2875,2852,2864,2878,2868,2873,2861,2855,2840,2856,2823,2842,2812,2818,2824,2810,2801,2795,2793,2786,2784,2785,2796,2772,2743,2725,2690,2685,2692,2700,2724,2819,,,,,,,,,,,,,,,,,,,,,,,,,,,,,,,,,,,,,
3018,2964,2967,2940,2952,2962,2948,2953,2939,2933,2915,2928,2895,2916,2882,2889,2896,2880,2872,2861,2856,2852,2852,2856,2863,2847,2811,2790,2760,2747,2758,2764,2790,2895,,,,,,,,,,,,,,,,,,,,,,,,,,,,,,,,,,,,,
2997,2925,2924,2891,2898,2904,2889,2889,2875,2866,2851,2861,2826,2847,2819,2819,2827,2811,2799,2792,2787,2781,2777,2786,2791,2771,2737,2719,2692,2678,2687,2694,2722,2830,,,,,,,,,,,,,,,,,,,,,,,,,,,,,,,,,,,,,
3037,3005,2980,2940,2938,2938,2920,2916,2900,2891,2875,2885,2851,2870,2836,2838,2847,2824,2812,2809,2795,2795,2795,2795,2805,2786,2751,2732,2701,2697,2706,2717,2746,2798,,,,,,,,,,,,,,,,,,,,,,,,,,,,,,,,,,,,,
#,raw_min,,,,,,,,,,,,,,,,,,,,,,,,,,,,,,,,,,,,,,,,,,,,,,,,,,,,,,,,,,,,,,,,,,,,,
1732,1724,1710,1684,1689,1680,1670,1667,1659,1655,1645,1648,1629,1636,1621,1622,1625,1615,1613,1607,1602,1603,1602,1601,1614,1180,1609,1620,1546,1543,1549,1556,1572,1580,,,,,,,,,,,,,,,,,,,,,,,,,,,,,,,,,,,,,
1724,1681,1675,1654,1656,1664,1650,1651,1641,1640,1632,1636,1617,1627,1608,1612,1615,1607,1603,1596,1591,1592,1593,1591,1609,1830,1577,1560,1536,1534,1539,1544,1558,1616,,,,,,,,,,,,,,,,,,,,,,,,,,,,,,,,,,,,,
1725,1690,1690,1673,1677,1682,1679,1673,1666,1664,1658,1662,1644,1657,1639,1640,1645,1639,1633,1629,1621,1622,1621,1620,1628,1614,1594,1584,1565,1564,1570,1572,1584,1642,,,,,,,,,,,,,,,,,,,,,,,,,,,,,,,,,,,,,
1700,1670,1676,1660,1667,1673,1666,1674,1662,1659,1651,1660,1641,1655,1638,1640,1644,1638,1634,1630,1622,1623,1623,1622,1628,1609,1593,1584,1565,1564,1569,1573,1583,1638,,,,,,,,,,,,,,,,,,,,,,,,,,,,,,,,,,,,,
1666,1641,1649,1634,1643,1650,1643,1648,1650,1640,1634,1644,1625,1638,1622,1623,1630,1621,1618,1613,1607,1607,1607,1607,1613,1596,1580,1570,1550,1549,1555,1558,1569,1625,,,,,,,,,,,,,,,,,,,,,,,,,,,,,,,,,,,,,
1733,1711,1721,1708,1720,1728,1720,1726,1720,1725,1717,1725,1707,1722,1707,1705,1713,1707,1701,1697,1693,1691,1692,1690,1698,1680,1664,1654,1634,1632,1638,1640,1650,1709,,,,,,,,,,,,,,,,,,,,,,,,,,,,,,,,,,,,,
1724,1706,1715,1702,1717,1724,1716,1726,1721,1720,1722,1728,1709,1725,1707,1709,1718,1707,1705,1702,1695,1695,1696,1693,1701,1684,1668,1656,1639,1638,1644,1644,1656,1712,,,,,,,,,,,,,,,,,,,,,,,,,,,,,,,,,,,,,
1737,1722,1735,1722,1736,1743,1738,1746,1744,1739,1737,1756,1734,1749,1733,1737,1743,1734,1730,1727,1720,1721,1720,1720,1730,1710,1695,1685,1663,1664,1668,1670,1687,1735,,,,,,,,,,,,,,,,,,,,,,,,,,,,,,,,,,,,,
1719,1702,1717,1706,1721,1730,1729,1738,1732,1728,1725,1738,1725,1741,1722,1726,1731,1724,1718,1711,1709,1710,1706,1709,1719,1702,1687,1678,1658,1657,1660,1664,1677,1729,,,,,,,,,,,,,,,,,,,,,,,,,,,,,,,,,,,,,
1681,1667,1681,1673,1688,1697,1696,1706,1701,1702,1700,1712,1693,1717,1698,1699,1705,1698,1695,1686,1681,1681,1682,1686,1694,1678,1663,1654,1634,1633,1637,1636,1654,1697,,,,,,,,,,,,,,,,,,,,,,,,,,,,,,,,,,,,,
1727,1717,1732,1722,1739,1749,1746,1755,1752,1755,1754,1765,1747,1767,1756,1759,1763,1754,1748,1740,1735,1737,1737,1743,1750,1732,1718,1710,1688,1687,1697,1694,1710,1753,,,,,,,,,,,,,,,,,,,,,,,,,,,,,,,,,,,,,
1761,1751,1766,1757,1776,1789,1784,1797,1791,1795,1792,1807,1787,1809,1792,1802,1809,1799,1792,1783,1774,1781,1783,1786,1793,1775,1761,1752,1730,1728,1731,1737,1755,1794,,,,,,,,,,,,,,,,,,,,,,,,,,,,,,,,,,,,,
1765,1755,1772,1764,1784,1797,1794,1805,1800,1802,1800,1816,1797,1820,1803,1810,1819,1813,1804,1799,1795,1798,1803,1802,1809,1790,1772,1767,1745,1741,1748,1752,1766,1814,,,,,,,,,,,,,,,,,,,,,,,,,,,,,,,,,,,,,
1732,1720,1738,1732,1749,1765,1763,1770,1772,1772,1768,1788,1769,1791,1776,1778,1784,1782,1778,1771,1766,1771,1771,1768,1776,1760,1741,1735,1716,1714,1720,1725,1736,1783,,,,,,,,,,,,,,,,,,,,,,,,,,,,,,,,,,,,,
1746,1738,1757,1748,1769,1784,1782,1793,1790,1792,1793,1805,1789,1812,1795,1798,1805,1800,1802,1797,1789,1790,1793,1793,1799,1783,1764,1756,1737,1739,1741,1743,1758,1803,,,,,,,,,,,,,,,,,,,,,,,,,,,,,,,,,,,,,
1724,1716,1736,1729,1749,1763,1760,1769,1767,1771,1769,1783,1768,1792,1774,1780,1786,1782,1778,1776,1776,1775,1775,1778,1780,1763,1746,1740,1720,1718,1726,1726,1740,1789,,,,,,,,,,,,,,,,,,,,,,,,,,,,,,,,,,,,,
1755,1746,1767,1760,1781,1795,1795,1805,1801,1804,1804,1819,1803,1826,1809,1815,1823,1818,1814,1810,1808,1814,1810,1809,1817,1799,1782,1776,1754,1753,1757,1759,1774,1822,,,,,,,,,,,,,,,,,,,,,,,,,,,,,,,,,,,,,
1660,1652,1674,1668,1687,1701,1699,1710,1706,1710,1709,1725,1709,1732,1713,1720,1729,1723,1721,1716,1713,1716,1719,1715,1723,1706,1691,1685,1665,1665,1668,1668,1683,1729,,,,,,,,,,,,,,,,,,,,,,,,,,,,,,,,,,,,,
1659,1650,1671,1665,1685,1701,1697,1710,1706,1713,1711,1727,1710,1733,1717,1720,1729,1728,1724,1721,1715,1718,1718,1718,1725,1709,1697,1687,1667,1667,1673,1674,1687,1733,,,,,,,,,,,,,,,,,,,,,,,,,,,,,,,,,,,,,
1742,1732,1753,1747,1768,1784,1779,1795,1793,1797,1795,1813,1796,1816,1799,1804,1813,1810,1810,1805,1799,1801,1804,1803,1812,1795,1779,1769,1749,1749,1755,1757,1769,1817,,,,,,,,,,,,,,,,,,,,,,,,,,,,,,,,,,,,,
1773,1764,1783,1775,1796,1814,1810,1827,1822,1828,1826,1845,1824,1848,1828,1837,1847,1843,1839,1837,1830,1832,1834,1834,1841,1824,1810,1801,1779,1780,1784,1786,1799,1848,,,,,,,,,,,,,,,,,,,,,,,,,,,,,,,,,,,,,
1772,1759,1778,1770,1793,1812,1809,1823,1820,1826,1821,1841,1820,1844,1826,1834,1840,1836,1832,1830,1825,1828,1829,1829,1836,1820,1803,1795,1774,1776,1777,1778,1794,1844,,,,,,,,,,,,,,,,,,,,,,,,,,,,,,,,,,,,,
1761,1752,1770,1760,1783,1799,1797,1812,1807,1812,1807,1826,1808,1833,1813,1818,1826,1822,1817,1814,1812,1814,1815,1815,1823,1805,1788,1781,1760,1759,1763,1763,1778,1832,,,,,,,,,,,,,,,,,,,,,,,,,,,,,,,,,,,,,
1712,1701,1717,1709,1729,1744,1743,1754,1753,1756,1753,1770,1753,1776,1755,1762,1769,1766,1761,1758,1755,1757,1758,1757,1763,1747,1732,1724,1704,1702,1707,1706,1720,1773,,,,,,,,,,,,,,,,,,,,,,,,,,,,,,,,,,,,,
1768,1756,1772,1766,1786,1800,1799,1811,1807,1813,1808,1824,1807,1830,1810,1816,1825,1819,1814,1811,1808,1809,1810,1810,1818,1803,1785,1776,1756,1755,1759,1759,1774,1830,,,,,,,,,,,,,,,,,,,,,,,,,,,,,,,,,,,,,
1789,1779,1795,1786,1805,1820,1820,1830,1827,1829,1828,1841,1825,1848,1827,1835,1842,1837,1832,1827,1822,1824,1824,1825,1833,1817,1801,1792,1771,1769,1772,1774,1787,1845,,,,,,,,,,,,,,,,,,,,,,,,,,,,,,,,,,,,,
1779,1766,1783,1773,1792,1807,1805,1815,1811,1813,1810,1825,1806,1826,1809,1817,1820,1812,1813,1809,1801,1804,1806,1805,1813,1798,1783,1772,1750,1749,1753,1753,1766,1822,,,,,,,,,,,,,,,,,,,,,,,,,,,,,,,,,,,,,
1772,1758,1775,1766,1782,1795,1793,1802,1798,1799,1796,1811,1792,1810,1794,1801,1806,1797,1797,1794,1784,1787,1788,1789,1797,1781,1765,1756,1734,1734,1736,1737,1750,1805,,,,,,,,,,,,,,,,,,,,,,,,,,,,,,,,,,,,,
1740,1728,1743,1733,1748,1761,1757,1765,1761,1763,1759,1772,1753,1771,1752,1761,1761,1756,1751,1746,1744,1742,1746,1747,1755,1738,1718,1715,1693,1689,1694,1696,1708,1765,,,,,,,,,,,,,,,,,,,,,,,,,,,,,,,,,,,,,
1740,1728,1741,1730,1746,1760,1752,1759,1754,1755,1748,1763,1743,1760,1742,1749,1749,1744,1740,1732,1731,1732,1733,1733,1743,1725,1707,1699,1679,1682,1682,1683,1696,1752,,,,,,,,,,,,,,,,,,,,,,,,,,,,,,,,,,,,,
1711,1698,1710,1697,1711,1722,1717,1722,1717,1717,1711,1722,1705,1719,1702,1709,1709,1702,1703,1691,1689,1690,1691,1691,1699,1683,1668,1660,1639,1636,1640,1642,1655,1707,,,,,,,,,,,,,,,,,,,,,,,,,,,,,,,,,,,,,
1753,1737,1747,1732,1746,1755,1749,1755,1751,1750,1743,1753,1734,1749,1732,1733,1737,1730,1725,1720,1716,1717,1720,1719,1725,1712,1691,1687,1664,1658,1664,1665,1680,1734,,,,,,,,,,,,,,,,,,,,,,,,,,,,,,,,,,,,,
1707,1686,1697,1682,1693,1699,1695,1698,1692,1691,1683,1693,1673,1687,1671,1671,1676,1668,1664,1660,1655,1655,1660,1658,1661,1650,1629,1622,1603,1595,1603,1604,1619,1671,,,,,,,,,,,,,,,,,,,,,,,,,,,,,,,,,,,,,
1672,1647,1652,1640,1646,1654,1649,1651,1645,1641,1633,1641,1623,1634,1616,1620,1624,1615,1610,1606,1605,1601,1600,1601,1607,1594,1576,1567,1546,1544,1548,1552,1566,1621,,,,,,,,,,,,,,,,,,,,,,,,,,,,,,,,,,,,,
1734,1703,1705,1690,1697,1703,1695,1697,1689,1686,1676,1683,1664,1676,1657,1661,1665,1656,1651,1645,1641,1640,1640,1642,1645,1637,1615,1603,1586,1579,1586,1588,1603,1664,,,,,,,,,,,,,,,,,,,,,,,,,,,,,,,,,,,,,
1723,1681,1680,1662,1665,1669,1660,1661,1653,1648,1638,1644,1624,1637,1620,1621,1625,1615,1609,1605,1602,1599,1597,1601,1605,1593,1574,1563,1547,1539,1545,1549,1564,1627,,,,,,,,,,,,,,,,,,,,,,,,,,,,,,,,,,,,,
1746,1728,1713,1690,1688,1689,1678,1676,1667,1661,1653,1659,1638,1649,1630,1632,1636,1624,1616,1614,1607,1607,1606,1606,1612,1602,1582,1570,1553,1550,1556,1562,1579,1608,,,,,,,,,,,,,,,,,,,,,,,,,,,,,,,,,,,,,
#,raw_row_delta_max,,,,,,,,,,,,,,,,,,,,,,,,,,,,,,,,,,,,,,,,,,,,,,,,,,,,,,,,,,,,,,,,,,,,,
1200,800,800,800,800,800,800,800,800,800,800,800,800,800,800,800,800,800,800,800,800,800,800,800,1500,1500,1500,800,800,800,800,800,800,1200,,,,,,,,,,,,,,,,,,,,,,,,,,,,,,,,,,,,,
800,800,800,800,800,800,800,800,800,800,800,800,800,800,800,800,800,800,800,800,800,800,800,800,1500,1500,1500,800,800,800,800,800,800,800,,,,,,,,,,,,,,,,,,,,,,,,,,,,,,,,,,,,,
800,800,800,800,800,800,800,800,800,800,800,800,800,800,800,800,800,800,800,800,800,800,800,800,800,800,800,800,800,800,800,800,800,800,,,,,,,,,,,,,,,,,,,,,,,,,,,,,,,,,,,,,
800,800,800,800,800,800,800,800,800,800,800,800,800,800,800,800,800,800,800,800,800,800,800,800,800,800,800,800,800,800,800,800,800,800,,,,,,,,,,,,,,,,,,,,,,,,,,,,,,,,,,,,,
800,800,800,800,800,800,800,800,800,800,800,800,800,800,800,800,800,800,800,800,800,800,800,800,800,800,800,800,800,800,800,800,800,800,,,,,,,,,,,,,,,,,,,,,,,,,,,,,,,,,,,,,
800,800,800,800,800,800,800,800,800,800,800,800,800,800,800,800,800,800,800,800,800,800,800,800,800,800,800,800,800,800,800,800,800,800,,,,,,,,,,,,,,,,,,,,,,,,,,,,,,,,,,,,,
800,800,800,800,800,800,800,800,800,800,800,800,800,800,800,800,800,800,800,800,800,800,800,800,800,800,800,800,800,800,800,800,800,800,,,,,,,,,,,,,,,,,,,,,,,,,,,,,,,,,,,,,
800,800,800,800,800,800,800,800,800,800,800,800,800,800,800,800,800,800,800,800,800,800,800,800,800,800,800,800,800,800,800,800,800,800,,,,,,,,,,,,,,,,,,,,,,,,,,,,,,,,,,,,,
800,800,800,800,800,800,800,800,800,800,800,800,800,800,800,800,800,800,800,800,800,800,800,800,800,800,800,800,800,800,800,800,800,800,,,,,,,,,,,,,,,,,,,,,,,,,,,,,,,,,,,,,
800,800,800,800,800,800,800,800,800,800,800,800,800,800,800,800,800,800,800,800,800,800,800,800,800,800,800,800,800,800,800,800,800,800,,,,,,,,,,,,,,,,,,,,,,,,,,,,,,,,,,,,,
800,800,800,800,800,800,800,800,800,800,800,800,800,800,800,800,800,800,800,800,800,800,800,800,800,800,800,800,800,800,800,800,800,800,,,,,,,,,,,,,,,,,,,,,,,,,,,,,,,,,,,,,
800,800,800,800,800,800,800,800,800,800,800,800,800,800,800,800,800,800,800,800,800,800,800,800,800,800,800,800,800,800,800,800,800,800,,,,,,,,,,,,,,,,,,,,,,,,,,,,,,,,,,,,,
800,800,800,800,800,800,800,800,800,800,800,800,800,800,800,800,800,800,800,800,800,800,800,800,800,800,800,800,800,800,800,800,800,800,,,,,,,,,,,,,,,,,,,,,,,,,,,,,,,,,,,,,
800,800,800,800,800,800,800,800,800,800,800,800,800,800,800,800,800,800,800,800,800,800,800,800,800,800,800,800,800,800,800,800,800,800,,,,,,,,,,,,,,,,,,,,,,,,,,,,,,,,,,,,,
800,800,800,800,800,800,800,800,800,800,800,800,800,800,800,800,800,800,800,800,800,800,800,800,800,800,800,800,800,800,800,800,800,800,,,,,,,,,,,,,,,,,,,,,,,,,,,,,,,,,,,,,
800,800,800,800,800,800,800,800,800,800,800,800,800,800,800,800,800,800,800,800,800,800,800,800,800,800,800,800,800,800,800,800,800,800,,,,,,,,,,,,,,,,,,,,,,,,,,,,,,,,,,,,,
800,800,800,800,800,800,800,800,800,800,800,800,800,800,800,800,800,800,800,800,800,800,800,800,800,800,800,800,800,800,800,800,800,800,,,,,,,,,,,,,,,,,,,,,,,,,,,,,,,,,,,,,
800,800,800,800,800,800,800,800,800,800,800,800,800,800,800,800,800,800,800,800,800,800,800,800,800,800,800,800,800,800,800,800,800,800,,,,,,,,,,,,,,,,,,,,,,,,,,,,,,,,,,,,,
800,800,800,800,800,800,800,800,800,800,800,800,800,800,800,800,800,800,800,800,800,800,800,800,800,800,800,800,800,800,800,800,800,800,,,,,,,,,,,,,,,,,,,,,,,,,,,,,,,,,,,,,
800,800,800,800,800,800,800,800,800,800,800,800,800,800,800,800,800,800,800,800,800,800,800,800,800,800,800,800,800,800,800,800,800,800,,,,,,,,,,,,,,,,,,,,,,,,,,,,,,,,,,,,,
800,800,800,800,800,800,800,800,800,800,800,800,800,800,800,800,800,800,800,800,800,800,800,800,800,800,800,800,800,800,800,800,800,800,,,,,,,,,,,,,,,,,,,,,,,,,,,,,,,,,,,,,
800,800,800,800,800,800,800,800,800,800,800,800,800,800,800,800,800,800,800,800,800,800,800,800,800,800,800,800,800,800,800,800,800,800,,,,,,,,,,,,,,,,,,,,,,,,,,,,,,,,,,,,,
800,800,800,800,800,800,800,800,800,800,800,800,800,800,800,800,800,800,800,800,800,800,800,800,800,800,800,800,800,800,800,800,800,800,,,,,,,,,,,,,,,,,,,,,,,,,,,,,,,,,,,,,
800,800,800,800,800,800,800,800,800,800,800,800,800,800,800,800,800,800,800,800,800,800,800,800,800,800,800,800,800,800,800,800,800,800,,,,,,,,,,,,,,,,,,,,,,,,,,,,,,,,,,,,,
800,800,800,800,800,800,800,800,800,800,800,800,800,800,800,800,800,800,800,800,800,800,800,800,800,800,800,800,800,800,800,800,800,800,,,,,,,,,,,,,,,,,,,,,,,,,,,,,,,,,,,,,
800,800,800,800,800,800,800,800,800,800,800,800,800,800,800,800,800,800,800,800,800,800,800,800,800,800,800,800,800,800,800,800,800,800,,,,,,,,,,,,,,,,,,,,,,,,,,,,,,,,,,,,,
800,800,800,800,800,800,800,800,800,800,800,800,800,800,800,800,800,800,800,800,800,800,800,800,800,800,800,800,800,800,800,800,800,800,,,,,,,,,,,,,,,,,,,,,,,,,,,,,,,,,,,,,
800,800,800,800,800,800,800,800,800,800,800,800,800,800,800,800,800,800,800,800,800,800,800,800,800,800,800,800,800,800,800,800,800,800,,,,,,,,,,,,,,,,,,,,,,,,,,,,,,,,,,,,,
800,800,800,800,800,800,800,800,800,800,800,800,800,800,800,800,800,800,800,800,800,800,800,800,800,800,800,800,800,800,800,800,800,800,,,,,,,,,,,,,,,,,,,,,,,,,,,,,,,,,,,,,
800,800,800,800,800,800,800,800,800,800,800,800,800,800,800,800,800,800,800,800,800,800,800,800,800,800,800,800,800,800,800,800,800,800,,,,,,,,,,,,,,,,,,,,,,,,,,,,,,,,,,,,,
800,800,800,800,800,800,800,800,800,800,800,800,800,800,800,800,800,800,800,800,800,800,800,800,800,800,800,800,800,800,800,800,800,800,,,,,,,,,,,,,,,,,,,,,,,,,,,,,,,,,,,,,
800,800,800,800,800,800,800,800,800,800,800,800,800,800,800,800,800,800,800,800,800,800,800,800,800,800,800,800,800,800,800,800,800,800,,,,,,,,,,,,,,,,,,,,,,,,,,,,,,,,,,,,,
800,800,800,800,800,800,800,800,800,800,800,800,800,800,800,800,800,800,800,800,800,800,800,800,800,800,800,800,800,800,800,800,800,800,,,,,,,,,,,,,,,,,,,,,,,,,,,,,,,,,,,,,
800,800,800,800,800,800,800,800,800,800,800,800,800,800,800,800,800,800,800,800,800,800,800,800,800,800,800,800,800,800,800,800,800,800,,,,,,,,,,,,,,,,,,,,,,,,,,,,,,,,,,,,,
800,800,800,800,800,800,800,800,800,800,800,800,800,800,800,800,800,800,800,800,800,800,800,800,800,800,800,800,800,800,800,800,800,800,,,,,,,,,,,,,,,,,,,,,,,,,,,,,,,,,,,,,
1200,800,800,800,800,800,800,800,800,800,800,800,800,800,800,800,800,800,800,800,800,800,800,800,800,800,800,800,800,800,800,800,800,1200,,,,,,,,,,,,,,,,,,,,,,,,,,,,,,,,,,,,,
#,raw_row_delta_min,,,,,,,,,,,,,,,,,,,,,,,,,,,,,,,,,,,,,,,,,,,,,,,,,,,,,,,,,,,,,,,,,,,,,
-1200,-800,-800,-800,-800,-800,-800,-800,-800,-800,-800,-800,-800,-800,-800,-800,-800,-800,-800,-800,-800,-800,-800,-800,-1500,-1500,-1500,-800,-800,-800,-800,-800,-800,-1200,,,,,,,,,,,,,,,,,,,,,,,,,,,,,,,,,,,,,
-800,-800,-800,-800,-800,-800,-800,-800,-800,-800,-800,-800,-800,-800,-800,-800,-800,-800,-800,-800,-800,-800,-800,-800,-1500,-1500,-1500,-800,-800,-800,-800,-800,-800,-800,,,,,,,,,,,,,,,,,,,,,,,,,,,,,,,,,,,,,
-800,-800,-800,-800,-800,-800,-800,-800,-800,-800,-800,-800,-800,-800,-800,-800,-800,-800,-800,-800,-800,-800,-800,-800,-800,-800,-800,-800,-800,-800,-800,-800,-800,-800,,,,,,,,,,,,,,,,,,,,,,,,,,,,,,,,,,,,,
-800,-800,-800,-800,-800,-800,-800,-800,-800,-800,-800,-800,-800,-800,-800,-800,-800,-800,-800,-800,-800,-800,-800,-800,-800,-800,-800,-800,-800,-800,-800,-800,-800,-800,,,,,,,,,,,,,,,,,,,,,,,,,,,,,,,,,,,,,
-800,-800,-800,-800,-800,-800,-800,-800,-800,-800,-800,-800,-800,-800,-800,-800,-800,-800,-800,-800,-800,-800,-800,-800,-800,-800,-800,-800,-800,-800,-800,-800,-800,-800,,,,,,,,,,,,,,,,,,,,,,,,,,,,,,,,,,,,,
-800,-800,-800,-800,-800,-800,-800,-800,-800,-800,-800,-800,-800,-800,-800,-800,-800,-800,-800,-800,-800,-800,-800,-800,-800,-800,-800,-800,-800,-800,-800,-800,-800,-800,,,,,,,,,,,,,,,,,,,,,,,,,,,,,,,,,,,,,
-800,-800,-800,-800,-800,-800,-800,-800,-800,-800,-800,-800,-800,-800,-800,-800,-800,-800,-800,-800,-800,-800,-800,-800,-800,-800,-800,-800,-800,-800,-800,-800,-800,-800,,,,,,,,,,,,,,,,,,,,,,,,,,,,,,,,,,,,,
-800,-800,-800,-800,-800,-800,-800,-800,-800,-800,-800,-800,-800,-800,-800,-800,-800,-800,-800,-800,-800,-800,-800,-800,-800,-800,-800,-800,-800,-800,-800,-800,-800,-800,,,,,,,,,,,,,,,,,,,,,,,,,,,,,,,,,,,,,
-800,-800,-800,-800,-800,-800,-800,-800,-800,-800,-800,-800,-800,-800,-800,-800,-800,-800,-800,-800,-800,-800,-800,-800,-800,-800,-800,-800,-800,-800,-800,-800,-800,-800,,,,,,,,,,,,,,,,,,,,,,,,,,,,,,,,,,,,,
-800,-800,-800,-800,-800,-800,-800,-800,-800,-800,-800,-800,-800,-800,-800,-800,-800,-800,-800,-800,-800,-800,-800,-800,-800,-800,-800,-800,-800,-800,-800,-800,-800,-800,,,,,,,,,,,,,,,,,,,,,,,,,,,,,,,,,,,,,
-800,-800,-800,-800,-800,-800,-800,-800,-800,-800,-800,-800,-800,-800,-800,-800,-800,-800,-800,-800,-800,-800,-800,-800,-800,-800,-800,-800,-800,-800,-800,-800,-800,-800,,,,,,,,,,,,,,,,,,,,,,,,,,,,,,,,,,,,,
-800,-800,-800,-800,-800,-800,-800,-800,-800,-800,-800,-800,-800,-800,-800,-800,-800,-800,-800,-800,-800,-800,-800,-800,-800,-800,-800,-800,-800,-800,-800,-800,-800,-800,,,,,,,,,,,,,,,,,,,,,,,,,,,,,,,,,,,,,
-800,-800,-800,-800,-800,-800,-800,-800,-800,-800,-800,-800,-800,-800,-800,-800,-800,-800,-800,-800,-800,-800,-800,-800,-800,-800,-800,-800,-800,-800,-800,-800,-800,-800,,,,,,,,,,,,,,,,,,,,,,,,,,,,,,,,,,,,,
-800,-800,-800,-800,-800,-800,-800,-800,-800,-800,-800,-800,-800,-800,-800,-800,-800,-800,-800,-800,-800,-800,-800,-800,-800,-800,-800,-800,-800,-800,-800,-800,-800,-800,,,,,,,,,,,,,,,,,,,,,,,,,,,,,,,,,,,,,
-800,-800,-800,-800,-800,-800,-800,-800,-800,-800,-800,-800,-800,-800,-800,-800,-800,-800,-800,-800,-800,-800,-800,-800,-800,-800,-800,-800,-800,-800,-800,-800,-800,-800,,,,,,,,,,,,,,,,,,,,,,,,,,,,,,,,,,,,,
-800,-800,-800,-800,-800,-800,-800,-800,-800,-800,-800,-800,-800,-800,-800,-800,-800,-800,-800,-800,-800,-800,-800,-800,-800,-800,-800,-800,-800,-800,-800,-800,-800,-800,,,,,,,,,,,,,,,,,,,,,,,,,,,,,,,,,,,,,
-800,-800,-800,-800,-800,-800,-800,-800,-800,-800,-800,-800,-800,-800,-800,-800,-800,-800,-800,-800,-800,-800,-800,-800,-800,-800,-800,-800,-800,-800,-800,-800,-800,-800,,,,,,,,,,,,,,,,,,,,,,,,,,,,,,,,,,,,,
-800,-800,-800,-800,-800,-800,-800,-800,-800,-800,-800,-800,-800,-800,-800,-800,-800,-800,-800,-800,-800,-800,-800,-800,-800,-800,-800,-800,-800,-800,-800,-800,-800,-800,,,,,,,,,,,,,,,,,,,,,,,,,,,,,,,,,,,,,
-800,-800,-800,-800,-800,-800,-800,-800,-800,-800,-800,-800,-800,-800,-800,-800,-800,-800,-800,-800,-800,-800,-800,-800,-800,-800,-800,-800,-800,-800,-800,-800,-800,-800,,,,,,,,,,,,,,,,,,,,,,,,,,,,,,,,,,,,,
-800,-800,-800,-800,-800,-800,-800,-800,-800,-800,-800,-800,-800,-800,-800,-800,-800,-800,-800,-800,-800,-800,-800,-800,-800,-800,-800,-800,-800,-800,-800,-800,-800,-800,,,,,,,,,,,,,,,,,,,,,,,,,,,,,,,,,,,,,
-800,-800,-800,-800,-800,-800,-800,-800,-800,-800,-800,-800,-800,-800,-800,-800,-800,-800,-800,-800,-800,-800,-800,-800,-800,-800,-800,-800,-800,-800,-800,-800,-800,-800,,,,,,,,,,,,,,,,,,,,,,,,,,,,,,,,,,,,,
-800,-800,-800,-800,-800,-800,-800,-800,-800,-800,-800,-800,-800,-800,-800,-800,-800,-800,-800,-800,-800,-800,-800,-800,-800,-800,-800,-800,-800,-800,-800,-800,-800,-800,,,,,,,,,,,,,,,,,,,,,,,,,,,,,,,,,,,,,
-800,-800,-800,-800,-800,-800,-800,-800,-800,-800,-800,-800,-800,-800,-800,-800,-800,-800,-800,-800,-800,-800,-800,-800,-800,-800,-800,-800,-800,-800,-800,-800,-800,-800,,,,,,,,,,,,,,,,,,,,,,,,,,,,,,,,,,,,,
-800,-800,-800,-800,-800,-800,-800,-800,-800,-800,-800,-800,-800,-800,-800,-800,-800,-800,-800,-800,-800,-800,-800,-800,-800,-800,-800,-800,-800,-800,-800,-800,-800,-800,,,,,,,,,,,,,,,,,,,,,,,,,,,,,,,,,,,,,
-800,-800,-800,-800,-800,-800,-800,-800,-800,-800,-800,-800,-800,-800,-800,-800,-800,-800,-800,-800,-800,-800,-800,-800,-800,-800,-800,-800,-800,-800,-800,-800,-800,-800,,,,,,,,,,,,,,,,,,,,,,,,,,,,,,,,,,,,,
-800,-800,-800,-800,-800,-800,-800,-800,-800,-800,-800,-800,-800,-800,-800,-800,-800,-800,-800,-800,-800,-800,-800,-800,-800,-800,-800,-800,-800,-800,-800,-800,-800,-800,,,,,,,,,,,,,,,,,,,,,,,,,,,,,,,,,,,,,
-800,-800,-800,-800,-800,-800,-800,-800,-800,-800,-800,-800,-800,-800,-800,-800,-800,-800,-800,-800,-800,-800,-800,-800,-800,-800,-800,-800,-800,-800,-800,-800,-800,-800,,,,,,,,,,,,,,,,,,,,,,,,,,,,,,,,,,,,,
-800,-800,-800,-800,-800,-800,-800,-800,-800,-800,-800,-800,-800,-800,-800,-800,-800,-800,-800,-800,-800,-800,-800,-800,-800,-800,-800,-800,-800,-800,-800,-800,-800,-800,,,,,,,,,,,,,,,,,,,,,,,,,,,,,,,,,,,,,
-800,-800,-800,-800,-800,-800,-800,-800,-800,-800,-800,-800,-800,-800,-800,-800,-800,-800,-800,-800,-800,-800,-800,-800,-800,-800,-800,-800,-800,-800,-800,-800,-800,-800,,,,,,,,,,,,,,,,,,,,,,,,,,,,,,,,,,,,,
-800,-800,-800,-800,-800,-800,-800,-800,-800,-800,-800,-800,-800,-800,-800,-800,-800,-800,-800,-800,-800,-800,-800,-800,-800,-800,-800,-800,-800,-800,-800,-800,-800,-800,,,,,,,,,,,,,,,,,,,,,,,,,,,,,,,,,,,,,
-800,-800,-800,-800,-800,-800,-800,-800,-800,-800,-800,-800,-800,-800,-800,-800,-800,-800,-800,-800,-800,-800,-800,-800,-800,-800,-800,-800,-800,-800,-800,-800,-800,-800,,,,,,,,,,,,,,,,,,,,,,,,,,,,,,,,,,,,,
-800,-800,-800,-800,-800,-800,-800,-800,-800,-800,-800,-800,-800,-800,-800,-800,-800,-800,-800,-800,-800,-800,-800,-800,-800,-800,-800,-800,-800,-800,-800,-800,-800,-800,,,,,,,,,,,,,,,,,,,,,,,,,,,,,,,,,,,,,
-800,-800,-800,-800,-800,-800,-800,-800,-800,-800,-800,-800,-800,-800,-800,-800,-800,-800,-800,-800,-800,-800,-800,-800,-800,-800,-800,-800,-800,-800,-800,-800,-800,-800,,,,,,,,,,,,,,,,,,,,,,,,,,,,,,,,,,,,,
-800,-800,-800,-800,-800,-800,-800,-800,-800,-800,-800,-800,-800,-800,-800,-800,-800,-800,-800,-800,-800,-800,-800,-800,-800,-800,-800,-800,-800,-800,-800,-800,-800,-800,,,,,,,,,,,,,,,,,,,,,,,,,,,,,,,,,,,,,
-800,-800,-800,-800,-800,-800,-800,-800,-800,-800,-800,-800,-800,-800,-800,-800,-800,-800,-800,-800,-800,-800,-800,-800,-800,-800,-800,-800,-800,-800,-800,-800,-800,-800,,,,,,,,,,,,,,,,,,,,,,,,,,,,,,,,,,,,,
-1200,-800,-800,-800,-800,-800,-800,-800,-800,-800,-800,-800,-800,-800,-800,-800,-800,-800,-800,-800,-800,-800,-800,-800,-800,-800,-800,-800,-800,-800,-800,-800,-800,-1200,,,,,,,,,,,,,,,,,,,,,,,,,,,,,,,,,,,,,
#,raw_col_delta_max,,,,,,,,,,,,,,,,,,,,,,,,,,,,,,,,,,,,,,,,,,,,,,,,,,,,,,,,,,,,,,,,,,,,,
1200,800,800,800,800,800,800,800,800,800,800,800,800,800,800,800,800,800,800,800,800,800,800,800,1500,1500,1500,800,800,800,800,800,1200,,,,,,,,,,,,,,,,,,,,,,,,,,,,,,,,,,,,,,
800,800,800,800,800,800,800,800,800,800,800,800,800,800,800,800,800,800,800,800,800,800,800,800,1500,1500,1500,800,800,800,800,800,800,,,,,,,,,,,,,,,,,,,,,,,,,,,,,,,,,,,,,,
800,800,800,800,800,800,800,800,800,800,800,800,800,800,800,800,800,800,800,800,800,800,800,800,800,800,800,800,800,800,800,800,800,,,,,,,,,,,,,,,,,,,,,,,,,,,,,,,,,,,,,,
800,800,800,800,800,800,800,800,800,800,800,800,800,800,800,800,800,800,800,800,800,800,800,800,800,800,800,800,800,800,800,800,800,,,,,,,,,,,,,,,,,,,,,,,,,,,,,,,,,,,,,,
800,800,800,800,800,800,800,800,800,800,800,800,800,800,800,800,800,800,800,800,800,800,800,800,800,800,800,800,800,800,800,800,800,,,,,,,,,,,,,,,,,,,,,,,,,,,,,,,,,,,,,,
800,800,800,800,800,800,800,800,800,800,800,800,800,800,800,800,800,800,800,800,800,800,800,800,800,800,800,800,800,800,800,800,800,,,,,,,,,,,,,,,,,,,,,,,,,,,,,,,,,,,,,,
800,800,800,800,800,800,800,800,800,800,800,800,800,800,800,800,800,800,800,800,800,800,800,800,800,800,800,800,800,800,800,800,800,,,,,,,,,,,,,,,,,,,,,,,,,,,,,,,,,,,,,,
800,800,800,800,800,800,800,800,800,800,800,800,800,800,800,800,800,800,800,800,800,800,800,800,800,800,800,800,800,800,800,800,800,,,,,,,,,,,,,,,,,,,,,,,,,,,,,,,,,,,,,,
800,800,800,800,800,800,800,800,800,800,800,800,800,800,800,800,800,800,800,800,800,800,800,800,800,800,800,800,800,800,800,800,800,,,,,,,,,,,,,,,,,,,,,,,,,,,,,,,,,,,,,,
800,800,800,800,800,800,800,800,800,800,800,800,800,800,800,800,800,800,800,800,800,800,800,800,800,800,800,800,800,800,800,800,800,,,,,,,,,,,,,,,,,,,,,,,,,,,,,,,,,,,,,,
800,800,800,800,800,800,800,800,800,800,800,800,800,800,800,800,800,800,800,800,800,800,800,800,800,800,800,800,800,800,800,800,800,,,,,,,,,,,,,,,,,,,,,,,,,,,,,,,,,,,,,,
800,800,800,800,800,800,800,800,800,800,800,800,800,800,800,800,800,800,800,800,800,800,800,800,800,800,800,800,800,800,800,800,800,,,,,,,,,,,,,,,,,,,,,,,,,,,,,,,,,,,,,,
800,800,800,800,800,800,800,800,800,800,800,800,800,800,800,800,800,800,800,800,800,800,800,800,800,800,800,800,800,800,800,800,800,,,,,,,,,,,,,,,,,,,,,,,,,,,,,,,,,,,,,,
800,800,800,800,800,800,800,800,800,800,800,800,800,800,800,800,800,800,800,800,800,800,800,800,800,800,800,800,800,800,800,800,800,,,,,,,,,,,,,,,,,,,,,,,,,,,,,,,,,,,,,,
800,800,800,800,800,800,800,800,800,800,800,800,800,800,800,800,800,800,800,800,800,800,800,800,800,800,800,800,800,800,800,800,800,,,,,,,,,,,,,,,,,,,,,,,,,,,,,,,,,,,,,,
800,800,800,800,800,800,800,800,800,800,800,800,800,800,800,800,800,800,800,800,800,800,800,800,800,800,800,800,800,800,800,800,800,,,,,,,,,,,,,,,,,,,,,,,,,,,,,,,,,,,,,,
800,800,800,800,800,800,800,800,800,800,800,800,800,800,800,800,800,800,800,800,800,800,800,800,800,800,800,800,800,800,800,800,800,,,,,,,,,,,,,,,,,,,,,,,,,,,,,,,,,,,,,,
800,800,800,800,800,800,800,800,800,800,800,800,800,800,800,800,800,800,800,800,800,800,800,800,800,800,800,800,800,800,800,800,800,,,,,,,,,,,,,,,,,,,,,,,,,,,,,,,,,,,,,,
800,800,800,800,800,800,800,800,800,800,800,800,800,800,800,800,800,800,800,800,800,800,800,800,800,800,800,800,800,800,800,800,800,,,,,,,,,,,,,,,,,,,,,,,,,,,,,,,,,,,,,,
800,800,800,800,800,800,800,800,800,800,800,800,800,800,800,800,800,800,800,800,800,800,800,800,800,800,800,800,800,800,800,800,800,,,,,,,,,,,,,,,,,,,,,,,,,,,,,,,,,,,,,,
800,800,800,800,800,800,800,800,800,800,800,800,800,800,800,800,800,800,800,800,800,800,800,800,800,800,800,800,800,800,800,800,800,,,,,,,,,,,,,,,,,,,,,,,,,,,,,,,,,,,,,,
800,800,800,800,800,800,800,800,800,800,800,800,800,800,800,800,800,800,800,800,800,800,800,800,800,800,800,800,800,800,800,800,800,,,,,,,,,,,,,,,,,,,,,,,,,,,,,,,,,,,,,,
800,800,800,800,800,800,800,800,800,800,800,800,800,800,800,800,800,800,800,800,800,800,800,800,800,800,800,800,800,800,800,800,800,,,,,,,,,,,,,,,,,,,,,,,,,,,,,,,,,,,,,,
800,800,800,800,800,800,800,800,800,800,800,800,800,800,800,800,800,800,800,800,800,800,800,800,800,800,800,800,800,800,800,800,800,,,,,,,,,,,,,,,,,,,,,,,,,,,,,,,,,,,,,,
800,800,800,800,800,800,800,800,800,800,800,800,800,800,800,800,800,800,800,800,800,800,800,800,800,800,800,800,800,800,800,800,800,,,,,,,,,,,,,,,,,,,,,,,,,,,,,,,,,,,,,,
800,800,800,800,800,800,800,800,800,800,800,800,800,800,800,800,800,800,800,800,800,800,800,800,800,800,800,800,800,800,800,800,800,,,,,,,,,,,,,,,,,,,,,,,,,,,,,,,,,,,,,,
800,800,800,800,800,800,800,800,800,800,800,800,800,800,800,800,800,800,800,800,800,800,800,800,800,800,800,800,800,800,800,800,800,,,,,,,,,,,,,,,,,,,,,,,,,,,,,,,,,,,,,,
800,800,800,800,800,800,800,800,800,800,800,800,800,800,800,800,800,800,800,800,800,800,800,800,800,800,800,800,800,800,800,800,800,,,,,,,,,,,,,,,,,,,,,,,,,,,,,,,,,,,,,,
800,800,800,800,800,800,800,800,800,800,800,800,800,800,800,800,800,800,800,800,800,800,800,800,800,800,800,800,800,800,800,800,800,,,,,,,,,,,,,,,,,,,,,,,,,,,,,,,,,,,,,,
800,800,800,800,800,800,800,800,800,800,800,800,800,800,800,800,800,800,800,800,800,800,800,800,800,800,800,800,800,800,800,800,800,,,,,,,,,,,,,,,,,,,,,,,,,,,,,,,,,,,,,,
800,800,800,800,800,800,800,800,800,800,800,800,800,800,800,800,800,800,800,800,800,800,800,800,800,800,800,800,800,800,800,800,800,,,,,,,,,,,,,,,,,,,,,,,,,,,,,,,,,,,,,,
800,800,800,800,800,800,800,800,800,800,800,800,800,800,800,800,800,800,800,800,800,800,800,800,800,800,800,800,800,800,800,800,800,,,,,,,,,,,,,,,,,,,,,,,,,,,,,,,,,,,,,,
800,800,800,800,800,800,800,800,800,800,800,800,800,800,800,800,800,800,800,800,800,800,800,800,800,800,800,800,800,800,800,800,800,,,,,,,,,,,,,,,,,,,,,,,,,,,,,,,,,,,,,,
800,800,800,800,800,800,800,800,800,800,800,800,800,800,800,800,800,800,800,800,800,800,800,800,800,800,800,800,800,800,800,800,800,,,,,,,,,,,,,,,,,,,,,,,,,,,,,,,,,,,,,,
800,800,800,800,800,800,800,800,800,800,800,800,800,800,800,800,800,800,800,800,800,800,800,800,800,800,800,800,800,800,800,800,800,,,,,,,,,,,,,,,,,,,,,,,,,,,,,,,,,,,,,,
800,800,800,800,800,800,800,800,800,800,800,800,800,800,800,800,800,800,800,800,800,800,800,800,800,800,800,800,800,800,800,800,800,,,,,,,,,,,,,,,,,,,,,,,,,,,,,,,,,,,,,,
1200,800,800,800,800,800,800,800,800,800,800,800,800,800,800,800,800,800,800,800,800,800,800,800,800,800,800,800,800,800,800,800,1200,,,,,,,,,,,,,,,,,,,,,,,,,,,,,,,,,,,,,,
#,raw_col_delta_min,,,,,,,,,,,,,,,,,,,,,,,,,,,,,,,,,,,,,,,,,,,,,,,,,,,,,,,,,,,,,,,,,,,,,
-1200,-800,-800,-800,-800,-800,-800,-800,-800,-800,-800,-800,-800,-800,-800,-800,-800,-800,-800,-800,-800,-800,-800,-800,-1500,-1500,-1500,-800,-800,-800,-800,-800,-1200,,,,,,,,,,,,,,,,,,,,,,,,,,,,,,,,,,,,,,
-800,-800,-800,-800,-800,-800,-800,-800,-800,-800,-800,-800,-800,-800,-800,-800,-800,-800,-800,-800,-800,-800,-800,-800,-1500,-1500,-1500,-800,-800,-800,-800,-800,-800,,,,,,,,,,,,,,,,,,,,,,,,,,,,,,,,,,,,,,
-800,-800,-800,-800,-800,-800,-800,-800,-800,-800,-800,-800,-800,-800,-800,-800,-800,-800,-800,-800,-800,-800,-800,-800,-800,-800,-800,-800,-800,-800,-800,-800,-800,,,,,,,,,,,,,,,,,,,,,,,,,,,,,,,,,,,,,,
-800,-800,-800,-800,-800,-800,-800,-800,-800,-800,-800,-800,-800,-800,-800,-800,-800,-800,-800,-800,-800,-800,-800,-800,-800,-800,-800,-800,-800,-800,-800,-800,-800,,,,,,,,,,,,,,,,,,,,,,,,,,,,,,,,,,,,,,
-800,-800,-800,-800,-800,-800,-800,-800,-800,-800,-800,-800,-800,-800,-800,-800,-800,-800,-800,-800,-800,-800,-800,-800,-800,-800,-800,-800,-800,-800,-800,-800,-800,,,,,,,,,,,,,,,,,,,,,,,,,,,,,,,,,,,,,,
-800,-800,-800,-800,-800,-800,-800,-800,-800,-800,-800,-800,-800,-800,-800,-800,-800,-800,-800,-800,-800,-800,-800,-800,-800,-800,-800,-800,-800,-800,-800,-800,-800,,,,,,,,,,,,,,,,,,,,,,,,,,,,,,,,,,,,,,
-800,-800,-800,-800,-800,-800,-800,-800,-800,-800,-800,-800,-800,-800,-800,-800,-800,-800,-800,-800,-800,-800,-800,-800,-800,-800,-800,-800,-800,-800,-800,-800,-800,,,,,,,,,,,,,,,,,,,,,,,,,,,,,,,,,,,,,,
-800,-800,-800,-800,-800,-800,-800,-800,-800,-800,-800,-800,-800,-800,-800,-800,-800,-800,-800,-800,-800,-800,-800,-800,-800,-800,-800,-800,-800,-800,-800,-800,-800,,,,,,,,,,,,,,,,,,,,,,,,,,,,,,,,,,,,,,
-800,-800,-800,-800,-800,-800,-800,-800,-800,-800,-800,-800,-800,-800,-800,-800,-800,-800,-800,-800,-800,-800,-800,-800,-800,-800,-800,-800,-800,-800,-800,-800,-800,,,,,,,,,,,,,,,,,,,,,,,,,,,,,,,,,,,,,,
-800,-800,-800,-800,-800,-800,-800,-800,-800,-800,-800,-800,-800,-800,-800,-800,-800,-800,-800,-800,-800,-800,-800,-800,-800,-800,-800,-800,-800,-800,-800,-800,-800,,,,,,,,,,,,,,,,,,,,,,,,,,,,,,,,,,,,,,
-800,-800,-800,-800,-800,-800,-800,-800,-800,-800,-800,-800,-800,-800,-800,-800,-800,-800,-800,-800,-800,-800,-800,-800,-800,-800,-800,-800,-800,-800,-800,-800,-800,,,,,,,,,,,,,,,,,,,,,,,,,,,,,,,,,,,,,,
-800,-800,-800,-800,-800,-800,-800,-800,-800,-800,-800,-800,-800,-800,-800,-800,-800,-800,-800,-800,-800,-800,-800,-800,-800,-800,-800,-800,-800,-800,-800,-800,-800,,,,,,,,,,,,,,,,,,,,,,,,,,,,,,,,,,,,,,
-800,-800,-800,-800,-800,-800,-800,-800,-800,-800,-800,-800,-800,-800,-800,-800,-800,-800,-800,-800,-800,-800,-800,-800,-800,-800,-800,-800,-800,-800,-800,-800,-800,,,,,,,,,,,,,,,,,,,,,,,,,,,,,,,,,,,,,,
-800,-800,-800,-800,-800,-800,-800,-800,-800,-800,-800,-800,-800,-800,-800,-800,-800,-800,-800,-800,-800,-800,-800,-800,-800,-800,-800,-800,-800,-800,-800,-800,-800,,,,,,,,,,,,,,,,,,,,,,,,,,,,,,,,,,,,,,
-800,-800,-800,-800,-800,-800,-800,-800,-800,-800,-800,-800,-800,-800,-800,-800,-800,-800,-800,-800,-800,-800,-800,-800,-800,-800,-800,-800,-800,-800,-800,-800,-800,,,,,,,,,,,,,,,,,,,,,,,,,,,,,,,,,,,,,,
-800,-800,-800,-800,-800,-800,-800,-800,-800,-800,-800,-800,-800,-800,-800,-800,-800,-800,-800,-800,-800,-800,-800,-800,-800,-800,-800,-800,-800,-800,-800,-800,-800,,,,,,,,,,,,,,,,,,,,,,,,,,,,,,,,,,,,,,
-800,-800,-800,-800,-800,-800,-800,-800,-800,-800,-800,-800,-800,-800,-800,-800,-800,-800,-800,-800,-800,-800,-800,-800,-800,-800,-800,-800,-800,-800,-800,-800,-800,,,,,,,,,,,,,,,,,,,,,,,,,,,,,,,,,,,,,,
-800,-800,-800,-800,-800,-800,-800,-800,-800,-800,-800,-800,-800,-800,-800,-800,-800,-800,-800,-800,-800,-800,-800,-800,-800,-800,-800,-800,-800,-800,-800,-800,-800,,,,,,,,,,,,,,,,,,,,,,,,,,,,,,,,,,,,,,
-800,-800,-800,-800,-800,-800,-800,-800,-800,-800,-800,-800,-800,-800,-800,-800,-800,-800,-800,-800,-800,-800,-800,-800,-800,-800,-800,-800,-800,-800,-800,-800,-800,,,,,,,,,,,,,,,,,,,,,,,,,,,,,,,,,,,,,,
-800,-800,-800,-800,-800,-800,-800,-800,-800,-800,-800,-800,-800,-800,-800,-800,-800,-800,-800,-800,-800,-800,-800,-800,-800,-800,-800,-800,-800,-800,-800,-800,-800,,,,,,,,,,,,,,,,,,,,,,,,,,,,,,,,,,,,,,
-800,-800,-800,-800,-800,-800,-800,-800,-800,-800,-800,-800,-800,-800,-800,-800,-800,-800,-800,-800,-800,-800,-800,-800,-800,-800,-800,-800,-800,-800,-800,-800,-800,,,,,,,,,,,,,,,,,,,,,,,,,,,,,,,,,,,,,,
-800,-800,-800,-800,-800,-800,-800,-800,-800,-800,-800,-800,-800,-800,-800,-800,-800,-800,-800,-800,-800,-800,-800,-800,-800,-800,-800,-800,-800,-800,-800,-800,-800,,,,,,,,,,,,,,,,,,,,,,,,,,,,,,,,,,,,,,
-800,-800,-800,-800,-800,-800,-800,-800,-800,-800,-800,-800,-800,-800,-800,-800,-800,-800,-800,-800,-800,-800,-800,-800,-800,-800,-800,-800,-800,-800,-800,-800,-800,,,,,,,,,,,,,,,,,,,,,,,,,,,,,,,,,,,,,,
-800,-800,-800,-800,-800,-800,-800,-800,-800,-800,-800,-800,-800,-800,-800,-800,-800,-800,-800,-800,-800,-800,-800,-800,-800,-800,-800,-800,-800,-800,-800,-800,-800,,,,,,,,,,,,,,,,,,,,,,,,,,,,,,,,,,,,,,
-800,-800,-800,-800,-800,-800,-800,-800,-800,-800,-800,-800,-800,-800,-800,-800,-800,-800,-800,-800,-800,-800,-800,-800,-800,-800,-800,-800,-800,-800,-800,-800,-800,,,,,,,,,,,,,,,,,,,,,,,,,,,,,,,,,,,,,,
-800,-800,-800,-800,-800,-800,-800,-800,-800,-800,-800,-800,-800,-800,-800,-800,-800,-800,-800,-800,-800,-800,-800,-800,-800,-800,-800,-800,-800,-800,-800,-800,-800,,,,,,,,,,,,,,,,,,,,,,,,,,,,,,,,,,,,,,
-800,-800,-800,-800,-800,-800,-800,-800,-800,-800,-800,-800,-800,-800,-800,-800,-800,-800,-800,-800,-800,-800,-800,-800,-800,-800,-800,-800,-800,-800,-800,-800,-800,,,,,,,,,,,,,,,,,,,,,,,,,,,,,,,,,,,,,,
-800,-800,-800,-800,-800,-800,-800,-800,-800,-800,-800,-800,-800,-800,-800,-800,-800,-800,-800,-800,-800,-800,-800,-800,-800,-800,-800,-800,-800,-800,-800,-800,-800,,,,,,,,,,,,,,,,,,,,,,,,,,,,,,,,,,,,,,
-800,-800,-800,-800,-800,-800,-800,-800,-800,-800,-800,-800,-800,-800,-800,-800,-800,-800,-800,-800,-800,-800,-800,-800,-800,-800,-800,-800,-800,-800,-800,-800,-800,,,,,,,,,,,,,,,,,,,,,,,,,,,,,,,,,,,,,,
-800,-800,-800,-800,-800,-800,-800,-800,-800,-800,-800,-800,-800,-800,-800,-800,-800,-800,-800,-800,-800,-800,-800,-800,-800,-800,-800,-800,-800,-800,-800,-800,-800,,,,,,,,,,,,,,,,,,,,,,,,,,,,,,,,,,,,,,
-800,-800,-800,-800,-800,-800,-800,-800,-800,-800,-800,-800,-800,-800,-800,-800,-800,-800,-800,-800,-800,-800,-800,-800,-800,-800,-800,-800,-800,-800,-800,-800,-800,,,,,,,,,,,,,,,,,,,,,,,,,,,,,,,,,,,,,,
-800,-800,-800,-800,-800,-800,-800,-800,-800,-800,-800,-800,-800,-800,-800,-800,-800,-800,-800,-800,-800,-800,-800,-800,-800,-800,-800,-800,-800,-800,-800,-800,-800,,,,,,,,,,,,,,,,,,,,,,,,,,,,,,,,,,,,,,
-800,-800,-800,-800,-800,-800,-800,-800,-800,-800,-800,-800,-800,-800,-800,-800,-800,-800,-800,-800,-800,-800,-800,-800,-800,-800,-800,-800,-800,-800,-800,-800,-800,,,,,,,,,,,,,,,,,,,,,,,,,,,,,,,,,,,,,,
-800,-800,-800,-800,-800,-800,-800,-800,-800,-800,-800,-800,-800,-800,-800,-800,-800,-800,-800,-800,-800,-800,-800,-800,-800,-800,-800,-800,-800,-800,-800,-800,-800,,,,,,,,,,,,,,,,,,,,,,,,,,,,,,,,,,,,,,
-800,-800,-800,-800,-800,-800,-800,-800,-800,-800,-800,-800,-800,-800,-800,-800,-800,-800,-800,-800,-800,-800,-800,-800,-800,-800,-800,-800,-800,-800,-800,-800,-800,,,,,,,,,,,,,,,,,,,,,,,,,,,,,,,,,,,,,,
-800,-800,-800,-800,-800,-800,-800,-800,-800,-800,-800,-800,-800,-800,-800,-800,-800,-800,-800,-800,-800,-800,-800,-800,-800,-800,-800,-800,-800,-800,-800,-800,-800,,,,,,,,,,,,,,,,,,,,,,,,,,,,,,,,,,,,,,
-1200,-800,-800,-800,-800,-800,-800,-800,-800,-800,-800,-800,-800,-800,-800,-800,-800,-800,-800,-800,-800,-800,-800,-800,-800,-800,-800,-800,-800,-800,-800,-800,-1200,,,,,,,,,,,,,,,,,,,,,,,,,,,,,,,,,,,,,,
#,line_max,,,,,,,,,,,,,,,,,,,,,,,,,,,,,,,,,,,,,,,,,,,,,,,,,,,,,,,,,,,,,,,,,,,,,
8000,8000,8000,8000,8000,8000,8000,8000,8000,8000,8000,8000,8000,8000,8000,8000,8000,8000,8000,8000,8000,8000,8000,8000,8000,8000,8000,8000,8000,8000,8000,8000,8000,8000,8000,8000,8000,8000,8000,8000,8000,8000,8000,8000,8000,8000,8000,8000,8000,8000,8000,8000,8000,8000,8000,8000,8000,8000,8000,8000,8000,8000,8000,8000,8000,8000,8000,8000,8000,8000,8000
#,line_min,,,,,,,,,,,,,,,,,,,,,,,,,,,,,,,,,,,,,,,,,,,,,,,,,,,,,,,,,,,,,,,,,,,,,
300,300,300,300,300,300,300,300,300,300,300,300,300,300,300,300,300,300,300,300,300,300,300,300,300,300,300,300,300,300,300,300,300,300,300,300,300,300,300,300,300,300,300,300,300,300,300,300,300,300,300,300,300,300,300,300,300,300,300,300,300,300,300,300,300,300,300,300,300,300,300
