{
  "templateId": "local_frame_wm_yg",
  "categoryId": "honor_classic",
  "titleId": "frame_watermark",
  "templateDescId": "frame_wm_description",
  "templateType": 2,
  "baseOnValue": 6144,
  "borderHeight": 688,
  "isEditable": false,
  "status": "local",
  "order":4,
  "foregroundElements": [
    {
      "elementId": "device",
      "isGrouped": false,
      "groupId": -1,
      "order": 1,
      "elementType": "picture",
      "isEditable": false,
      "isEditableForPhoto": false,
      "uiDefaultValue": "on",
      "location": {
        "width": "wrap_content",
        "height": "416",
        "margin": [192, 0, 0, 136],
        "layout_gravity": "left|bottom"
      }
    },
    {
      "elementId": "yg",
      "isGrouped": true,
      "groupId": -1,
      "order": 2,
      "elementType": "picture",
      "isEditable": false,
      "isEditableForPhoto": false,
      "uiDefaultValue": "on",
      "values": [
        {
          "content": "/yg.png"
        }
      ],
      "location": {
        "width": "672",
        "height": "504",
        "margin": [0, 0, 188, 92],
        "layout_gravity": "right|bottom"
      }
    }
  ],
  "backgroundElements": [
    {
      "elementId": "white_bottom_border",
      "elementType": "type_solid_color",
      "order": 1,
      "isEnable": true,
      "location": {
      "width": "match_parent",
      "height": "688"
      },
      "paintAttr": {
        "color": "#FFFFFF",
        "alpha": 1
      }
    }
  ]
}
