{
	"type":"MagicGate",
	"subType":"generic",
	"params":[
		{
			"name":"is_use_llm",
			"type":"bool",
			"value":"true"
		},
		{
			"name":"magiccircle_is_support",
			"type":"bool",
			"value":"true"
		},
		{
			"name":"support_service_id",
			"type":"list",
			"value":"{\"support_service_id\":[\"101117798477987840\",\"101031071591694336\",\"101049298065555456\",\"101111127622025216\",\"101112903817494528\",\"101114155372642304\",\"101114675793494016\",\"101115098143129600\",\"101115564872695808\",\"101115891831275520\",\"155331788711919616\",\"155335126144778240\",\"155335971674521600\",\"155336664321884160\",\"172407045339742208\",\"202798100840972288\",\"134648511722422272\",\"101112438220390400\",\"157506742421291008\",\"157507548994338816\",\"157511633617289216\",\"165896372078247936\",\"101117018442301440\",\"101117373464969216\",\"155338080738344960\",\"149631417242877952\",\"149632118392094720\",\"149642236353576960\",\"101050385677942784\",\"143023237855444992\",\"143025412539154432\",\"155338857175318528\",\"155339648359464960\",\"157517061998772224\",\"157547964389130240\",\"172406328126341120\",\"192303665699094528\",\"110127687460192256\",\"161950317611581440\",\"112301085388963840\",\"80316A39-70B7-7CA5-493E-286A73790195\",\"165897198062534656\",\"192304943758049280\",\"101111965153230848\",\"124524892442853376\",\"143024122295746560\",\"143024753425252352\",\"121352656236052480\",\"134645158271516672\",\"134646028472156160\",\"134647406766587904\",\"165573847137910784\",\"165575087599124480\",\"165576461602783232\",\"165929730455896064\",\"165931057508515840\",\"165931677422452736\",\"165576974331281408\",\"165578171213676544\",\"165586539974230016\",\"165595869922459648\",\"165596489140142080\",\"165598104777654272\",\"166289588229242880\",\"165929171216760832\",\"165598797366296576\",\"165599528114716672\",\"165600057674956800\",\"165600581749047296\",\"165601941747924992\",\"165632518505103360\",\"169548872459223040\",\"165633101718880256\",\"165921698992881664\",\"165924203701207040\",\"169549938542247936\",\"165925003815026688\",\"165925827039461376\",\"165926402061762560\",\"187301817548275712\",\"169556267705040896\",\"165927955577438208\",\"165928504934793216\",\"166290633860841472\",\"166292097236729856\",\"204592100317069312\",\"117419941761646592\",\"166292951436099584\",\"165914099555762176\",\"165914621113270272\",\"169559832469176320\",\"169560936456126464\",\"200768204564332544\",\"201474278535725056\",\"202146070665363456\",\"202146737052188672\",\"202147629004488704\",\"202148153628033024\",\"202148883151716352\",\"202149613895942144\",\"202150073889456128\",\"202150818919481344\",\"220615600769073152\",\"220567873267957760\",\"238443802228948992\",\"238442293915287552\",\"238457395976601600\",\"238458078763155456\",\"204593303969071104\",\"238438418382585856\",\"240562925645856768\",\"222720378672250880\",\"222723596395479040\",\"222722557445406720\",\"226057743763505152\",\"237321902018789376\",\"226690282970677248\",\"226691081410969600\",\"246027343095660544\",\"241586102580805632\",\"242035957426028544\",\"242356840736751616\",\"242040629280899072\",\"242039214626045952\",\"242026887725973504\"]}"
		},
		{
			"name":"magicgate_is_support",
			"type":"bool",
			"value":"true"
		}
	],
	"compatibleversion":"1"
}