[
  {
    "componentNameCn": "QQ浏览器插件",
    "componentNameEn": "QQ Browser Plugin",
    "icon": "",
    "componentType": "0",
    "componentName": "multiformatplugin",
    "abilities": [
      {
        "abilityType": "2",
        "type": "1",
        "className": "com.hihonor.plugin.multiformatplugin.view.PreviewActivity",
        "suffixes": "caj,dwg,dxf,dwf,xmind,epub",
        "description": "预览文件能力",
        "priority": "100,100,100,100,100,100"
      }
    ]
  },
  {
    "componentNameCn": "文档处理服务",
    "componentNameEn": "Document Service",
    "icon": "",
    "componentType": "1",
    "componentName": "com.hihonor.hnoffice",
    "abilities": [
      {
        "abilityType": "2",
        "type": "1",
        "className": "com.yozo.DispatchActivity",
        "suffixes": "pdf,doc,docx,dot,wps,wpt,dotx,docm,dotm,rtf,xls,xlsx,csv,et,ett,xlt,xltx,xlsm,ppt,pptx,pot,potx,pps,ppsx,dps,dpt,pptm,potm,ppsm,txt,log,lrc,c,cpp,h,asm,s,java,asp,bat,bas,prg,cmd",
        "description": "预览文件能力",
        "priority": "100"
      },
      {
        "abilityType": "3",
        "type": "1",
        "className": "com.yozo.DispatchActivity",
        "methods": "CREATE_WP,CREATE_SS,CREATE_PG,CREATE_PDF",
        "description": "新建文件能力",
        "priority": "100"
      },
      {
        "abilityType": "4",
        "type": "2",
        "className": "com.yozo.office.file.converter.FileTransformService",
        "methods": "transformHtml,materialsToFile,exportPdf",
        "description": "格式转换能力",
        "priority": "100"
      },
      {
        "abilityType": "7",
        "type": "1",
        "className": "com.yozo.DispatchActivity",
        "methods": "PDF_SPLIT,PDF_MERGE,PDF_2WP,PDF_CONVERT",
        "description": "PDF处理能力",
        "priority": "100"
      }
    ]
  }
]