﻿{
    "order": 6,
    "lockScreenInfo": {
        "templateId": "06_lucky_number",
        "templateName": [
            {
                "region": "zh-rCN",
                "name": "幸运数字"
            },
            {
                "region": "en",
                "name": "Lucky number"
            }
        ],
        "thumbnailSrc": "06_preview_lockscreen.png",
        "originSrc": "06_origin.png",
        "cropSrc": "06_crop.png",
        "decorateType": 1,
        "isDepthOfFieldSupported": true,
        "isDepthOfFieldOpened": true,
        "jointPosition": [
            0.5,
            0.025,
            0.5,
            0.025
        ],
        "jointPositionExpand": [
            0.488,
            0.227,
            0.488,
            0.227
        ],
        "frameRectangle": [
            0.024,
            0.272,
            0.976,
            0.91
        ],
        "frameRectangleExpand": [
            0.178,
            0.276,
            0.781,
            0.91
        ],
        "layers": [
            {
                "id": "layer_origin",
                "type": 0,
                "src": "06_origin.png"
            },
            {
                "id": "layer_res1",
                "type": 2,
                "src": "06_res2_1.png",
                "srcExpand": "06_res2_1_expand.png",
                "colorPolicy": 3,
                "color": "#FFC2DAF2",
                "gradientColor": "#FFCAC2F2"
            },
            {
                "id": "layer_timer",
                "type": 3,
                "layout": 0,
                "font": "HonorDigits_ItalicVF.ttf",
                "colorPolicy": 4,
                "color": "#FF4D60BF"
            },
            {
                "id": "layer_crop",
                "type": 4,
                "src": "06_crop.png"
            },
            {
                "id": "layer_res2",
                "type": 2,
                "src": "06_res2_2.png",
                "srcExpand": "06_res2_2_expand.png",
                "colorPolicy": 3,
                "color": "#FFC2DAF2",
                "gradientColor": "#FFCAC2F2"
            }
        ],
        "styles": [
            "人物",
            "宠物",
            "植物",
            "艺术"
        ],
        "decorateReses": [
            {
                "id": "res1",
                "src": "06_res0.png",
                "jointPosition": [
                    0.5,
                    0.025,
                    0.5,
                    0.025
                ],
                "jointPositionExpand": [
                    0.488,
                    0.227,
                    0.488,
                    0.227
                ],
                "resLayerMappings": {
                    "layer_res1": "06_res0_1.png",
                    "layer_res1_expand": "06_res0_1_expand.png",
                    "layer_res2": "06_res0_2.png",
                    "layer_res2_expand": "06_res0_2_expand.png"
                }
            },
            {
                "id": "res2",
                "src": "06_res1.png",
                "jointPosition": [
                    0.4,
                    0.041,
                    0.4,
                    0.041
                ],
                "jointPositionExpand": [
                    0.409,
                    0.189,
                    0.409,
                    0.27
                ],
                "resLayerMappings": {
                    "layer_res1": "06_res1_1.png",
                    "layer_res1_expand": "06_res1_1_expand.png",
                    "layer_res2": "06_res1_2.png",
                    "layer_res2_expand": "06_res1_2_expand.png"
                }
            },
            {
                "id": "res3",
                "src": "06_res2.png",
                "jointPosition": [
                    0.5,
                    0.025,
                    0.5,
                    0.025
                ],
                "jointPositionExpand": [
                    0.488,
                    0.227,
                    0.488,
                    0.227
                ],
                "resLayerMappings": {
                    "layer_res1": "06_res2_1.png",
                    "layer_res1_expand": "06_res2_1_expand.png",
                    "layer_res2": "06_res2_2.png",
                    "layer_res2_expand": "06_res2_2_expand.png"
                }
            },
            {
                "id": "res4",
                "src": "06_res3.png",
                "jointPosition": [
                    0.515,
                    0.025,
                    0.515,
                    0.025
                ],
                "jointPositionExpand": [
                    0.488,
                    0.227,
                    0.488,
                    0.227
                ],
                "resLayerMappings": {
                    "layer_res1": "06_res3_1.png",
                    "layer_res1_expand": "06_res3_1_expand.png",
                    "layer_res2": "06_res3_2.png",
                    "layer_res2_expand": "06_res3_2_expand.png"
                }
            },
            {
                "id": "res5",
                "src": "06_res4.png",
                "jointPosition": [
                    0.525,
                    0.2,
                    0.425,
                    0.025
                ],
                "jointPositionExpand": [
                    0.579,
                    0.246,
                    0.451,
                    0.267
                ],
                "resLayerMappings": {
                    "layer_res1": "06_res4_1.png",
                    "layer_res1_expand": "06_res4_1_expand.png",
                    "layer_res2": "06_res4_2.png",
                    "layer_res2_expand": "06_res4_2_expand.png"
                }
            },
            {
                "id": "res6",
                "src": "06_res5.png",
                "jointPosition": [
                    0.395,
                    0.025,
                    0.395,
                    0.025
                ],
                "jointPositionExpand": [
                    0.411,
                    0.229,
                    0.411,
                    0.229
                ],
                "resLayerMappings": {
                    "layer_res1": "06_res5_1.png",
                    "layer_res1_expand": "06_res5_1_expand.png",
                    "layer_res2": "06_res5_2.png",
                    "layer_res2_expand": "06_res5_2_expand.png"
                }
            },
            {
                "id": "res7",
                "src": "06_res6.png",
                "jointPosition": [
                    0.495,
                    0.025,
                    0.495,
                    0.025
                ],
                "jointPositionExpand": [
                    0.488,
                    0.227,
                    0.488,
                    0.227
                ],
                "resLayerMappings": {
                    "layer_res1": "06_res6_1.png",
                    "layer_res1_expand": "06_res6_1_expand.png",
                    "layer_res2": "06_res6_2.png",
                    "layer_res2_expand": "06_res6_2_expand.png"
                }
            },
            {
                "id": "res8",
                "src": "06_res7.png",
                "jointPosition": [
                    0.4,
                    0.033,
                    0.4,
                    0.033
                ],
                "jointPositionExpand": [
                    0.411,
                    0.229,
                    0.411,
                    0.229
                ],
                "resLayerMappings": {
                    "layer_res1": "06_res7_1.png",
                    "layer_res1_expand": "06_res7_1_expand.png",
                    "layer_res2": "06_res7_2.png",
                    "layer_res2_expand": "06_res7_2_expand.png"
                }
            },
            {
                "id": "res9",
                "src": "06_res8.png",
                "jointPosition": [
                    0.495,
                    0.025,
                    0.495,
                    0.025
                ],
                "jointPositionExpand": [
                    0.488,
                    0.227,
                    0.488,
                    0.227
                ],
                "resLayerMappings": {
                    "layer_res1": "06_res8_1.png",
                    "layer_res1_expand": "06_res8_1_expand.png",
                    "layer_res2": "06_res8_2.png",
                    "layer_res2_expand": "06_res8_2_expand.png"
                }
            },
            {
                "id": "res10",
                "src": "06_res9.png",
                "jointPosition": [
                    0.495,
                    0.025,
                    0.495,
                    0.025
                ],
                "jointPositionExpand": [
                    0.488,
                    0.227,
                    0.488,
                    0.227
                ],
                "resLayerMappings": {
                    "layer_res1": "06_res9_1.png",
                    "layer_res1_expand": "06_res9_1_expand.png",
                    "layer_res2": "06_res9_2.png",
                    "layer_res2_expand": "06_res9_2_expand.png"
                }
            }
        ],
        "decorateColors": [
            {
                "mainColor": "#FFC2DAF2",
                "gradientColor": "#FFCAC2F2",
                "timerColor": "#FF4D60BF"
            },
            {
                "mainColor": "#FFF2C8B6",
                "gradientColor": "#FFF2B6C7",
                "timerColor": "#FFB3443E"
            },
            {
                "mainColor": "#FFF2D4B6",
                "gradientColor": "#FFF2B6B6",
                "timerColor": "#FFBF6030"
            },
            {
                "mainColor": "#FFF2E3B6",
                "gradientColor": "#FFF2CFB6",
                "timerColor": "#FFCC751F"
            },
            {
                "mainColor": "#FFF2F2B6",
                "gradientColor": "#FFF2DEB6",
                "timerColor": "#FFBF891D"
            },
            {
                "mainColor": "#FFD4F2AA",
                "gradientColor": "#FFF2F2B6",
                "timerColor": "#FF648013"
            },
            {
                "mainColor": "#FFBBE6B8",
                "gradientColor": "#FFD7E6AC",
                "timerColor": "#FF408013"
            },
            {
                "mainColor": "#FFB8E6B8",
                "gradientColor": "#FFB8E6D2",
                "timerColor": "#FF19803C"
            },
            {
                "mainColor": "#FFB8E6CB",
                "gradientColor": "#FFB8E2E6",
                "timerColor": "#FF198066"
            },
            {
                "mainColor": "#FFB8E6E2",
                "gradientColor": "#FFB6CFF2",
                "timerColor": "#FF267C99"
            },
            {
                "mainColor": "#FFC2E6F2",
                "gradientColor": "#FFC2C6F2",
                "timerColor": "#FF3E6FB3"
            },
            {
                "mainColor": "#FFC2CEF2",
                "gradientColor": "#FFD6C2F2",
                "timerColor": "#FF564DBF"
            },
            {
                "mainColor": "#FFC2C2F2",
                "gradientColor": "#FFE2C2F2",
                "timerColor": "#FF653EB3"
            },
            {
                "mainColor": "#FFD2C2F2",
                "gradientColor": "#FFEEC2F2",
                "timerColor": "#FF823EB3"
            },
            {
                "mainColor": "#FFE2C2F2",
                "gradientColor": "#FFF2C2DA",
                "timerColor": "#FFA64BA6"
            },
            {
                "mainColor": "#FFF2C2E8",
                "gradientColor": "#FFF2C2C7",
                "timerColor": "#FFA64B74"
            },
            {
                "mainColor": "#FFD9CEAD",
                "gradientColor": "#FFB3A374",
                "timerColor": "#FF73623F",
                "colorMatchType": 1
            },
            {
                "mainColor": "#FF2E2F33",
                "gradientColor": "#FFADAEB3",
                "timerColor": "#FFF0F0F2",
                "colorMatchType": 2
            }
        ]
    },
    "desktopInfo": {
        "templateId": "06_lucky_number",
        "groupImageRes": {
            "src": "06_origin.png"
        }
    }
}