﻿{
  "type": "happy",
  "duration": 15000,
  "name": "Visited",
  "id": "Happy_15_2",
  "separationStep": 1640,
  "separationMinDuration": 4000,
  "separationMaxDuration": 8000,
  "transitions": [
    {
      "name": "叠化",
      "priority": 10,
      "pickCondition": -1,
      "horizon": true,
      "vertical": true
    },
    {
      "name": "模糊",
      "priority": 0,
      "pickCondition": -1,
      "horizon": true,
      "vertical": true
    },
    {
      "name": "融化",
      "priority": 0,
      "pickCondition": -1,
      "horizon": true,
      "vertical": true
    },
    {
      "name": "上移",
      "priority": 0,
      "pickCondition": -1,
      "horizon": true,
      "vertical": true
    },
    {
      "name": "下移",
      "priority": 0,
      "pickCondition": -1,
      "horizon": true,
      "vertical": true
    },
    {
      "name": "左移",
      "priority": 70,
      "pickCondition": -1,
      "horizon": true,
      "vertical": true
    },
    {
      "name": "右移",
      "priority": 70,
      "pickCondition": -1,
      "horizon": true,
      "vertical": true
    },
    {
      "name": "黑场",
      "priority": 50,
      "pickCondition": -1,
      "horizon": true,
      "vertical": true
    },
    {
      "name": "白场",
      "priority": 30,
      "pickCondition": -1,
      "horizon": true,
      "vertical": true
    },
    {
      "name": "放大",
      "priority": 90,
      "pickCondition": -1,
      "horizon": true,
      "vertical": true
    },
    {
      "name": "缩小",
      "priority": 90,
      "pickCondition": 12,
      "horizon": true,
      "vertical": true
    },
    {
      "name": "旋转",
      "priority": 90,
      "pickCondition": -1,
      "horizon": true,
      "vertical": true
    }
  ],
  "transitionMaxCount": 3,
  "filterId": "filter_res_15",
  "filterStrength": 0.3,
  "sticker": {
    "id": "happy_time",
    "scaleHorizon": 0.45,
    "scaleVertical": 0.8,
    "locationHorizonX": 0,
    "locationHorizonY": -0.7,
    "locationVerticalX": 0,
    "locationVerticalY": -0.48,
    "beginTime": 1
  },
  "borderId": "",
  "specialEffect": [
    {
      "effectId": "golden",
      "effectStart": 0
    },
    {
      "effectId": "particle_heart",
      "effectStart": -1
    },
    {
      "effectId": "sun_halo",
      "effectStart": -1
    }
  ],
  "tail": "honor_vlog"
}