{
	"你好悠悠":{
		"bg_words":[
		"你爽灎太但",
		"你爽疤太但",
		"你齃砗蹭我",
		"你齃疽蹭我",
		"你跟进口龙",
		"你球鞋蟀虐",
		"你球鞋虑虐",
		"你而非纸禾",
		"你爩亚渣",
		"你瞰一下吧",
		"你冹消息就郝也",
		"你加也岢以",
		"你羽音唤醒维测",
		"你郝虐后齃",
		"你敺霢大米吧",
		"你津例科激普",
		"你潺业殴普",
		"你路可荐氛",
		"你裹卡外逆可",
		"你朴牖忝瓦",
		"你轡笨猫他",
		"你叻莱寇卡",
		"你璟鷇令咖",
		"你本嚄感濊",
		"你軚贃区钠",
		"你笨命輦他",
		"你颇或翔嗰",
		"你勒牖任玛",
		"你钸教话沸",
		"你轡宥太阳",
		"你黑化沽粉",
		"你面朴俊奎",
		"你槌仁提义",
		"你俊命寿畅嗰",
		"你搜平为玛",
		"你面拿来比",
		"你链嗬工化",
		"你乐扣莱卡"
		],
		"bg_words_stand":[
		"你爽灎太但",
		"你爽疤太但",
		"你齃砗蹭我",
		"你齃疽蹭我",
		"你跟进口龙",
		"你球鞋蟀虐",
		"你球鞋虑虐",
		"你而非纸禾",
		"你爩亚渣",
		"你瞰一下吧",
		"你冹消息就郝也",
		"你加也岢以",
		"你羽音唤醒维测",
		"你郝虐后齃",
		"你敺霢大米吧",
		"你津例科激普",
		"你潺业殴普",
		"你路可荐氛",
		"你裹卡外逆可",
		"你朴牖忝瓦",
		"你轡笨猫他",
		"你叻莱寇卡",
		"你璟鷇令咖",
		"你本嚄感濊",
		"你軚贃区钠",
		"你笨命輦他",
		"你颇或翔嗰",
		"你勒牖任玛",
		"你钸教话沸",
		"你轡宥太阳",
		"你黑化沽粉",
		"你面朴俊奎",
		"你槌仁提义",
		"你俊命寿畅嗰",
		"你搜平为玛",
		"你面拿来比",
		"你链嗬工化",
		"你乐扣莱卡"
		]
		}
}