﻿{
  "type": "happy",
  "duration": 15000,
  "name": "HappyMoment-15",
  "id": "Happy_15_1",
  "separationStep": 1190,
  "separationMinDuration": 4000,
  "separationMaxDuration": 8000,
  "transitions": [
    {
      "name": "叠化",
      "priority": 30,
      "pickCondition": -1,
      "horizon": true,
      "vertical": true
    },
    {
      "name": "模糊",
      "priority": 0,
      "pickCondition": -1,
      "horizon": true,
      "vertical": true
    },
    {
      "name": "融化",
      "priority": 0,
      "pickCondition": -1,
      "horizon": true,
      "vertical": true
    },
    {
      "name": "上移",
      "priority": 70,
      "pickCondition": -1,
      "horizon": true,
      "vertical": true
    },
    {
      "name": "下移",
      "priority": 70,
      "pickCondition": -1,
      "horizon": true,
      "vertical": true
    },
    {
      "name": "左移",
      "priority": 70,
      "pickCondition": -1,
      "horizon": true,
      "vertical": true
    },
    {
      "name": "右移",
      "priority": 70,
      "pickCondition": -1,
      "horizon": true,
      "vertical": true
    },
    {
      "name": "黑场",
      "priority": 50,
      "pickCondition": -1,
      "horizon": true,
      "vertical": true
    },
    {
      "name": "白场",
      "priority": 30,
      "pickCondition": -1,
      "horizon": true,
      "vertical": true
    },
    {
      "name": "放大",
      "priority": 90,
      "pickCondition": 1,
      "horizon": true,
      "vertical": true
    },
    {
      "name": "缩小",
      "priority": 90,
      "pickCondition": 2,
      "horizon": true,
      "vertical": true
    },
    {
      "name": "旋转",
      "priority": 90,
      "pickCondition": -1,
      "horizon": true,
      "vertical": true
    }
  ],
  "transitionMaxCount": 3,
  "filterId": "filter_res_14",
  "filterStrength": 0.4,
  "sticker": {
    "id": "so_nice",
    "scaleHorizon": 0.4,
    "scaleVertical": 0.8,
    "locationHorizonX": 0,
    "locationHorizonY": -0.8,
    "locationVerticalX": 0,
    "locationVerticalY": -0.40,
    "beginTime": 1
  },
  "borderId": "plant1",
  "specialEffect": [
    {
      "effectId": "ribbon",
      "effectStart": 0
    },
    {
      "effectId": "bubbles",
      "effectStart": -1
    },
    {
      "effectId": "particle_heart",
      "effectStart": -1
    }
  ],
  "tail": "honor_vlog"
}