{
    "imports" : [
        "/system_ext/lib64/libhwfilter_qcom.so"
    ],

    "filters" :
    [
        {
            "id" : "ppsource",
            "type" : "ppsource"
        },

        {
            "id" : "encoder",
            "type" : "qcom_filter_jpeg"
        },

        {
            "id" : "writer",
            "type" : "filewriter"
        },

        {
            "id" : "thumbnail",
            "type" : "quickthumbnail"
        },

        {
            "id" : "notifier",
            "type" : "thumbnail-notifier"
        },

        {
            "id" : "peek",
            "type" : "peek"
        },

        {
            "id" : "peekMeta",
            "type" : "peek"
        }
    ],

    "connections" :
    [
        {
            "from" :
            {
                "filter" : "ppsource",
                "port" : "out0"
            },

            "to" :
            {
                "filter" : "peek",
                "port" : "in"
            }
        },

        {
            "from" :
            {
                "filter" : "peek",
                "port" : "out"
            },

            "to" :
            {
                "filter" : "encoder",
                "port" : "inMain"
            }
        },

        {
            "from" :
            {
                "filter" : "encoder",
                "port" : "jpeg"
            },

            "to" :
            {
                "filter" : "writer",
                "port" : "in"
            }
        },

        {
            "from" :
            {
                "filter" : "peek",
                "port" : "peek0"
            },

            "to" :
            {
                "filter" : "thumbnail",
                "port" : "inMain"
            }
        },

        {
            "from" :
            {
                "filter" : "thumbnail",
                "port" : "outThumbnail"
            },

            "to" :
            {
                "filter" : "notifier",
                "port" : "in"
            }
        },

        {
            "from" :
            {
                "filter" : "ppsource",
                "port" : "out_meta"
            },

            "to" :
            {
                "filter" : "peekMeta",
                "port" : "in"
            }
        },

        {
            "from" :
            {
                "filter" : "peekMeta",
                "port" : "out"
            },

            "to" :
            {
                "filter" : "encoder",
                "port" : "inMeta"
            }
        },

        {
            "from" :
            {
                "filter" : "peekMeta",
                "port" : "peek0"
            },

            "to" :
            {
                "filter" : "thumbnail",
                "port" : "inMeta"
            }
        }
    ]
}

